{"text_format":"3","workbook":"xlsx","n_sheets":26,"sheets":["Vstup","Vysledky-doplneni","List3","SkS-1","SkS-2","SkS-3","SkS-4","SkS-5","SkS-6","SkS-7","SkS-8","SkS-16","SkS-17","SkS-18","SkS-19","SkS-20","SkS-9","SkS-10","SkS-11","SkS-12","SkS-13","SkS-14","SkS-15","VList-CS160","ASAT","Data"],"not_rendered":{"macros":1,"defined_names":2},"read":"whole","date_system":"1900"}

{"sheet":"Vstup","index":0,"n_rows":128,"n_cols":7,"rows_kept":128,"merged":[[0,0,0,4],[1,0,2,1],[1,2,1,5],[2,2,2,5],[3,0,3,1],[3,2,3,5],[4,0,4,1],[4,2,4,5],[6,0,7,0],[6,1,7,1],[6,2,7,2],[6,3,6,4],[8,0,13,0],[14,0,19,0],[20,0,25,0],[26,0,31,0],[32,0,37,0],[38,0,43,0],[44,0,49,0],[50,0,55,0],[56,0,61,0],[62,0,67,0],[68,0,73,0],[74,0,79,0],[80,0,85,0],[86,0,91,0],[92,0,97,0],[98,0,103,0],[104,0,109,0],[110,0,115,0],[116,0,121,0],[122,0,127,0]]}
["STARTOVNÍ LISTINA"]
["Název závodu :",null,"COMPAK SPORTING SPECIÁL"]
[null,null,"160 terčů"]
["Druh závodu :",null,"COMPAK SPORTING"]
["Datum konání :",null,"3.6.2012"]
[]
["Skupina číslo","Start. číslo","Příjmení, jméno","Kategorie"]
[{"$nulls":3},"ASAT","Ručně",null,{"$f":"\"Počet střelců : \"&Data!C14","v":"Počet střelců : 38"}]
[1,1,"Dolanský Jan","C"]
[null,2,"Koloc Martin","B"]
[null,3,"Greš Marek",{"$f":"IF(E11<>\"\",E11,VLOOKUP(C11,ASAT!$A$4:$B$500,2,0))","v":"C"}]
[null,4,"Hoštička Eduard",{"$f":"IF(E12<>\"\",E12,VLOOKUP(C12,ASAT!$A$4:$B$500,2,0))","v":"C"}]
[null,5,"Černošek Milan",{"$f":"IF(E13<>\"\",E13,VLOOKUP(C13,ASAT!$A$4:$B$500,2,0))","v":"A"}]
[null,6,"Vadlejch Josef",{"$f":"IF(E14<>\"\",E14,VLOOKUP(C14,ASAT!$A$4:$B$500,2,0))","v":"V"}]
[2,7,"Otáhal Milan ","V"]
[null,8,"Zigo Martin ",{"$f":"IF(E16<>\"\",E16,VLOOKUP(C16,ASAT!$A$4:$B$500,2,0))","v":"A"},"A"]
[null,9,"Uher Jaromír",{"$f":"IF(E17<>\"\",E17,VLOOKUP(C17,ASAT!$A$4:$B$500,2,0))","v":"V"}]
[null,10,"Mikulka Peter",{"$f":"IF(E18<>\"\",E18,VLOOKUP(C18,ASAT!$A$4:$B$500,2,0))","v":"C"}]
[null,11,"Hedvik Jaromír",{"$f":"IF(E19<>\"\",E19,VLOOKUP(C19,ASAT!$A$4:$B$500,2,0))","v":"C"}]
[null,12,"Jankovský Jakub ",{"$f":"IF(E20<>\"\",E20,VLOOKUP(C20,ASAT!$A$4:$B$500,2,0))","v":"J"},"J"]
[3,13,"Husar Vladimír ",{"$f":"IF(E21<>\"\",E21,VLOOKUP(C21,ASAT!$A$4:$B$500,2,0))","v":"B"},"B"]
[null,14,"Zázvorka Pavel",{"$f":"IF(E22<>\"\",E22,VLOOKUP(C22,ASAT!$A$4:$B$500,2,0))","v":"A"}]
[null,15,"Štengl Jiří",{"$f":"IF(E23<>\"\",E23,VLOOKUP(C23,ASAT!$A$4:$B$500,2,0))","v":"A"}]
[null,16,"Korál Petr",{"$f":"IF(E24<>\"\",E24,VLOOKUP(C24,ASAT!$A$4:$B$500,2,0))","v":"C"}]
[null,17,"Divíšek Martin",{"$f":"IF(E25<>\"\",E25,VLOOKUP(C25,ASAT!$A$4:$B$500,2,0))","v":"A"}]
[null,18,"Divíšek Martin ml.",{"$f":"IF(E26<>\"\",E26,VLOOKUP(C26,ASAT!$A$4:$B$500,2,0))","v":"J"}]
[4,19,"Jirků Milan ",{"$f":"IF(E27<>\"\",E27,VLOOKUP(C27,ASAT!$A$4:$B$500,2,0))","v":"C"},"C"]
[null,20,"Kotrc Karel",{"$f":"IF(E28<>\"\",E28,VLOOKUP(C28,ASAT!$A$4:$B$500,2,0))","v":"A"}]
[null,21,"Říha Milan ",{"$f":"IF(E29<>\"\",E29,VLOOKUP(C29,ASAT!$A$4:$B$500,2,0))","v":"V"},"V"]
[null,22,"Mrázek Lubomír",{"$f":"IF(E30<>\"\",E30,VLOOKUP(C30,ASAT!$A$4:$B$500,2,0))","v":"C"},"C"]
[null,23,"Hřebec Jan ml.",{"$f":"IF(E31<>\"\",E31,VLOOKUP(C31,ASAT!$A$4:$B$500,2,0))","v":"J"}]
[null,24,"Hřebec Jan ",{"$f":"IF(E32<>\"\",E32,VLOOKUP(C32,ASAT!$A$4:$B$500,2,0))","v":"A"},"A"]
[5,25,"Lengyel Ivan",{"$f":"IF(E33<>\"\",E33,VLOOKUP(C33,ASAT!$A$4:$B$500,2,0))","v":"B"}]
[null,26,"Lengyel Jan ",{"$f":"IF(E34<>\"\",E34,VLOOKUP(C34,ASAT!$A$4:$B$500,2,0))","v":"B"},"B"]
[null,27,"Lengyel Jiří",{"$f":"IF(E35<>\"\",E35,VLOOKUP(C35,ASAT!$A$4:$B$500,2,0))","v":"B"}]
[null,28,"Jelínek Jiří",{"$f":"IF(E36<>\"\",E36,VLOOKUP(C36,ASAT!$A$4:$B$500,2,0))","v":"V"}]
[null,29,"Horák František",{"$f":"IF(E37<>\"\",E37,VLOOKUP(C37,ASAT!$A$4:$B$500,2,0))","v":"C"}]
[null,30,"Kubík Jindřich",{"$f":"IF(E38<>\"\",E38,VLOOKUP(C38,ASAT!$A$4:$B$500,2,0))","v":"V"}]
[6,31,"Neuvirt Martin","B"]
[null,32,"Neuvirt Václav",{"$f":"IF(E40<>\"\",E40,VLOOKUP(C40,ASAT!$A$4:$B$500,2,0))","v":"V"},"V"]
[null,33,"Štícha Lubomír",{"$f":"IF(E41<>\"\",E41,VLOOKUP(C41,ASAT!$A$4:$B$500,2,0))","v":"B"}]
[null,34,"Vavrečka Michal",{"$f":"IF(E42<>\"\",E42,VLOOKUP(C42,ASAT!$A$4:$B$500,2,0))","v":"C"}]
[null,35,"Jelínek Aleš",{"$f":"IF(E43<>\"\",E43,VLOOKUP(C43,ASAT!$A$4:$B$500,2,0))","v":"C"},"C"]
[null,36,null,{"$f":"IF(E44<>\"\",E44,VLOOKUP(C44,ASAT!$A$4:$B$500,2,0))","v":{"$error":"#N/A"}}]
[7,37,"Wlodarczyk Remigiusz",{"$f":"IF(E45<>\"\",E45,VLOOKUP(C45,ASAT!$A$4:$B$500,2,0))","v":"A"},"A"]
[null,38,"Jedros Witold",{"$f":"IF(E46<>\"\",E46,VLOOKUP(C46,ASAT!$A$4:$B$500,2,0))","v":"C"},"C"]
[null,39,"Cieplik Waldemar",{"$f":"IF(E47<>\"\",E47,VLOOKUP(C47,ASAT!$A$4:$B$500,2,0))","v":"C"},"C"]
[null,40,null,{"$f":"IF(E48<>\"\",E48,VLOOKUP(C48,ASAT!$A$4:$B$500,2,0))","v":{"$error":"#N/A"}}]
[null,41,null,{"$f":"IF(E49<>\"\",E49,VLOOKUP(C49,ASAT!$A$4:$B$500,2,0))","v":{"$error":"#N/A"}}]
[null,42,null,{"$f":"IF(E50<>\"\",E50,VLOOKUP(C50,ASAT!$A$4:$B$500,2,0))","v":{"$error":"#N/A"}}]
[8,43,null,{"$f":"IF(E51<>\"\",E51,VLOOKUP(C51,ASAT!$A$4:$B$500,2,0))","v":{"$error":"#N/A"}}]
[null,44,null,{"$f":"IF(E52<>\"\",E52,VLOOKUP(C52,ASAT!$A$4:$B$500,2,0))","v":{"$error":"#N/A"}}]
[null,45,null,{"$f":"IF(E53<>\"\",E53,VLOOKUP(C53,ASAT!$A$4:$B$500,2,0))","v":{"$error":"#N/A"}}]
[null,46,null,{"$f":"IF(E54<>\"\",E54,VLOOKUP(C54,ASAT!$A$4:$B$500,2,0))","v":{"$error":"#N/A"}}]
[null,47,null,{"$f":"IF(E55<>\"\",E55,VLOOKUP(C55,ASAT!$A$4:$B$500,2,0))","v":{"$error":"#N/A"}}]
[null,48,null,{"$f":"IF(E56<>\"\",E56,VLOOKUP(C56,ASAT!$A$4:$B$500,2,0))","v":{"$error":"#N/A"}}]
[9,49,null,{"$f":"IF(E57<>\"\",E57,VLOOKUP(C57,ASAT!$A$4:$B$500,2,0))","v":{"$error":"#N/A"}}]
[null,50,null,{"$f":"IF(E58<>\"\",E58,VLOOKUP(C58,ASAT!$A$4:$B$500,2,0))","v":{"$error":"#N/A"}}]
[null,51,null,{"$f":"IF(E59<>\"\",E59,VLOOKUP(C59,ASAT!$A$4:$B$500,2,0))","v":{"$error":"#N/A"}}]
[null,52,null,{"$f":"IF(E60<>\"\",E60,VLOOKUP(C60,ASAT!$A$4:$B$500,2,0))","v":{"$error":"#N/A"}}]
[null,53,null,{"$f":"IF(E61<>\"\",E61,VLOOKUP(C61,ASAT!$A$4:$B$500,2,0))","v":{"$error":"#N/A"}}]
[null,54,null,{"$f":"IF(E62<>\"\",E62,VLOOKUP(C62,ASAT!$A$4:$B$500,2,0))","v":{"$error":"#N/A"}}]
[10,55,null,{"$f":"IF(E63<>\"\",E63,VLOOKUP(C63,ASAT!$A$4:$B$500,2,0))","v":{"$error":"#N/A"}}]
[null,56,null,{"$f":"IF(E64<>\"\",E64,VLOOKUP(C64,ASAT!$A$4:$B$500,2,0))","v":{"$error":"#N/A"}}]
[null,57,null,{"$f":"IF(E65<>\"\",E65,VLOOKUP(C65,ASAT!$A$4:$B$500,2,0))","v":{"$error":"#N/A"}}]
[null,58,null,{"$f":"IF(E66<>\"\",E66,VLOOKUP(C66,ASAT!$A$4:$B$500,2,0))","v":{"$error":"#N/A"}}]
[null,59,null,{"$f":"IF(E67<>\"\",E67,VLOOKUP(C67,ASAT!$A$4:$B$500,2,0))","v":{"$error":"#N/A"}}]
[null,60,null,{"$f":"IF(E68<>\"\",E68,VLOOKUP(C68,ASAT!$A$4:$B$500,2,0))","v":{"$error":"#N/A"}}]
[11,61,null,{"$f":"IF(E69<>\"\",E69,VLOOKUP(C69,ASAT!$A$4:$B$500,2,0))","v":{"$error":"#N/A"}}]
[null,62,null,{"$f":"IF(E70<>\"\",E70,VLOOKUP(C70,ASAT!$A$4:$B$500,2,0))","v":{"$error":"#N/A"}}]
[null,63,null,{"$f":"IF(E71<>\"\",E71,VLOOKUP(C71,ASAT!$A$4:$B$500,2,0))","v":{"$error":"#N/A"}}]
[null,64,null,{"$f":"IF(E72<>\"\",E72,VLOOKUP(C72,ASAT!$A$4:$B$500,2,0))","v":{"$error":"#N/A"}}]
[null,65,null,{"$f":"IF(E73<>\"\",E73,VLOOKUP(C73,ASAT!$A$4:$B$500,2,0))","v":{"$error":"#N/A"}}]
[null,66,null,{"$f":"IF(E74<>\"\",E74,VLOOKUP(C74,ASAT!$A$4:$B$500,2,0))","v":{"$error":"#N/A"}}]
[12,67,null,{"$f":"IF(E75<>\"\",E75,VLOOKUP(C75,ASAT!$A$4:$B$500,2,0))","v":{"$error":"#N/A"}}]
[null,68,null,{"$f":"IF(E76<>\"\",E76,VLOOKUP(C76,ASAT!$A$4:$B$500,2,0))","v":{"$error":"#N/A"}}]
[null,69,null,{"$f":"IF(E77<>\"\",E77,VLOOKUP(C77,ASAT!$A$4:$B$500,2,0))","v":{"$error":"#N/A"}}]
[null,70,null,{"$f":"IF(E78<>\"\",E78,VLOOKUP(C78,ASAT!$A$4:$B$500,2,0))","v":{"$error":"#N/A"}}]
[null,71,null,{"$f":"IF(E79<>\"\",E79,VLOOKUP(C79,ASAT!$A$4:$B$500,2,0))","v":{"$error":"#N/A"}}]
[null,72,null,{"$f":"IF(E80<>\"\",E80,VLOOKUP(C80,ASAT!$A$4:$B$500,2,0))","v":{"$error":"#N/A"}}]
[13,73,null,{"$f":"IF(E81<>\"\",E81,VLOOKUP(C81,ASAT!$A$4:$B$500,2,0))","v":{"$error":"#N/A"}}]
[null,74,null,{"$f":"IF(E82<>\"\",E82,VLOOKUP(C82,ASAT!$A$4:$B$500,2,0))","v":{"$error":"#N/A"}}]
[null,75,null,{"$f":"IF(E83<>\"\",E83,VLOOKUP(C83,ASAT!$A$4:$B$500,2,0))","v":{"$error":"#N/A"}}]
[null,76,null,{"$f":"IF(E84<>\"\",E84,VLOOKUP(C84,ASAT!$A$4:$B$500,2,0))","v":{"$error":"#N/A"}}]
[null,77,null,{"$f":"IF(E85<>\"\",E85,VLOOKUP(C85,ASAT!$A$4:$B$500,2,0))","v":{"$error":"#N/A"}}]
[null,78,null,{"$f":"IF(E86<>\"\",E86,VLOOKUP(C86,ASAT!$A$4:$B$500,2,0))","v":{"$error":"#N/A"}}]
[14,79,null,{"$f":"IF(E87<>\"\",E87,VLOOKUP(C87,ASAT!$A$4:$B$500,2,0))","v":{"$error":"#N/A"}}]
[null,80,null,{"$f":"IF(E88<>\"\",E88,VLOOKUP(C88,ASAT!$A$4:$B$500,2,0))","v":{"$error":"#N/A"}}]
[null,81,null,{"$f":"IF(E89<>\"\",E89,VLOOKUP(C89,ASAT!$A$4:$B$500,2,0))","v":{"$error":"#N/A"}}]
[null,82,null,{"$f":"IF(E90<>\"\",E90,VLOOKUP(C90,ASAT!$A$4:$B$500,2,0))","v":{"$error":"#N/A"}}]
[null,83,null,{"$f":"IF(E91<>\"\",E91,VLOOKUP(C91,ASAT!$A$4:$B$500,2,0))","v":{"$error":"#N/A"}}]
[null,84,null,{"$f":"IF(E92<>\"\",E92,VLOOKUP(C92,ASAT!$A$4:$B$500,2,0))","v":{"$error":"#N/A"}}]
[15,85,null,{"$f":"IF(E93<>\"\",E93,VLOOKUP(C93,ASAT!$A$4:$B$500,2,0))","v":{"$error":"#N/A"}}]
[null,86,null,{"$f":"IF(E94<>\"\",E94,VLOOKUP(C94,ASAT!$A$4:$B$500,2,0))","v":{"$error":"#N/A"}}]
[null,87,null,{"$f":"IF(E95<>\"\",E95,VLOOKUP(C95,ASAT!$A$4:$B$500,2,0))","v":{"$error":"#N/A"}}]
[null,88,null,{"$f":"IF(E96<>\"\",E96,VLOOKUP(C96,ASAT!$A$4:$B$500,2,0))","v":{"$error":"#N/A"}}]
[null,89,null,{"$f":"IF(E97<>\"\",E97,VLOOKUP(C97,ASAT!$A$4:$B$500,2,0))","v":{"$error":"#N/A"}}]
[null,90,null,{"$f":"IF(E98<>\"\",E98,VLOOKUP(C98,ASAT!$A$4:$B$500,2,0))","v":{"$error":"#N/A"}}]
[16,91,null,{"$f":"IF(E99<>\"\",E99,VLOOKUP(C99,ASAT!$A$4:$B$500,2,0))","v":{"$error":"#N/A"}}]
[null,92,null,{"$f":"IF(E100<>\"\",E100,VLOOKUP(C100,ASAT!$A$4:$B$500,2,0))","v":{"$error":"#N/A"}}]
[null,93,null,{"$f":"IF(E101<>\"\",E101,VLOOKUP(C101,ASAT!$A$4:$B$500,2,0))","v":{"$error":"#N/A"}}]
[null,94,null,{"$f":"IF(E102<>\"\",E102,VLOOKUP(C102,ASAT!$A$4:$B$500,2,0))","v":{"$error":"#N/A"}}]
[null,95,null,{"$f":"IF(E103<>\"\",E103,VLOOKUP(C103,ASAT!$A$4:$B$500,2,0))","v":{"$error":"#N/A"}}]
[null,96,null,{"$f":"IF(E104<>\"\",E104,VLOOKUP(C104,ASAT!$A$4:$B$500,2,0))","v":{"$error":"#N/A"}}]
[17,97,null,{"$f":"IF(E105<>\"\",E105,VLOOKUP(C105,ASAT!$A$4:$B$500,2,0))","v":{"$error":"#N/A"}}]
[null,98,null,{"$f":"IF(E106<>\"\",E106,VLOOKUP(C106,ASAT!$A$4:$B$500,2,0))","v":{"$error":"#N/A"}}]
[null,99,null,{"$f":"IF(E107<>\"\",E107,VLOOKUP(C107,ASAT!$A$4:$B$500,2,0))","v":{"$error":"#N/A"}}]
[null,100,null,{"$f":"IF(E108<>\"\",E108,VLOOKUP(C108,ASAT!$A$4:$B$500,2,0))","v":{"$error":"#N/A"}}]
[null,101,null,{"$f":"IF(E109<>\"\",E109,VLOOKUP(C109,ASAT!$A$4:$B$500,2,0))","v":{"$error":"#N/A"}}]
[null,102,null,{"$f":"IF(E110<>\"\",E110,VLOOKUP(C110,ASAT!$A$4:$B$500,2,0))","v":{"$error":"#N/A"}}]
[18,103,null,{"$f":"IF(E111<>\"\",E111,VLOOKUP(C111,ASAT!$A$4:$B$500,2,0))","v":{"$error":"#N/A"}}]
[null,104,null,{"$f":"IF(E112<>\"\",E112,VLOOKUP(C112,ASAT!$A$4:$B$500,2,0))","v":{"$error":"#N/A"}}]
[null,105,null,{"$f":"IF(E113<>\"\",E113,VLOOKUP(C113,ASAT!$A$4:$B$500,2,0))","v":{"$error":"#N/A"}}]
[null,106,null,{"$f":"IF(E114<>\"\",E114,VLOOKUP(C114,ASAT!$A$4:$B$500,2,0))","v":{"$error":"#N/A"}}]
[null,107,null,{"$f":"IF(E115<>\"\",E115,VLOOKUP(C115,ASAT!$A$4:$B$500,2,0))","v":{"$error":"#N/A"}}]
[null,108,null,{"$f":"IF(E116<>\"\",E116,VLOOKUP(C116,ASAT!$A$4:$B$500,2,0))","v":{"$error":"#N/A"}}]
[19,109,null,{"$f":"IF(E117<>\"\",E117,VLOOKUP(C117,ASAT!$A$4:$B$500,2,0))","v":{"$error":"#N/A"}}]
[null,110,null,{"$f":"IF(E118<>\"\",E118,VLOOKUP(C118,ASAT!$A$4:$B$500,2,0))","v":{"$error":"#N/A"}}]
[null,111,null,{"$f":"IF(E119<>\"\",E119,VLOOKUP(C119,ASAT!$A$4:$B$500,2,0))","v":{"$error":"#N/A"}}]
[null,112,null,{"$f":"IF(E120<>\"\",E120,VLOOKUP(C120,ASAT!$A$4:$B$500,2,0))","v":{"$error":"#N/A"}}]
[null,113,null,{"$f":"IF(E121<>\"\",E121,VLOOKUP(C121,ASAT!$A$4:$B$500,2,0))","v":{"$error":"#N/A"}}]
[null,114,null,{"$f":"IF(E122<>\"\",E122,VLOOKUP(C122,ASAT!$A$4:$B$500,2,0))","v":{"$error":"#N/A"}}]
[20,115,null,{"$f":"IF(E123<>\"\",E123,VLOOKUP(C123,ASAT!$A$4:$B$500,2,0))","v":{"$error":"#N/A"}}]
[null,116,null,{"$f":"IF(E124<>\"\",E124,VLOOKUP(C124,ASAT!$A$4:$B$500,2,0))","v":{"$error":"#N/A"}}]
[null,117,null,{"$f":"IF(E125<>\"\",E125,VLOOKUP(C125,ASAT!$A$4:$B$500,2,0))","v":{"$error":"#N/A"}}]
[null,118,null,{"$f":"IF(E126<>\"\",E126,VLOOKUP(C126,ASAT!$A$4:$B$500,2,0))","v":{"$error":"#N/A"}}]
[null,119,null,{"$f":"IF(E127<>\"\",E127,VLOOKUP(C127,ASAT!$A$4:$B$500,2,0))","v":{"$error":"#N/A"}}]
[null,120,null,{"$f":"IF(E128<>\"\",E128,VLOOKUP(C128,ASAT!$A$4:$B$500,2,0))","v":{"$error":"#N/A"}}]

{"sheet":"Vysledky-doplneni","index":1,"n_rows":126,"n_cols":12,"rows_kept":126,"merged":[[0,0,1,9],[3,4,3,11],[4,0,5,0],[4,1,5,1],[4,2,5,2],[4,3,5,3],[4,4,5,4],[4,5,5,5],[4,6,5,6],[4,7,5,7],[4,8,5,8],[4,9,5,9],[4,10,5,10],[4,11,5,11],[4,12,5,12],[6,0,11,0],[12,0,17,0],[18,0,23,0],[24,0,29,0],[30,0,35,0],[36,0,41,0],[42,0,47,0],[48,0,53,0],[54,0,59,0],[60,0,65,0],[66,0,71,0],[72,0,77,0],[78,0,83,0],[84,0,89,0],[90,0,95,0],[96,0,101,0],[102,0,107,0],[108,0,113,0],[114,0,119,0],[120,0,125,0]]}
["Doplnění výsledků"]
[]
[]
[{"$nulls":4},"COMPAK SPORTING SPECIÁL - 160 TERČŮ"]
["Skupina číslo","Start. číslo","Příjmení, jméno","Kategorie","Skeet I","Skeet II","Trap I","Trap II","Skeet1/2","Skeet II/2","Trap I/2","Trap II/2"]
[]
[1,{"$f":"IF(Vstup!C9<>\"\",Vstup!B9,\"\")","v":1},{"$f":"IF(Vstup!C9<>\"\",Vstup!C9,\"\")","v":"Dolanský Jan"},{"$f":"IF(Vstup!C9<>\"\",Vstup!D9,\"\")","v":"C"},15,4,13,13,13,3,10,14]
[null,{"$f":"IF(Vstup!C10<>\"\",Vstup!B10,\"\")","v":2},{"$f":"IF(Vstup!C10<>\"\",Vstup!C10,\"\")","v":"Koloc Martin"},{"$f":"IF(Vstup!C10<>\"\",Vstup!D10,\"\")","v":"B"},13,11,17,17,9,7,14,13]
[null,{"$f":"IF(Vstup!C11<>\"\",Vstup!B11,\"\")","v":3},{"$f":"IF(Vstup!C11<>\"\",Vstup!C11,\"\")","v":"Greš Marek"},{"$f":"IF(Vstup!C11<>\"\",Vstup!D11,\"\")","v":"C"},14,8,10,11,10,6,8,13]
[null,4,"Hoštička Eduard","C",13,7,13,9,11,9,12,10]
[null,5,"Černošek Milan","A",20,16,13,15,15,10,13,13]
[null,6,"Vadlejch Josef",{"$f":"IF(Vstup!C14<>\"\",Vstup!D14,\"\")","v":"V"},13,12,16,13,13,11,14,14]
[2,{"$f":"IF(Vstup!C15<>\"\",Vstup!B15,\"\")","v":7},{"$f":"IF(Vstup!C15<>\"\",Vstup!C15,\"\")","v":"Otáhal Milan "},{"$f":"IF(Vstup!C15<>\"\",Vstup!D15,\"\")","v":"V"},18,13,14,17,18,14,14,13]
[null,{"$f":"IF(Vstup!C16<>\"\",Vstup!B16,\"\")","v":8},{"$f":"IF(Vstup!C16<>\"\",Vstup!C16,\"\")","v":"Zigo Martin "},{"$f":"IF(Vstup!C16<>\"\",Vstup!D16,\"\")","v":"A"},12,11,16,15,18,9,17,17]
[null,{"$f":"IF(Vstup!C17<>\"\",Vstup!B17,\"\")","v":9},{"$f":"IF(Vstup!C17<>\"\",Vstup!C17,\"\")","v":"Uher Jaromír"},{"$f":"IF(Vstup!C17<>\"\",Vstup!D17,\"\")","v":"V"},18,16,17,18,17,13,14,17]
[null,{"$f":"IF(Vstup!C18<>\"\",Vstup!B18,\"\")","v":10},{"$f":"IF(Vstup!C18<>\"\",Vstup!C18,\"\")","v":"Mikulka Peter"},{"$f":"IF(Vstup!C18<>\"\",Vstup!D18,\"\")","v":"C"},15,8,15,12,17,4,13,15]
[null,{"$f":"IF(Vstup!C19<>\"\",Vstup!B19,\"\")","v":11},{"$f":"IF(Vstup!C19<>\"\",Vstup!C19,\"\")","v":"Hedvik Jaromír"},{"$f":"IF(Vstup!C19<>\"\",Vstup!D19,\"\")","v":"C"},13,15,13,11,12,9,5,7]
[null,{"$f":"IF(Vstup!C20<>\"\",Vstup!B20,\"\")","v":12},{"$f":"IF(Vstup!C20<>\"\",Vstup!C20,\"\")","v":"Jankovský Jakub "},{"$f":"IF(Vstup!C20<>\"\",Vstup!D20,\"\")","v":"J"},17,17,17,18,14,9,17,17]
[3,{"$f":"IF(Vstup!C21<>\"\",Vstup!B21,\"\")","v":13},{"$f":"IF(Vstup!C21<>\"\",Vstup!C21,\"\")","v":"Husar Vladimír "},{"$f":"IF(Vstup!C21<>\"\",Vstup!D21,\"\")","v":"B"},16,7,16,10,14,10,17,13]
[null,{"$f":"IF(Vstup!C22<>\"\",Vstup!B22,\"\")","v":14},{"$f":"IF(Vstup!C22<>\"\",Vstup!C22,\"\")","v":"Zázvorka Pavel"},{"$f":"IF(Vstup!C22<>\"\",Vstup!D22,\"\")","v":"A"},19,18,17,18,18,17,17,18]
[null,{"$f":"IF(Vstup!C23<>\"\",Vstup!B23,\"\")","v":15},{"$f":"IF(Vstup!C23<>\"\",Vstup!C23,\"\")","v":"Štengl Jiří"},{"$f":"IF(Vstup!C23<>\"\",Vstup!D23,\"\")","v":"A"},17,16,18,14,14,11,9,15]
[null,{"$f":"IF(Vstup!C24<>\"\",Vstup!B24,\"\")","v":16},{"$f":"IF(Vstup!C24<>\"\",Vstup!C24,\"\")","v":"Korál Petr"},{"$f":"IF(Vstup!C24<>\"\",Vstup!D24,\"\")","v":"C"},12,13,10,14,13,8,9,14]
[null,{"$f":"IF(Vstup!C25<>\"\",Vstup!B25,\"\")","v":17},{"$f":"IF(Vstup!C25<>\"\",Vstup!C25,\"\")","v":"Divíšek Martin"},{"$f":"IF(Vstup!C25<>\"\",Vstup!D25,\"\")","v":"A"},17,16,19,16,17,10,16,14]
[null,{"$f":"IF(Vstup!C26<>\"\",Vstup!B26,\"\")","v":18},{"$f":"IF(Vstup!C26<>\"\",Vstup!C26,\"\")","v":"Divíšek Martin ml."},{"$f":"IF(Vstup!C26<>\"\",Vstup!D26,\"\")","v":"J"},14,10,12,10,13,8,11,10]
[4,{"$f":"IF(Vstup!C27<>\"\",Vstup!B27,\"\")","v":19},{"$f":"IF(Vstup!C27<>\"\",Vstup!C27,\"\")","v":"Jirků Milan "},{"$f":"IF(Vstup!C27<>\"\",Vstup!D27,\"\")","v":"C"},9,10,10,10,8,8,10,7]
[null,{"$f":"IF(Vstup!C28<>\"\",Vstup!B28,\"\")","v":20},{"$f":"IF(Vstup!C28<>\"\",Vstup!C28,\"\")","v":"Kotrc Karel"},{"$f":"IF(Vstup!C28<>\"\",Vstup!D28,\"\")","v":"A"},18,12,16,17,16,10,15,11]
[null,{"$f":"IF(Vstup!C29<>\"\",Vstup!B29,\"\")","v":21},{"$f":"IF(Vstup!C29<>\"\",Vstup!C29,\"\")","v":"Říha Milan "},{"$f":"IF(Vstup!C29<>\"\",Vstup!D29,\"\")","v":"V"},18,13,17,16,10,12,14,16]
[null,{"$f":"IF(Vstup!C30<>\"\",Vstup!B30,\"\")","v":22},{"$f":"IF(Vstup!C30<>\"\",Vstup!C30,\"\")","v":"Mrázek Lubomír"},{"$f":"IF(Vstup!C30<>\"\",Vstup!D30,\"\")","v":"C"},15,3,15,16,7,7,13,12]
[null,{"$f":"IF(Vstup!C31<>\"\",Vstup!B31,\"\")","v":23},{"$f":"IF(Vstup!C31<>\"\",Vstup!C31,\"\")","v":"Hřebec Jan ml."},{"$f":"IF(Vstup!C31<>\"\",Vstup!D31,\"\")","v":"J"},16,14,13,13,14,7,13,17]
[null,{"$f":"IF(Vstup!C32<>\"\",Vstup!B32,\"\")","v":24},{"$f":"IF(Vstup!C32<>\"\",Vstup!C32,\"\")","v":"Hřebec Jan "},{"$f":"IF(Vstup!C32<>\"\",Vstup!D32,\"\")","v":"A"},15,15,19,17,16,13,14,16]
[5,{"$f":"IF(Vstup!C33<>\"\",Vstup!B33,\"\")","v":25},{"$f":"IF(Vstup!C33<>\"\",Vstup!C33,\"\")","v":"Lengyel Ivan"},{"$f":"IF(Vstup!C33<>\"\",Vstup!D33,\"\")","v":"B"},15,11,15,15,13,8,11,15]
[null,{"$f":"IF(Vstup!C34<>\"\",Vstup!B34,\"\")","v":26},{"$f":"IF(Vstup!C34<>\"\",Vstup!C34,\"\")","v":"Lengyel Jan "},{"$f":"IF(Vstup!C34<>\"\",Vstup!D34,\"\")","v":"B"},19,14,16,14,16,12,15,16]
[null,{"$f":"IF(Vstup!C35<>\"\",Vstup!B35,\"\")","v":27},{"$f":"IF(Vstup!C35<>\"\",Vstup!C35,\"\")","v":"Lengyel Jiří"},{"$f":"IF(Vstup!C35<>\"\",Vstup!D35,\"\")","v":"B"},16,15,13,17,13,12,14,18]
[null,{"$f":"IF(Vstup!C36<>\"\",Vstup!B36,\"\")","v":28},{"$f":"IF(Vstup!C36<>\"\",Vstup!C36,\"\")","v":"Jelínek Jiří"},{"$f":"IF(Vstup!C36<>\"\",Vstup!D36,\"\")","v":"V"},16,11,11,11,11,6,13,6]
[null,{"$f":"IF(Vstup!C37<>\"\",Vstup!B37,\"\")","v":29},{"$f":"IF(Vstup!C37<>\"\",Vstup!C37,\"\")","v":"Horák František"},{"$f":"IF(Vstup!C37<>\"\",Vstup!D37,\"\")","v":"C"},13,11,15,12,7,6,10,15]
[null,{"$f":"IF(Vstup!C38<>\"\",Vstup!B38,\"\")","v":30},{"$f":"IF(Vstup!C38<>\"\",Vstup!C38,\"\")","v":"Kubík Jindřich"},{"$f":"IF(Vstup!C38<>\"\",Vstup!D38,\"\")","v":"V"},11,9,12,14,13,10,11,10]
[6,{"$f":"IF(Vstup!C39<>\"\",Vstup!B39,\"\")","v":31},{"$f":"IF(Vstup!C39<>\"\",Vstup!C39,\"\")","v":"Neuvirt Martin"},{"$f":"IF(Vstup!C39<>\"\",Vstup!D39,\"\")","v":"B"},13,7,13,16,7,8,14,16]
[null,{"$f":"IF(Vstup!C40<>\"\",Vstup!B40,\"\")","v":32},{"$f":"IF(Vstup!C40<>\"\",Vstup!C40,\"\")","v":"Neuvirt Václav"},{"$f":"IF(Vstup!C40<>\"\",Vstup!D40,\"\")","v":"V"},14,12,12,12,15,11,10,8]
[null,{"$f":"IF(Vstup!C41<>\"\",Vstup!B41,\"\")","v":33},{"$f":"IF(Vstup!C41<>\"\",Vstup!C41,\"\")","v":"Štícha Lubomír"},{"$f":"IF(Vstup!C41<>\"\",Vstup!D41,\"\")","v":"B"},17,12,13,15,15,10,15,16]
[null,{"$f":"IF(Vstup!C42<>\"\",Vstup!B42,\"\")","v":34},{"$f":"IF(Vstup!C42<>\"\",Vstup!C42,\"\")","v":"Vavrečka Michal"},{"$f":"IF(Vstup!C42<>\"\",Vstup!D42,\"\")","v":"C"},12,7,12,11,9,5,14,11]
[null,{"$f":"IF(Vstup!C43<>\"\",Vstup!B43,\"\")","v":35},{"$f":"IF(Vstup!C43<>\"\",Vstup!C43,\"\")","v":"Jelínek Aleš"},{"$f":"IF(Vstup!C43<>\"\",Vstup!D43,\"\")","v":"C"},14,3,10,7,8,4,4,5]
[null,{"$f":"IF(Vstup!C44<>\"\",Vstup!B44,\"\")","v":""},{"$f":"IF(Vstup!C44<>\"\",Vstup!C44,\"\")","v":""},{"$f":"IF(Vstup!C44<>\"\",Vstup!D44,\"\")","v":""}]
[7,{"$f":"IF(Vstup!C45<>\"\",Vstup!B45,\"\")","v":37},{"$f":"IF(Vstup!C45<>\"\",Vstup!C45,\"\")","v":"Wlodarczyk Remigiusz"},{"$f":"IF(Vstup!C45<>\"\",Vstup!D45,\"\")","v":"A"},18,13,17,17,17,12,18,18]
[null,{"$f":"IF(Vstup!C46<>\"\",Vstup!B46,\"\")","v":38},{"$f":"IF(Vstup!C46<>\"\",Vstup!C46,\"\")","v":"Jedros Witold"},{"$f":"IF(Vstup!C46<>\"\",Vstup!D46,\"\")","v":"C"},14,13,13,17,11,9,12,9]
[null,{"$f":"IF(Vstup!C47<>\"\",Vstup!B47,\"\")","v":39},{"$f":"IF(Vstup!C47<>\"\",Vstup!C47,\"\")","v":"Cieplik Waldemar"},{"$f":"IF(Vstup!C47<>\"\",Vstup!D47,\"\")","v":"C"},13,14,17,12,16,9,16,15]
[null,{"$f":"IF(Vstup!C48<>\"\",Vstup!B48,\"\")","v":""},{"$f":"IF(Vstup!C48<>\"\",Vstup!C48,\"\")","v":""},{"$f":"IF(Vstup!C48<>\"\",Vstup!D48,\"\")","v":""}]
[null,{"$f":"IF(Vstup!C49<>\"\",Vstup!B49,\"\")","v":""},{"$f":"IF(Vstup!C49<>\"\",Vstup!C49,\"\")","v":""},{"$f":"IF(Vstup!C49<>\"\",Vstup!D49,\"\")","v":""}]
[null,{"$f":"IF(Vstup!C50<>\"\",Vstup!B50,\"\")","v":""},{"$f":"IF(Vstup!C50<>\"\",Vstup!C50,\"\")","v":""},{"$f":"IF(Vstup!C50<>\"\",Vstup!D50,\"\")","v":""}]
[8,{"$f":"IF(Vstup!C51<>\"\",Vstup!B51,\"\")","v":""},{"$f":"IF(Vstup!C51<>\"\",Vstup!C51,\"\")","v":""},{"$f":"IF(Vstup!C51<>\"\",Vstup!D51,\"\")","v":""}]
[null,{"$f":"IF(Vstup!C52<>\"\",Vstup!B52,\"\")","v":""},{"$f":"IF(Vstup!C52<>\"\",Vstup!C52,\"\")","v":""},{"$f":"IF(Vstup!C52<>\"\",Vstup!D52,\"\")","v":""}]
[null,{"$f":"IF(Vstup!C53<>\"\",Vstup!B53,\"\")","v":""},{"$f":"IF(Vstup!C53<>\"\",Vstup!C53,\"\")","v":""},{"$f":"IF(Vstup!C53<>\"\",Vstup!D53,\"\")","v":""}]
[null,{"$f":"IF(Vstup!C54<>\"\",Vstup!B54,\"\")","v":""},{"$f":"IF(Vstup!C54<>\"\",Vstup!C54,\"\")","v":""},{"$f":"IF(Vstup!C54<>\"\",Vstup!D54,\"\")","v":""}]
[null,{"$f":"IF(Vstup!C55<>\"\",Vstup!B55,\"\")","v":""},{"$f":"IF(Vstup!C55<>\"\",Vstup!C55,\"\")","v":""},{"$f":"IF(Vstup!C55<>\"\",Vstup!D55,\"\")","v":""}]
[null,{"$f":"IF(Vstup!C56<>\"\",Vstup!B56,\"\")","v":""},{"$f":"IF(Vstup!C56<>\"\",Vstup!C56,\"\")","v":""},{"$f":"IF(Vstup!C56<>\"\",Vstup!D56,\"\")","v":""}]
[9,{"$f":"IF(Vstup!C57<>\"\",Vstup!B57,\"\")","v":""},{"$f":"IF(Vstup!C57<>\"\",Vstup!C57,\"\")","v":""},{"$f":"IF(Vstup!C57<>\"\",Vstup!D57,\"\")","v":""}]
[null,{"$f":"IF(Vstup!C58<>\"\",Vstup!B58,\"\")","v":""},{"$f":"IF(Vstup!C58<>\"\",Vstup!C58,\"\")","v":""},{"$f":"IF(Vstup!C58<>\"\",Vstup!D58,\"\")","v":""}]
[null,{"$f":"IF(Vstup!C59<>\"\",Vstup!B59,\"\")","v":""},{"$f":"IF(Vstup!C59<>\"\",Vstup!C59,\"\")","v":""},{"$f":"IF(Vstup!C59<>\"\",Vstup!D59,\"\")","v":""}]
[null,{"$f":"IF(Vstup!C60<>\"\",Vstup!B60,\"\")","v":""},{"$f":"IF(Vstup!C60<>\"\",Vstup!C60,\"\")","v":""},{"$f":"IF(Vstup!C60<>\"\",Vstup!D60,\"\")","v":""}]
[null,{"$f":"IF(Vstup!C61<>\"\",Vstup!B61,\"\")","v":""},{"$f":"IF(Vstup!C61<>\"\",Vstup!C61,\"\")","v":""},{"$f":"IF(Vstup!C61<>\"\",Vstup!D61,\"\")","v":""}]
[null,{"$f":"IF(Vstup!C62<>\"\",Vstup!B62,\"\")","v":""},{"$f":"IF(Vstup!C62<>\"\",Vstup!C62,\"\")","v":""},{"$f":"IF(Vstup!C62<>\"\",Vstup!D62,\"\")","v":""}]
[10,{"$f":"IF(Vstup!C63<>\"\",Vstup!B63,\"\")","v":""},{"$f":"IF(Vstup!C63<>\"\",Vstup!C63,\"\")","v":""},{"$f":"IF(Vstup!C63<>\"\",Vstup!D63,\"\")","v":""}]
[null,{"$f":"IF(Vstup!C64<>\"\",Vstup!B64,\"\")","v":""},{"$f":"IF(Vstup!C64<>\"\",Vstup!C64,\"\")","v":""},{"$f":"IF(Vstup!C64<>\"\",Vstup!D64,\"\")","v":""}]
[null,{"$f":"IF(Vstup!C65<>\"\",Vstup!B65,\"\")","v":""},{"$f":"IF(Vstup!C65<>\"\",Vstup!C65,\"\")","v":""},{"$f":"IF(Vstup!C65<>\"\",Vstup!D65,\"\")","v":""}]
[null,{"$f":"IF(Vstup!C66<>\"\",Vstup!B66,\"\")","v":""},{"$f":"IF(Vstup!C66<>\"\",Vstup!C66,\"\")","v":""},{"$f":"IF(Vstup!C66<>\"\",Vstup!D66,\"\")","v":""}]
[null,{"$f":"IF(Vstup!C67<>\"\",Vstup!B67,\"\")","v":""},{"$f":"IF(Vstup!C67<>\"\",Vstup!C67,\"\")","v":""},{"$f":"IF(Vstup!C67<>\"\",Vstup!D67,\"\")","v":""}]
[null,{"$f":"IF(Vstup!C68<>\"\",Vstup!B68,\"\")","v":""},{"$f":"IF(Vstup!C68<>\"\",Vstup!C68,\"\")","v":""},{"$f":"IF(Vstup!C68<>\"\",Vstup!D68,\"\")","v":""}]
[11,{"$f":"IF(Vstup!C69<>\"\",Vstup!B69,\"\")","v":""},{"$f":"IF(Vstup!C69<>\"\",Vstup!C69,\"\")","v":""},{"$f":"IF(Vstup!C69<>\"\",Vstup!D69,\"\")","v":""}]
[null,{"$f":"IF(Vstup!C70<>\"\",Vstup!B70,\"\")","v":""},{"$f":"IF(Vstup!C70<>\"\",Vstup!C70,\"\")","v":""},{"$f":"IF(Vstup!C70<>\"\",Vstup!D70,\"\")","v":""}]
[null,{"$f":"IF(Vstup!C71<>\"\",Vstup!B71,\"\")","v":""},{"$f":"IF(Vstup!C71<>\"\",Vstup!C71,\"\")","v":""},{"$f":"IF(Vstup!C71<>\"\",Vstup!D71,\"\")","v":""}]
[null,{"$f":"IF(Vstup!C72<>\"\",Vstup!B72,\"\")","v":""},{"$f":"IF(Vstup!C72<>\"\",Vstup!C72,\"\")","v":""},{"$f":"IF(Vstup!C72<>\"\",Vstup!D72,\"\")","v":""}]
[null,{"$f":"IF(Vstup!C73<>\"\",Vstup!B73,\"\")","v":""},{"$f":"IF(Vstup!C73<>\"\",Vstup!C73,\"\")","v":""},{"$f":"IF(Vstup!C73<>\"\",Vstup!D73,\"\")","v":""}]
[null,{"$f":"IF(Vstup!C74<>\"\",Vstup!B74,\"\")","v":""},{"$f":"IF(Vstup!C74<>\"\",Vstup!C74,\"\")","v":""},{"$f":"IF(Vstup!C74<>\"\",Vstup!D74,\"\")","v":""}]
[12,{"$f":"IF(Vstup!C75<>\"\",Vstup!B75,\"\")","v":""},{"$f":"IF(Vstup!C75<>\"\",Vstup!C75,\"\")","v":""},{"$f":"IF(Vstup!C75<>\"\",Vstup!D75,\"\")","v":""}]
[null,{"$f":"IF(Vstup!C76<>\"\",Vstup!B76,\"\")","v":""},{"$f":"IF(Vstup!C76<>\"\",Vstup!C76,\"\")","v":""},{"$f":"IF(Vstup!C76<>\"\",Vstup!D76,\"\")","v":""}]
[null,{"$f":"IF(Vstup!C77<>\"\",Vstup!B77,\"\")","v":""},{"$f":"IF(Vstup!C77<>\"\",Vstup!C77,\"\")","v":""},{"$f":"IF(Vstup!C77<>\"\",Vstup!D77,\"\")","v":""}]
[null,{"$f":"IF(Vstup!C78<>\"\",Vstup!B78,\"\")","v":""},{"$f":"IF(Vstup!C78<>\"\",Vstup!C78,\"\")","v":""},{"$f":"IF(Vstup!C78<>\"\",Vstup!D78,\"\")","v":""}]
[null,{"$f":"IF(Vstup!C79<>\"\",Vstup!B79,\"\")","v":""},{"$f":"IF(Vstup!C79<>\"\",Vstup!C79,\"\")","v":""},{"$f":"IF(Vstup!C79<>\"\",Vstup!D79,\"\")","v":""}]
[null,{"$f":"IF(Vstup!C80<>\"\",Vstup!B80,\"\")","v":""},{"$f":"IF(Vstup!C80<>\"\",Vstup!C80,\"\")","v":""},{"$f":"IF(Vstup!C80<>\"\",Vstup!D80,\"\")","v":""}]
[13,{"$f":"IF(Vstup!C81<>\"\",Vstup!B81,\"\")","v":""},{"$f":"IF(Vstup!C81<>\"\",Vstup!C81,\"\")","v":""},{"$f":"IF(Vstup!C81<>\"\",Vstup!D81,\"\")","v":""}]
[null,{"$f":"IF(Vstup!C82<>\"\",Vstup!B82,\"\")","v":""},{"$f":"IF(Vstup!C82<>\"\",Vstup!C82,\"\")","v":""},{"$f":"IF(Vstup!C82<>\"\",Vstup!D82,\"\")","v":""}]
[null,{"$f":"IF(Vstup!C83<>\"\",Vstup!B83,\"\")","v":""},{"$f":"IF(Vstup!C83<>\"\",Vstup!C83,\"\")","v":""},{"$f":"IF(Vstup!C83<>\"\",Vstup!D83,\"\")","v":""}]
[null,{"$f":"IF(Vstup!C84<>\"\",Vstup!B84,\"\")","v":""},{"$f":"IF(Vstup!C84<>\"\",Vstup!C84,\"\")","v":""},{"$f":"IF(Vstup!C84<>\"\",Vstup!D84,\"\")","v":""}]
[null,{"$f":"IF(Vstup!C85<>\"\",Vstup!B85,\"\")","v":""},{"$f":"IF(Vstup!C85<>\"\",Vstup!C85,\"\")","v":""},{"$f":"IF(Vstup!C85<>\"\",Vstup!D85,\"\")","v":""}]
[null,{"$f":"IF(Vstup!C86<>\"\",Vstup!B86,\"\")","v":""},{"$f":"IF(Vstup!C86<>\"\",Vstup!C86,\"\")","v":""},{"$f":"IF(Vstup!C86<>\"\",Vstup!D86,\"\")","v":""}]
[14,{"$f":"IF(Vstup!C87<>\"\",Vstup!B87,\"\")","v":""},{"$f":"IF(Vstup!C87<>\"\",Vstup!C87,\"\")","v":""},{"$f":"IF(Vstup!C87<>\"\",Vstup!D87,\"\")","v":""}]
[null,{"$f":"IF(Vstup!C88<>\"\",Vstup!B88,\"\")","v":""},{"$f":"IF(Vstup!C88<>\"\",Vstup!C88,\"\")","v":""},{"$f":"IF(Vstup!C88<>\"\",Vstup!D88,\"\")","v":""}]
[null,{"$f":"IF(Vstup!C89<>\"\",Vstup!B89,\"\")","v":""},{"$f":"IF(Vstup!C89<>\"\",Vstup!C89,\"\")","v":""},{"$f":"IF(Vstup!C89<>\"\",Vstup!D89,\"\")","v":""}]
[null,{"$f":"IF(Vstup!C90<>\"\",Vstup!B90,\"\")","v":""},{"$f":"IF(Vstup!C90<>\"\",Vstup!C90,\"\")","v":""},{"$f":"IF(Vstup!C90<>\"\",Vstup!D90,\"\")","v":""}]
[null,{"$f":"IF(Vstup!C91<>\"\",Vstup!B91,\"\")","v":""},{"$f":"IF(Vstup!C91<>\"\",Vstup!C91,\"\")","v":""},{"$f":"IF(Vstup!C91<>\"\",Vstup!D91,\"\")","v":""}]
[null,{"$f":"IF(Vstup!C92<>\"\",Vstup!B92,\"\")","v":""},{"$f":"IF(Vstup!C92<>\"\",Vstup!C92,\"\")","v":""},{"$f":"IF(Vstup!C92<>\"\",Vstup!D92,\"\")","v":""}]
[15,{"$f":"IF(Vstup!C93<>\"\",Vstup!B93,\"\")","v":""},{"$f":"IF(Vstup!C93<>\"\",Vstup!C93,\"\")","v":""},{"$f":"IF(Vstup!C93<>\"\",Vstup!D93,\"\")","v":""}]
[null,{"$f":"IF(Vstup!C94<>\"\",Vstup!B94,\"\")","v":""},{"$f":"IF(Vstup!C94<>\"\",Vstup!C94,\"\")","v":""},{"$f":"IF(Vstup!C94<>\"\",Vstup!D94,\"\")","v":""}]
[null,{"$f":"IF(Vstup!C95<>\"\",Vstup!B95,\"\")","v":""},{"$f":"IF(Vstup!C95<>\"\",Vstup!C95,\"\")","v":""},{"$f":"IF(Vstup!C95<>\"\",Vstup!D95,\"\")","v":""}]
[null,{"$f":"IF(Vstup!C96<>\"\",Vstup!B96,\"\")","v":""},{"$f":"IF(Vstup!C96<>\"\",Vstup!C96,\"\")","v":""},{"$f":"IF(Vstup!C96<>\"\",Vstup!D96,\"\")","v":""}]
[null,{"$f":"IF(Vstup!C97<>\"\",Vstup!B97,\"\")","v":""},{"$f":"IF(Vstup!C97<>\"\",Vstup!C97,\"\")","v":""},{"$f":"IF(Vstup!C97<>\"\",Vstup!D97,\"\")","v":""}]
[null,{"$f":"IF(Vstup!C98<>\"\",Vstup!B98,\"\")","v":""},{"$f":"IF(Vstup!C98<>\"\",Vstup!C98,\"\")","v":""},{"$f":"IF(Vstup!C98<>\"\",Vstup!D98,\"\")","v":""}]
[16,{"$f":"IF(Vstup!C99<>\"\",Vstup!B99,\"\")","v":""},{"$f":"IF(Vstup!C99<>\"\",Vstup!C99,\"\")","v":""},{"$f":"IF(Vstup!C99<>\"\",Vstup!D99,\"\")","v":""}]
[null,{"$f":"IF(Vstup!C100<>\"\",Vstup!B100,\"\")","v":""},{"$f":"IF(Vstup!C100<>\"\",Vstup!C100,\"\")","v":""},{"$f":"IF(Vstup!C100<>\"\",Vstup!D100,\"\")","v":""}]
[null,{"$f":"IF(Vstup!C101<>\"\",Vstup!B101,\"\")","v":""},{"$f":"IF(Vstup!C101<>\"\",Vstup!C101,\"\")","v":""},{"$f":"IF(Vstup!C101<>\"\",Vstup!D101,\"\")","v":""}]
[null,{"$f":"IF(Vstup!C102<>\"\",Vstup!B102,\"\")","v":""},{"$f":"IF(Vstup!C102<>\"\",Vstup!C102,\"\")","v":""},{"$f":"IF(Vstup!C102<>\"\",Vstup!D102,\"\")","v":""}]
[null,{"$f":"IF(Vstup!C103<>\"\",Vstup!B103,\"\")","v":""},{"$f":"IF(Vstup!C103<>\"\",Vstup!C103,\"\")","v":""},{"$f":"IF(Vstup!C103<>\"\",Vstup!D103,\"\")","v":""}]
[null,{"$f":"IF(Vstup!C104<>\"\",Vstup!B104,\"\")","v":""},{"$f":"IF(Vstup!C104<>\"\",Vstup!C104,\"\")","v":""},{"$f":"IF(Vstup!C104<>\"\",Vstup!D104,\"\")","v":""}]
[17,{"$f":"IF(Vstup!C105<>\"\",Vstup!B105,\"\")","v":""},{"$f":"IF(Vstup!C105<>\"\",Vstup!C105,\"\")","v":""},{"$f":"IF(Vstup!C105<>\"\",Vstup!D105,\"\")","v":""}]
[null,{"$f":"IF(Vstup!C106<>\"\",Vstup!B106,\"\")","v":""},{"$f":"IF(Vstup!C106<>\"\",Vstup!C106,\"\")","v":""},{"$f":"IF(Vstup!C106<>\"\",Vstup!D106,\"\")","v":""}]
[null,{"$f":"IF(Vstup!C107<>\"\",Vstup!B107,\"\")","v":""},{"$f":"IF(Vstup!C107<>\"\",Vstup!C107,\"\")","v":""},{"$f":"IF(Vstup!C107<>\"\",Vstup!D107,\"\")","v":""}]
[null,{"$f":"IF(Vstup!C108<>\"\",Vstup!B108,\"\")","v":""},{"$f":"IF(Vstup!C108<>\"\",Vstup!C108,\"\")","v":""},{"$f":"IF(Vstup!C108<>\"\",Vstup!D108,\"\")","v":""}]
[null,{"$f":"IF(Vstup!C109<>\"\",Vstup!B109,\"\")","v":""},{"$f":"IF(Vstup!C109<>\"\",Vstup!C109,\"\")","v":""},{"$f":"IF(Vstup!C109<>\"\",Vstup!D109,\"\")","v":""}]
[null,{"$f":"IF(Vstup!C110<>\"\",Vstup!B110,\"\")","v":""},{"$f":"IF(Vstup!C110<>\"\",Vstup!C110,\"\")","v":""},{"$f":"IF(Vstup!C110<>\"\",Vstup!D110,\"\")","v":""}]
[18,{"$f":"IF(Vstup!C111<>\"\",Vstup!B111,\"\")","v":""},{"$f":"IF(Vstup!C111<>\"\",Vstup!C111,\"\")","v":""},{"$f":"IF(Vstup!C111<>\"\",Vstup!D111,\"\")","v":""}]
[null,{"$f":"IF(Vstup!C112<>\"\",Vstup!B112,\"\")","v":""},{"$f":"IF(Vstup!C112<>\"\",Vstup!C112,\"\")","v":""},{"$f":"IF(Vstup!C112<>\"\",Vstup!D112,\"\")","v":""}]
[null,{"$f":"IF(Vstup!C113<>\"\",Vstup!B113,\"\")","v":""},{"$f":"IF(Vstup!C113<>\"\",Vstup!C113,\"\")","v":""},{"$f":"IF(Vstup!C113<>\"\",Vstup!D113,\"\")","v":""}]
[null,{"$f":"IF(Vstup!C114<>\"\",Vstup!B114,\"\")","v":""},{"$f":"IF(Vstup!C114<>\"\",Vstup!C114,\"\")","v":""},{"$f":"IF(Vstup!C114<>\"\",Vstup!D114,\"\")","v":""}]
[null,{"$f":"IF(Vstup!C115<>\"\",Vstup!B115,\"\")","v":""},{"$f":"IF(Vstup!C115<>\"\",Vstup!C115,\"\")","v":""},{"$f":"IF(Vstup!C115<>\"\",Vstup!D115,\"\")","v":""}]
[null,{"$f":"IF(Vstup!C116<>\"\",Vstup!B116,\"\")","v":""},{"$f":"IF(Vstup!C116<>\"\",Vstup!C116,\"\")","v":""},{"$f":"IF(Vstup!C116<>\"\",Vstup!D116,\"\")","v":""}]
[19,{"$f":"IF(Vstup!C117<>\"\",Vstup!B117,\"\")","v":""},{"$f":"IF(Vstup!C117<>\"\",Vstup!C117,\"\")","v":""},{"$f":"IF(Vstup!C117<>\"\",Vstup!D117,\"\")","v":""}]
[null,{"$f":"IF(Vstup!C118<>\"\",Vstup!B118,\"\")","v":""},{"$f":"IF(Vstup!C118<>\"\",Vstup!C118,\"\")","v":""},{"$f":"IF(Vstup!C118<>\"\",Vstup!D118,\"\")","v":""}]
[null,{"$f":"IF(Vstup!C119<>\"\",Vstup!B119,\"\")","v":""},{"$f":"IF(Vstup!C119<>\"\",Vstup!C119,\"\")","v":""},{"$f":"IF(Vstup!C119<>\"\",Vstup!D119,\"\")","v":""}]
[null,{"$f":"IF(Vstup!C120<>\"\",Vstup!B120,\"\")","v":""},{"$f":"IF(Vstup!C120<>\"\",Vstup!C120,\"\")","v":""},{"$f":"IF(Vstup!C120<>\"\",Vstup!D120,\"\")","v":""}]
[null,{"$f":"IF(Vstup!C121<>\"\",Vstup!B121,\"\")","v":""},{"$f":"IF(Vstup!C121<>\"\",Vstup!C121,\"\")","v":""},{"$f":"IF(Vstup!C121<>\"\",Vstup!D121,\"\")","v":""}]
[null,{"$f":"IF(Vstup!C122<>\"\",Vstup!B122,\"\")","v":""},{"$f":"IF(Vstup!C122<>\"\",Vstup!C122,\"\")","v":""},{"$f":"IF(Vstup!C122<>\"\",Vstup!D122,\"\")","v":""}]
[20,{"$f":"IF(Vstup!C123<>\"\",Vstup!B123,\"\")","v":""},{"$f":"IF(Vstup!C123<>\"\",Vstup!C123,\"\")","v":""},{"$f":"IF(Vstup!C123<>\"\",Vstup!D123,\"\")","v":""}]
[null,{"$f":"IF(Vstup!C124<>\"\",Vstup!B124,\"\")","v":""},{"$f":"IF(Vstup!C124<>\"\",Vstup!C124,\"\")","v":""},{"$f":"IF(Vstup!C124<>\"\",Vstup!D124,\"\")","v":""}]
[null,{"$f":"IF(Vstup!C125<>\"\",Vstup!B125,\"\")","v":""},{"$f":"IF(Vstup!C125<>\"\",Vstup!C125,\"\")","v":""},{"$f":"IF(Vstup!C125<>\"\",Vstup!D125,\"\")","v":""}]
[null,{"$f":"IF(Vstup!C126<>\"\",Vstup!B126,\"\")","v":""},{"$f":"IF(Vstup!C126<>\"\",Vstup!C126,\"\")","v":""},{"$f":"IF(Vstup!C126<>\"\",Vstup!D126,\"\")","v":""}]
[null,{"$f":"IF(Vstup!C127<>\"\",Vstup!B127,\"\")","v":""},{"$f":"IF(Vstup!C127<>\"\",Vstup!C127,\"\")","v":""},{"$f":"IF(Vstup!C127<>\"\",Vstup!D127,\"\")","v":""}]
[null,{"$f":"IF(Vstup!C128<>\"\",Vstup!B128,\"\")","v":""},{"$f":"IF(Vstup!C128<>\"\",Vstup!C128,\"\")","v":""},{"$f":"IF(Vstup!C128<>\"\",Vstup!D128,\"\")","v":""}]

{"sheet":"List3","index":2,"n_rows":17,"n_cols":15,"rows_kept":17,"hidden":true}
[{"$nulls":3},{"$f":"COUNTIF(D6:D17,\"A\")","v":3}]
[{"$nulls":13},"A",{"$f":"MATCH(\"A\",D6:D17,0)","v":1}]
[{"$nulls":13},"B",{"$f":"MATCH(\"B\",D6:D17,0)","v":4}]
[{"$nulls":13},"C",{"$f":"MATCH(\"C\",D6:D17,0)","v":7}]
[{"$nulls":13},"J",{"$f":"MATCH(\"J\",D6:D17,0)","v":8}]
[null,null,"Hřebec Jan","A",{"$f":"VLOOKUP(C6,'Vysledky-doplneni'!$C$7:$J$18,3,0)","v":{"$error":"#N/A"}},{"$f":"VLOOKUP($C6,'Vysledky-doplneni'!$C$7:$J$18,4,0)","v":{"$error":"#N/A"}},{"$f":"VLOOKUP($C6,'Vysledky-doplneni'!$C$7:$J$18,5,0)","v":{"$error":"#N/A"}},{"$f":"VLOOKUP($C6,'Vysledky-doplneni'!$C$7:$J$18,6,0)","v":{"$error":"#N/A"}},{"$f":"VLOOKUP($C6,'Vysledky-doplneni'!$C$7:$J$18,7,0)","v":{"$error":"#N/A"}},{"$nulls":4},"V",{"$f":"MATCH(\"V\",D6:D17,0)","v":12}]
[null,null,"Štengl Jiří","A",{"$f":"VLOOKUP(C7,'Vysledky-doplneni'!$C$7:$J$18,3,0)","v":{"$error":"#N/A"}},{"$f":"VLOOKUP($C7,'Vysledky-doplneni'!$C$7:$J$18,4,0)","v":{"$error":"#N/A"}},{"$f":"VLOOKUP($C7,'Vysledky-doplneni'!$C$7:$J$18,5,0)","v":{"$error":"#N/A"}},{"$f":"VLOOKUP($C7,'Vysledky-doplneni'!$C$7:$J$18,6,0)","v":{"$error":"#N/A"}},{"$f":"VLOOKUP($C7,'Vysledky-doplneni'!$C$7:$J$18,7,0)","v":{"$error":"#N/A"}}]
[null,null,"Zázvorka Pavel","A",{"$f":"VLOOKUP(C8,'Vysledky-doplneni'!$C$7:$J$18,3,0)","v":{"$error":"#N/A"}},{"$f":"VLOOKUP($C8,'Vysledky-doplneni'!$C$7:$J$18,4,0)","v":{"$error":"#N/A"}},{"$f":"VLOOKUP($C8,'Vysledky-doplneni'!$C$7:$J$18,5,0)","v":{"$error":"#N/A"}},{"$f":"VLOOKUP($C8,'Vysledky-doplneni'!$C$7:$J$18,6,0)","v":{"$error":"#N/A"}},{"$f":"VLOOKUP($C8,'Vysledky-doplneni'!$C$7:$J$18,7,0)","v":{"$error":"#N/A"}}]
[null,null,"Honz Petr","B",{"$f":"VLOOKUP(C9,'Vysledky-doplneni'!$C$7:$J$18,3,0)","v":{"$error":"#N/A"}},{"$f":"VLOOKUP($C9,'Vysledky-doplneni'!$C$7:$J$18,4,0)","v":{"$error":"#N/A"}},{"$f":"VLOOKUP($C9,'Vysledky-doplneni'!$C$7:$J$18,5,0)","v":{"$error":"#N/A"}},{"$f":"VLOOKUP($C9,'Vysledky-doplneni'!$C$7:$J$18,6,0)","v":{"$error":"#N/A"}},{"$f":"VLOOKUP($C9,'Vysledky-doplneni'!$C$7:$J$18,7,0)","v":{"$error":"#N/A"}}]
[null,null,"Kodeš Václav","B",{"$f":"VLOOKUP(C10,'Vysledky-doplneni'!$C$7:$J$18,3,0)","v":{"$error":"#N/A"}},{"$f":"VLOOKUP($C10,'Vysledky-doplneni'!$C$7:$J$18,4,0)","v":{"$error":"#N/A"}},{"$f":"VLOOKUP($C10,'Vysledky-doplneni'!$C$7:$J$18,5,0)","v":{"$error":"#N/A"}},{"$f":"VLOOKUP($C10,'Vysledky-doplneni'!$C$7:$J$18,6,0)","v":{"$error":"#N/A"}},{"$f":"VLOOKUP($C10,'Vysledky-doplneni'!$C$7:$J$18,7,0)","v":{"$error":"#N/A"}}]
[null,null,"Pacal Antonín","B",{"$f":"VLOOKUP(C11,'Vysledky-doplneni'!$C$7:$J$18,3,0)","v":{"$error":"#N/A"}},{"$f":"VLOOKUP($C11,'Vysledky-doplneni'!$C$7:$J$18,4,0)","v":{"$error":"#N/A"}},{"$f":"VLOOKUP($C11,'Vysledky-doplneni'!$C$7:$J$18,5,0)","v":{"$error":"#N/A"}},{"$f":"VLOOKUP($C11,'Vysledky-doplneni'!$C$7:$J$18,6,0)","v":{"$error":"#N/A"}},{"$f":"VLOOKUP($C11,'Vysledky-doplneni'!$C$7:$J$18,7,0)","v":{"$error":"#N/A"}}]
[null,null,"Není v tabulce ASATu","C",{"$f":"VLOOKUP(C12,'Vysledky-doplneni'!$C$7:$J$18,3,0)","v":{"$error":"#N/A"}},{"$f":"VLOOKUP($C12,'Vysledky-doplneni'!$C$7:$J$18,4,0)","v":{"$error":"#N/A"}},{"$f":"VLOOKUP($C12,'Vysledky-doplneni'!$C$7:$J$18,5,0)","v":{"$error":"#N/A"}},{"$f":"VLOOKUP($C12,'Vysledky-doplneni'!$C$7:$J$18,6,0)","v":{"$error":"#N/A"}},{"$f":"VLOOKUP($C12,'Vysledky-doplneni'!$C$7:$J$18,7,0)","v":{"$error":"#N/A"}}]
[null,null,"Divíšek Martin ml.","J",{"$f":"VLOOKUP(C13,'Vysledky-doplneni'!$C$7:$J$18,3,0)","v":{"$error":"#N/A"}},{"$f":"VLOOKUP($C13,'Vysledky-doplneni'!$C$7:$J$18,4,0)","v":{"$error":"#N/A"}},{"$f":"VLOOKUP($C13,'Vysledky-doplneni'!$C$7:$J$18,5,0)","v":{"$error":"#N/A"}},{"$f":"VLOOKUP($C13,'Vysledky-doplneni'!$C$7:$J$18,6,0)","v":{"$error":"#N/A"}},{"$f":"VLOOKUP($C13,'Vysledky-doplneni'!$C$7:$J$18,7,0)","v":{"$error":"#N/A"}}]
[null,null,"Hřebec Jan ml.","J",{"$f":"VLOOKUP(C14,'Vysledky-doplneni'!$C$7:$J$18,3,0)","v":{"$error":"#N/A"}},{"$f":"VLOOKUP($C14,'Vysledky-doplneni'!$C$7:$J$18,4,0)","v":{"$error":"#N/A"}},{"$f":"VLOOKUP($C14,'Vysledky-doplneni'!$C$7:$J$18,5,0)","v":{"$error":"#N/A"}},{"$f":"VLOOKUP($C14,'Vysledky-doplneni'!$C$7:$J$18,6,0)","v":{"$error":"#N/A"}},{"$f":"VLOOKUP($C14,'Vysledky-doplneni'!$C$7:$J$18,7,0)","v":{"$error":"#N/A"}}]
[null,null,"Jankovský Jakub","J",{"$f":"VLOOKUP(C15,'Vysledky-doplneni'!$C$7:$J$18,3,0)","v":{"$error":"#N/A"}},{"$f":"VLOOKUP($C15,'Vysledky-doplneni'!$C$7:$J$18,4,0)","v":{"$error":"#N/A"}},{"$f":"VLOOKUP($C15,'Vysledky-doplneni'!$C$7:$J$18,5,0)","v":{"$error":"#N/A"}},{"$f":"VLOOKUP($C15,'Vysledky-doplneni'!$C$7:$J$18,6,0)","v":{"$error":"#N/A"}},{"$f":"VLOOKUP($C15,'Vysledky-doplneni'!$C$7:$J$18,7,0)","v":{"$error":"#N/A"}}]
[null,null,"Štenglová Michaela","J",{"$f":"VLOOKUP(C16,'Vysledky-doplneni'!$C$7:$J$18,3,0)","v":{"$error":"#N/A"}},{"$f":"VLOOKUP($C16,'Vysledky-doplneni'!$C$7:$J$18,4,0)","v":{"$error":"#N/A"}},{"$f":"VLOOKUP($C16,'Vysledky-doplneni'!$C$7:$J$18,5,0)","v":{"$error":"#N/A"}},{"$f":"VLOOKUP($C16,'Vysledky-doplneni'!$C$7:$J$18,6,0)","v":{"$error":"#N/A"}},{"$f":"VLOOKUP($C16,'Vysledky-doplneni'!$C$7:$J$18,7,0)","v":{"$error":"#N/A"}}]
[null,null,"Neuvirt Václav","V",{"$f":"VLOOKUP(C17,'Vysledky-doplneni'!$C$7:$J$18,3,0)","v":{"$error":"#N/A"}},{"$f":"VLOOKUP($C17,'Vysledky-doplneni'!$C$7:$J$18,4,0)","v":{"$error":"#N/A"}},{"$f":"VLOOKUP($C17,'Vysledky-doplneni'!$C$7:$J$18,5,0)","v":{"$error":"#N/A"}},{"$f":"VLOOKUP($C17,'Vysledky-doplneni'!$C$7:$J$18,6,0)","v":{"$error":"#N/A"}},{"$f":"VLOOKUP($C17,'Vysledky-doplneni'!$C$7:$J$18,7,0)","v":{"$error":"#N/A"}}]

{"sheet":"SkS-1","index":3,"n_rows":26,"n_cols":31,"rows_kept":26,"hidden":true,"merged":[[1,0,1,30],[2,0,2,30],[3,0,3,30],[5,0,5,1],[5,5,5,8],[5,9,5,12],[5,13,5,16],[5,17,5,20],[5,25,5,28],[5,29,6,29],[5,30,6,30],[6,1,6,3],[6,5,6,28],[7,0,9,0],[7,1,9,3],[7,4,9,4],[7,5,7,8],[7,9,7,12],[7,13,7,16],[7,17,7,20],[7,21,7,24],[7,25,9,28],[7,29,9,29],[7,30,9,30],[10,0,12,0],[10,1,12,3],[10,4,12,4],[10,5,10,8],[10,9,10,12],[10,13,10,16],[10,17,10,20],[10,21,12,24],[10,25,10,28],[10,29,12,29],[10,30,12,30],[13,0,15,0],[13,1,15,3],[13,4,15,4],[13,5,13,8],[13,9,13,12],[13,13,13,16],[13,17,15,20],[13,21,13,24],[13,25,13,28],[13,29,15,29],[13,30,15,30],[16,0,18,0],[16,1,18,3],[16,4,18,4],[16,5,16,8],[16,9,16,12],[16,13,18,16],[16,17,16,20],[16,21,16,24],[16,25,16,28],[16,29,18,29],[16,30,18,30],[19,0,21,0],[19,1,21,3],[19,4,21,4],[19,5,19,8],[19,9,21,12],[19,13,19,16],[19,17,19,20],[19,21,19,24],[19,25,19,28],[19,29,21,29],[19,30,21,30],[22,0,24,0],[22,1,24,3],[22,4,24,4],[22,5,24,8],[22,9,22,12],[22,13,22,16],[22,17,22,20],[22,21,22,24],[22,25,22,28],[22,29,24,29],[22,30,24,30],[25,0,25,4]]}
[]
["POLOŽKOVÝ LIST                                                                                      "]
[{"$f":"Vstup!C2&IF(Vstup!C3<>\"\",\", \"&Vstup!C3,\"\")","v":"COMPAK SPORTING SPECIÁL, 160 terčů"}]
[{"$f":"Vstup!C4&\", \"&Vstup!C5","v":"COMPAK SPORTING, 3.6.2012"}]
[]
["Skupina: ",null,1,"Kolo :",1,"Rozhodčí:",{"$nulls":23},"∑","Podpis"]
["St. č.","Příjmení, jméno",null,null,"Kat.","Terče"]
[1,{"$nulls":3},{"$error":"#N/A"},"Stanoviště 1",{"$nulls":3},"Stanoviště 2",{"$nulls":3},"Stanoviště 3",{"$nulls":3},"Stanoviště 4",{"$nulls":3},"Stanoviště 5"]
[{"$nulls":5},1,2,3,4,5,6,7,8,9,10,11,12,13,14,15,16,17,18,19,20]
[]
[2,{"$nulls":3},{"$error":"#N/A"},"Stanoviště 2",{"$nulls":3},"Stanoviště 3",{"$nulls":3},"Stanoviště 4",{"$nulls":3},"Stanoviště 5",{"$nulls":7},"Stanoviště 1"]
[{"$nulls":5},1,2,3,4,5,6,7,8,9,10,11,12,13,14,15,16,{"$nulls":4},17,18,19,20]
[]
[3,{"$nulls":3},{"$error":"#N/A"},"Stanoviště 3",{"$nulls":3},"Stanoviště 4",{"$nulls":3},"Stanoviště 5",{"$nulls":7},"Stanoviště 1",{"$nulls":3},"Stanoviště 2"]
[{"$nulls":5},1,2,3,4,5,6,7,8,9,10,11,12,{"$nulls":4},13,14,15,16,17,18,19,20]
[]
[4,{"$nulls":3},{"$error":"#N/A"},"Stanoviště 4",{"$nulls":3},"Stanoviště 5",{"$nulls":7},"Stanoviště 1",{"$nulls":3},"Stanoviště 2",{"$nulls":3},"Stanoviště 3"]
[{"$nulls":5},1,2,3,4,5,6,7,8,{"$nulls":4},9,10,11,12,13,14,15,16,17,18,19,20]
[]
[5,{"$nulls":3},{"$error":"#N/A"},"Stanoviště 5",{"$nulls":7},"Stanoviště 1",{"$nulls":3},"Stanoviště 2",{"$nulls":3},"Stanoviště 3",{"$nulls":3},"Stanoviště 4"]
[{"$nulls":5},1,2,3,4,{"$nulls":4},5,6,7,8,9,10,11,12,13,14,15,16,17,18,19,20]
[]
[6,{"$nulls":3},{"$error":"#N/A"},{"$nulls":4},"Stanoviště 1",{"$nulls":3},"Stanoviště 2",{"$nulls":3},"Stanoviště 3",{"$nulls":3},"Stanoviště 4",{"$nulls":3},"Stanoviště 5"]
[{"$nulls":9},1,2,3,4,5,6,7,8,9,10,11,12,13,14,15,16,17,18,19,20]
[]
["Poznámky:"]

{"sheet":"SkS-2","index":4,"n_rows":26,"n_cols":31,"rows_kept":26,"hidden":true,"merged":[[1,0,1,30],[2,0,2,30],[3,0,3,30],[5,0,5,1],[5,5,5,8],[5,9,5,12],[5,13,5,16],[5,17,5,20],[5,25,5,28],[5,29,6,29],[5,30,6,30],[6,1,6,3],[6,5,6,28],[7,0,9,0],[7,1,9,3],[7,4,9,4],[7,5,7,8],[7,9,7,12],[7,13,7,16],[7,17,7,20],[7,21,7,24],[7,25,9,28],[7,29,9,29],[7,30,9,30],[10,0,12,0],[10,1,12,3],[10,4,12,4],[10,5,10,8],[10,9,10,12],[10,13,10,16],[10,17,10,20],[10,21,12,24],[10,25,10,28],[10,29,12,29],[10,30,12,30],[13,0,15,0],[13,1,15,3],[13,4,15,4],[13,5,13,8],[13,9,13,12],[13,13,13,16],[13,17,15,20],[13,21,13,24],[13,25,13,28],[13,29,15,29],[13,30,15,30],[16,0,18,0],[16,1,18,3],[16,4,18,4],[16,5,16,8],[16,9,16,12],[16,13,18,16],[16,17,16,20],[16,21,16,24],[16,25,16,28],[16,29,18,29],[16,30,18,30],[19,0,21,0],[19,1,21,3],[19,4,21,4],[19,5,19,8],[19,9,21,12],[19,13,19,16],[19,17,19,20],[19,21,19,24],[19,25,19,28],[19,29,21,29],[19,30,21,30],[22,0,24,0],[22,1,24,3],[22,4,24,4],[22,5,24,8],[22,9,22,12],[22,13,22,16],[22,17,22,20],[22,21,22,24],[22,25,22,28],[22,29,24,29],[22,30,24,30],[25,0,25,4]]}
[]
["POLOŽKOVÝ LIST                                                                                      "]
[{"$f":"Vstup!C2&IF(Vstup!C3<>\"\",\", \"&Vstup!C3,\"\")","v":"COMPAK SPORTING SPECIÁL, 160 terčů"}]
[{"$f":"Vstup!C4&\", \"&Vstup!C5","v":"COMPAK SPORTING, 3.6.2012"}]
[]
["Skupina: ",null,2,"Kolo :",1,"Rozhodčí:",{"$nulls":23},"∑","Podpis"]
["St. č.","Příjmení, jméno",null,null,"Kat.","Terče"]
[7,{"$nulls":3},{"$error":"#N/A"},"Stanoviště 1",{"$nulls":3},"Stanoviště 2",{"$nulls":3},"Stanoviště 3",{"$nulls":3},"Stanoviště 4",{"$nulls":3},"Stanoviště 5"]
[{"$nulls":5},1,2,3,4,5,6,7,8,9,10,11,12,13,14,15,16,17,18,19,20]
[]
[8,{"$nulls":3},{"$error":"#N/A"},"Stanoviště 2",{"$nulls":3},"Stanoviště 3",{"$nulls":3},"Stanoviště 4",{"$nulls":3},"Stanoviště 5",{"$nulls":7},"Stanoviště 1"]
[{"$nulls":5},1,2,3,4,5,6,7,8,9,10,11,12,13,14,15,16,{"$nulls":4},17,18,19,20]
[]
[9,{"$nulls":3},{"$error":"#N/A"},"Stanoviště 3",{"$nulls":3},"Stanoviště 4",{"$nulls":3},"Stanoviště 5",{"$nulls":7},"Stanoviště 1",{"$nulls":3},"Stanoviště 2"]
[{"$nulls":5},1,2,3,4,5,6,7,8,9,10,11,12,{"$nulls":4},13,14,15,16,17,18,19,20]
[]
[10,{"$nulls":3},{"$error":"#N/A"},"Stanoviště 4",{"$nulls":3},"Stanoviště 5",{"$nulls":7},"Stanoviště 1",{"$nulls":3},"Stanoviště 2",{"$nulls":3},"Stanoviště 3"]
[{"$nulls":5},1,2,3,4,5,6,7,8,{"$nulls":4},9,10,11,12,13,14,15,16,17,18,19,20]
[]
[11,{"$nulls":3},{"$error":"#N/A"},"Stanoviště 5",{"$nulls":7},"Stanoviště 1",{"$nulls":3},"Stanoviště 2",{"$nulls":3},"Stanoviště 3",{"$nulls":3},"Stanoviště 4"]
[{"$nulls":5},1,2,3,4,{"$nulls":4},5,6,7,8,9,10,11,12,13,14,15,16,17,18,19,20]
[]
[12,{"$nulls":3},{"$error":"#N/A"},{"$nulls":4},"Stanoviště 1",{"$nulls":3},"Stanoviště 2",{"$nulls":3},"Stanoviště 3",{"$nulls":3},"Stanoviště 4",{"$nulls":3},"Stanoviště 5"]
[{"$nulls":9},1,2,3,4,5,6,7,8,9,10,11,12,13,14,15,16,17,18,19,20]
[]
["Poznámky:"]

{"sheet":"SkS-3","index":5,"n_rows":26,"n_cols":31,"rows_kept":26,"hidden":true,"merged":[[1,0,1,30],[2,0,2,30],[3,0,3,30],[5,0,5,1],[5,5,5,8],[5,9,5,12],[5,13,5,16],[5,17,5,20],[5,25,5,28],[5,29,6,29],[5,30,6,30],[6,1,6,3],[6,5,6,28],[7,0,9,0],[7,1,9,3],[7,4,9,4],[7,5,7,8],[7,9,7,12],[7,13,7,16],[7,17,7,20],[7,21,7,24],[7,25,9,28],[7,29,9,29],[7,30,9,30],[10,0,12,0],[10,1,12,3],[10,4,12,4],[10,5,10,8],[10,9,10,12],[10,13,10,16],[10,17,10,20],[10,21,12,24],[10,25,10,28],[10,29,12,29],[10,30,12,30],[13,0,15,0],[13,1,15,3],[13,4,15,4],[13,5,13,8],[13,9,13,12],[13,13,13,16],[13,17,15,20],[13,21,13,24],[13,25,13,28],[13,29,15,29],[13,30,15,30],[16,0,18,0],[16,1,18,3],[16,4,18,4],[16,5,16,8],[16,9,16,12],[16,13,18,16],[16,17,16,20],[16,21,16,24],[16,25,16,28],[16,29,18,29],[16,30,18,30],[19,0,21,0],[19,1,21,3],[19,4,21,4],[19,5,19,8],[19,9,21,12],[19,13,19,16],[19,17,19,20],[19,21,19,24],[19,25,19,28],[19,29,21,29],[19,30,21,30],[22,0,24,0],[22,1,24,3],[22,4,24,4],[22,5,24,8],[22,9,22,12],[22,13,22,16],[22,17,22,20],[22,21,22,24],[22,25,22,28],[22,29,24,29],[22,30,24,30],[25,0,25,4]]}
[]
["POLOŽKOVÝ LIST                                                                                      "]
[{"$f":"Vstup!C2&IF(Vstup!C3<>\"\",\", \"&Vstup!C3,\"\")","v":"COMPAK SPORTING SPECIÁL, 160 terčů"}]
[{"$f":"Vstup!C4&\", \"&Vstup!C5","v":"COMPAK SPORTING, 3.6.2012"}]
[]
["Skupina: ",null,3,"Kolo :",1,"Rozhodčí:",{"$nulls":23},"∑","Podpis"]
["St. č.","Příjmení, jméno",null,null,"Kat.","Terče"]
[13,{"$nulls":3},{"$error":"#N/A"},"Stanoviště 1",{"$nulls":3},"Stanoviště 2",{"$nulls":3},"Stanoviště 3",{"$nulls":3},"Stanoviště 4",{"$nulls":3},"Stanoviště 5"]
[{"$nulls":5},1,2,3,4,5,6,7,8,9,10,11,12,13,14,15,16,17,18,19,20]
[]
[14,{"$nulls":3},{"$error":"#N/A"},"Stanoviště 2",{"$nulls":3},"Stanoviště 3",{"$nulls":3},"Stanoviště 4",{"$nulls":3},"Stanoviště 5",{"$nulls":7},"Stanoviště 1"]
[{"$nulls":5},1,2,3,4,5,6,7,8,9,10,11,12,13,14,15,16,{"$nulls":4},17,18,19,20]
[]
[15,{"$nulls":3},{"$error":"#N/A"},"Stanoviště 3",{"$nulls":3},"Stanoviště 4",{"$nulls":3},"Stanoviště 5",{"$nulls":7},"Stanoviště 1",{"$nulls":3},"Stanoviště 2"]
[{"$nulls":5},1,2,3,4,5,6,7,8,9,10,11,12,{"$nulls":4},13,14,15,16,17,18,19,20]
[]
[16,{"$nulls":3},{"$error":"#N/A"},"Stanoviště 4",{"$nulls":3},"Stanoviště 5",{"$nulls":7},"Stanoviště 1",{"$nulls":3},"Stanoviště 2",{"$nulls":3},"Stanoviště 3"]
[{"$nulls":5},1,2,3,4,5,6,7,8,{"$nulls":4},9,10,11,12,13,14,15,16,17,18,19,20]
[]
[17,{"$nulls":3},{"$error":"#N/A"},"Stanoviště 5",{"$nulls":7},"Stanoviště 1",{"$nulls":3},"Stanoviště 2",{"$nulls":3},"Stanoviště 3",{"$nulls":3},"Stanoviště 4"]
[{"$nulls":5},1,2,3,4,{"$nulls":4},5,6,7,8,9,10,11,12,13,14,15,16,17,18,19,20]
[]
[18,{"$nulls":3},{"$error":"#N/A"},{"$nulls":4},"Stanoviště 1",{"$nulls":3},"Stanoviště 2",{"$nulls":3},"Stanoviště 3",{"$nulls":3},"Stanoviště 4",{"$nulls":3},"Stanoviště 5"]
[{"$nulls":9},1,2,3,4,5,6,7,8,9,10,11,12,13,14,15,16,17,18,19,20]
[]
["Poznámky:"]

{"sheet":"SkS-4","index":6,"n_rows":26,"n_cols":31,"rows_kept":26,"hidden":true,"merged":[[1,0,1,30],[2,0,2,30],[3,0,3,30],[5,0,5,1],[5,5,5,8],[5,9,5,12],[5,13,5,16],[5,17,5,20],[5,25,5,28],[5,29,6,29],[5,30,6,30],[6,1,6,3],[6,5,6,28],[7,0,9,0],[7,1,9,3],[7,4,9,4],[7,5,7,8],[7,9,7,12],[7,13,7,16],[7,17,7,20],[7,21,7,24],[7,25,9,28],[7,29,9,29],[7,30,9,30],[10,0,12,0],[10,1,12,3],[10,4,12,4],[10,5,10,8],[10,9,10,12],[10,13,10,16],[10,17,10,20],[10,21,12,24],[10,25,10,28],[10,29,12,29],[10,30,12,30],[13,0,15,0],[13,1,15,3],[13,4,15,4],[13,5,13,8],[13,9,13,12],[13,13,13,16],[13,17,15,20],[13,21,13,24],[13,25,13,28],[13,29,15,29],[13,30,15,30],[16,0,18,0],[16,1,18,3],[16,4,18,4],[16,5,16,8],[16,9,16,12],[16,13,18,16],[16,17,16,20],[16,21,16,24],[16,25,16,28],[16,29,18,29],[16,30,18,30],[19,0,21,0],[19,1,21,3],[19,4,21,4],[19,5,19,8],[19,9,21,12],[19,13,19,16],[19,17,19,20],[19,21,19,24],[19,25,19,28],[19,29,21,29],[19,30,21,30],[22,0,24,0],[22,1,24,3],[22,4,24,4],[22,5,24,8],[22,9,22,12],[22,13,22,16],[22,17,22,20],[22,21,22,24],[22,25,22,28],[22,29,24,29],[22,30,24,30],[25,0,25,4]]}
[]
["POLOŽKOVÝ LIST                                                                                      "]
[{"$f":"Vstup!C2&IF(Vstup!C3<>\"\",\", \"&Vstup!C3,\"\")","v":"COMPAK SPORTING SPECIÁL, 160 terčů"}]
[{"$f":"Vstup!C4&\", \"&Vstup!C5","v":"COMPAK SPORTING, 3.6.2012"}]
[]
["Skupina: ",null,4,"Kolo :",1,"Rozhodčí:",{"$nulls":23},"∑","Podpis"]
["St. č.","Příjmení, jméno",null,null,"Kat.","Terče"]
[19,{"$nulls":3},{"$error":"#N/A"},"Stanoviště 1",{"$nulls":3},"Stanoviště 2",{"$nulls":3},"Stanoviště 3",{"$nulls":3},"Stanoviště 4",{"$nulls":3},"Stanoviště 5"]
[{"$nulls":5},1,2,3,4,5,6,7,8,9,10,11,12,13,14,15,16,17,18,19,20]
[]
[20,{"$nulls":3},{"$error":"#N/A"},"Stanoviště 2",{"$nulls":3},"Stanoviště 3",{"$nulls":3},"Stanoviště 4",{"$nulls":3},"Stanoviště 5",{"$nulls":7},"Stanoviště 1"]
[{"$nulls":5},1,2,3,4,5,6,7,8,9,10,11,12,13,14,15,16,{"$nulls":4},17,18,19,20]
[]
[21,{"$nulls":3},{"$error":"#N/A"},"Stanoviště 3",{"$nulls":3},"Stanoviště 4",{"$nulls":3},"Stanoviště 5",{"$nulls":7},"Stanoviště 1",{"$nulls":3},"Stanoviště 2"]
[{"$nulls":5},1,2,3,4,5,6,7,8,9,10,11,12,{"$nulls":4},13,14,15,16,17,18,19,20]
[]
[22,{"$nulls":3},{"$error":"#N/A"},"Stanoviště 4",{"$nulls":3},"Stanoviště 5",{"$nulls":7},"Stanoviště 1",{"$nulls":3},"Stanoviště 2",{"$nulls":3},"Stanoviště 3"]
[{"$nulls":5},1,2,3,4,5,6,7,8,{"$nulls":4},9,10,11,12,13,14,15,16,17,18,19,20]
[]
[23,{"$nulls":3},{"$error":"#N/A"},"Stanoviště 5",{"$nulls":7},"Stanoviště 1",{"$nulls":3},"Stanoviště 2",{"$nulls":3},"Stanoviště 3",{"$nulls":3},"Stanoviště 4"]
[{"$nulls":5},1,2,3,4,{"$nulls":4},5,6,7,8,9,10,11,12,13,14,15,16,17,18,19,20]
[]
[24,{"$nulls":3},{"$error":"#N/A"},{"$nulls":4},"Stanoviště 1",{"$nulls":3},"Stanoviště 2",{"$nulls":3},"Stanoviště 3",{"$nulls":3},"Stanoviště 4",{"$nulls":3},"Stanoviště 5"]
[{"$nulls":9},1,2,3,4,5,6,7,8,9,10,11,12,13,14,15,16,17,18,19,20]
[]
["Poznámky:"]

{"sheet":"SkS-5","index":7,"n_rows":26,"n_cols":31,"rows_kept":26,"hidden":true,"merged":[[1,0,1,30],[2,0,2,30],[3,0,3,30],[5,0,5,1],[5,5,5,8],[5,9,5,12],[5,13,5,16],[5,17,5,20],[5,25,5,28],[5,29,6,29],[5,30,6,30],[6,1,6,3],[6,5,6,28],[7,0,9,0],[7,1,9,3],[7,4,9,4],[7,5,7,8],[7,9,7,12],[7,13,7,16],[7,17,7,20],[7,21,7,24],[7,25,9,28],[7,29,9,29],[7,30,9,30],[10,0,12,0],[10,1,12,3],[10,4,12,4],[10,5,10,8],[10,9,10,12],[10,13,10,16],[10,17,10,20],[10,21,12,24],[10,25,10,28],[10,29,12,29],[10,30,12,30],[13,0,15,0],[13,1,15,3],[13,4,15,4],[13,5,13,8],[13,9,13,12],[13,13,13,16],[13,17,15,20],[13,21,13,24],[13,25,13,28],[13,29,15,29],[13,30,15,30],[16,0,18,0],[16,1,18,3],[16,4,18,4],[16,5,16,8],[16,9,16,12],[16,13,18,16],[16,17,16,20],[16,21,16,24],[16,25,16,28],[16,29,18,29],[16,30,18,30],[19,0,21,0],[19,1,21,3],[19,4,21,4],[19,5,19,8],[19,9,21,12],[19,13,19,16],[19,17,19,20],[19,21,19,24],[19,25,19,28],[19,29,21,29],[19,30,21,30],[22,0,24,0],[22,1,24,3],[22,4,24,4],[22,5,24,8],[22,9,22,12],[22,13,22,16],[22,17,22,20],[22,21,22,24],[22,25,22,28],[22,29,24,29],[22,30,24,30],[25,0,25,4]]}
[]
["POLOŽKOVÝ LIST                                                                                      "]
[{"$f":"Vstup!C2&IF(Vstup!C3<>\"\",\", \"&Vstup!C3,\"\")","v":"COMPAK SPORTING SPECIÁL, 160 terčů"}]
[{"$f":"Vstup!C4&\", \"&Vstup!C5","v":"COMPAK SPORTING, 3.6.2012"}]
[]
["Skupina: ",null,5,"Kolo :",1,"Rozhodčí:",{"$nulls":23},"∑","Podpis"]
["St. č.","Příjmení, jméno",null,null,"Kat.","Terče"]
[25,{"$nulls":3},{"$error":"#N/A"},"Stanoviště 1",{"$nulls":3},"Stanoviště 2",{"$nulls":3},"Stanoviště 3",{"$nulls":3},"Stanoviště 4",{"$nulls":3},"Stanoviště 5"]
[{"$nulls":5},1,2,3,4,5,6,7,8,9,10,11,12,13,14,15,16,17,18,19,20]
[]
[26,{"$nulls":3},{"$error":"#N/A"},"Stanoviště 2",{"$nulls":3},"Stanoviště 3",{"$nulls":3},"Stanoviště 4",{"$nulls":3},"Stanoviště 5",{"$nulls":7},"Stanoviště 1"]
[{"$nulls":5},1,2,3,4,5,6,7,8,9,10,11,12,13,14,15,16,{"$nulls":4},17,18,19,20]
[]
[27,{"$nulls":3},{"$error":"#N/A"},"Stanoviště 3",{"$nulls":3},"Stanoviště 4",{"$nulls":3},"Stanoviště 5",{"$nulls":7},"Stanoviště 1",{"$nulls":3},"Stanoviště 2"]
[{"$nulls":5},1,2,3,4,5,6,7,8,9,10,11,12,{"$nulls":4},13,14,15,16,17,18,19,20]
[]
[28,{"$nulls":3},{"$error":"#N/A"},"Stanoviště 4",{"$nulls":3},"Stanoviště 5",{"$nulls":7},"Stanoviště 1",{"$nulls":3},"Stanoviště 2",{"$nulls":3},"Stanoviště 3"]
[{"$nulls":5},1,2,3,4,5,6,7,8,{"$nulls":4},9,10,11,12,13,14,15,16,17,18,19,20]
[]
[29,{"$nulls":3},{"$error":"#N/A"},"Stanoviště 5",{"$nulls":7},"Stanoviště 1",{"$nulls":3},"Stanoviště 2",{"$nulls":3},"Stanoviště 3",{"$nulls":3},"Stanoviště 4"]
[{"$nulls":5},1,2,3,4,{"$nulls":4},5,6,7,8,9,10,11,12,13,14,15,16,17,18,19,20]
[]
[30,{"$nulls":3},{"$error":"#N/A"},{"$nulls":4},"Stanoviště 1",{"$nulls":3},"Stanoviště 2",{"$nulls":3},"Stanoviště 3",{"$nulls":3},"Stanoviště 4",{"$nulls":3},"Stanoviště 5"]
[{"$nulls":9},1,2,3,4,5,6,7,8,9,10,11,12,13,14,15,16,17,18,19,20]
[]
["Poznámky:"]

{"sheet":"SkS-6","index":8,"n_rows":26,"n_cols":31,"rows_kept":26,"hidden":true,"merged":[[1,0,1,30],[2,0,2,30],[3,0,3,30],[5,0,5,1],[5,5,5,8],[5,9,5,12],[5,13,5,16],[5,17,5,20],[5,25,5,28],[5,29,6,29],[5,30,6,30],[6,1,6,3],[6,5,6,28],[7,0,9,0],[7,1,9,3],[7,4,9,4],[7,5,7,8],[7,9,7,12],[7,13,7,16],[7,17,7,20],[7,21,7,24],[7,25,9,28],[7,29,9,29],[7,30,9,30],[10,0,12,0],[10,1,12,3],[10,4,12,4],[10,5,10,8],[10,9,10,12],[10,13,10,16],[10,17,10,20],[10,21,12,24],[10,25,10,28],[10,29,12,29],[10,30,12,30],[13,0,15,0],[13,1,15,3],[13,4,15,4],[13,5,13,8],[13,9,13,12],[13,13,13,16],[13,17,15,20],[13,21,13,24],[13,25,13,28],[13,29,15,29],[13,30,15,30],[16,0,18,0],[16,1,18,3],[16,4,18,4],[16,5,16,8],[16,9,16,12],[16,13,18,16],[16,17,16,20],[16,21,16,24],[16,25,16,28],[16,29,18,29],[16,30,18,30],[19,0,21,0],[19,1,21,3],[19,4,21,4],[19,5,19,8],[19,9,21,12],[19,13,19,16],[19,17,19,20],[19,21,19,24],[19,25,19,28],[19,29,21,29],[19,30,21,30],[22,0,24,0],[22,1,24,3],[22,4,24,4],[22,5,24,8],[22,9,22,12],[22,13,22,16],[22,17,22,20],[22,21,22,24],[22,25,22,28],[22,29,24,29],[22,30,24,30],[25,0,25,4]]}
[]
["POLOŽKOVÝ LIST                                                                                      "]
[{"$f":"Vstup!C2&IF(Vstup!C3<>\"\",\", \"&Vstup!C3,\"\")","v":"COMPAK SPORTING SPECIÁL, 160 terčů"}]
[{"$f":"Vstup!C4&\", \"&Vstup!C5","v":"COMPAK SPORTING, 3.6.2012"}]
[]
["Skupina: ",null,6,"Kolo :",1,"Rozhodčí:",{"$nulls":23},"∑","Podpis"]
["St. č.","Příjmení, jméno",null,null,"Kat.","Terče"]
[31,{"$nulls":3},{"$error":"#N/A"},"Stanoviště 1",{"$nulls":3},"Stanoviště 2",{"$nulls":3},"Stanoviště 3",{"$nulls":3},"Stanoviště 4",{"$nulls":3},"Stanoviště 5"]
[{"$nulls":5},1,2,3,4,5,6,7,8,9,10,11,12,13,14,15,16,17,18,19,20]
[]
[32,{"$nulls":3},{"$error":"#N/A"},"Stanoviště 2",{"$nulls":3},"Stanoviště 3",{"$nulls":3},"Stanoviště 4",{"$nulls":3},"Stanoviště 5",{"$nulls":7},"Stanoviště 1"]
[{"$nulls":5},1,2,3,4,5,6,7,8,9,10,11,12,13,14,15,16,{"$nulls":4},17,18,19,20]
[]
[33,{"$nulls":3},{"$error":"#N/A"},"Stanoviště 3",{"$nulls":3},"Stanoviště 4",{"$nulls":3},"Stanoviště 5",{"$nulls":7},"Stanoviště 1",{"$nulls":3},"Stanoviště 2"]
[{"$nulls":5},1,2,3,4,5,6,7,8,9,10,11,12,{"$nulls":4},13,14,15,16,17,18,19,20]
[]
[34,{"$nulls":3},{"$error":"#N/A"},"Stanoviště 4",{"$nulls":3},"Stanoviště 5",{"$nulls":7},"Stanoviště 1",{"$nulls":3},"Stanoviště 2",{"$nulls":3},"Stanoviště 3"]
[{"$nulls":5},1,2,3,4,5,6,7,8,{"$nulls":4},9,10,11,12,13,14,15,16,17,18,19,20]
[]
[35,{"$nulls":3},{"$error":"#N/A"},"Stanoviště 5",{"$nulls":7},"Stanoviště 1",{"$nulls":3},"Stanoviště 2",{"$nulls":3},"Stanoviště 3",{"$nulls":3},"Stanoviště 4"]
[{"$nulls":5},1,2,3,4,{"$nulls":4},5,6,7,8,9,10,11,12,13,14,15,16,17,18,19,20]
[]
[36,{"$nulls":3},{"$error":"#N/A"},{"$nulls":4},"Stanoviště 1",{"$nulls":3},"Stanoviště 2",{"$nulls":3},"Stanoviště 3",{"$nulls":3},"Stanoviště 4",{"$nulls":3},"Stanoviště 5"]
[{"$nulls":9},1,2,3,4,5,6,7,8,9,10,11,12,13,14,15,16,17,18,19,20]
[]
["Poznámky:"]

{"sheet":"SkS-7","index":9,"n_rows":26,"n_cols":31,"rows_kept":26,"hidden":true,"merged":[[1,0,1,30],[2,0,2,30],[3,0,3,30],[5,0,5,1],[5,5,5,8],[5,9,5,12],[5,13,5,16],[5,17,5,20],[5,25,5,28],[5,29,6,29],[5,30,6,30],[6,1,6,3],[6,5,6,28],[7,0,9,0],[7,1,9,3],[7,4,9,4],[7,5,7,8],[7,9,7,12],[7,13,7,16],[7,17,7,20],[7,21,7,24],[7,25,9,28],[7,29,9,29],[7,30,9,30],[10,0,12,0],[10,1,12,3],[10,4,12,4],[10,5,10,8],[10,9,10,12],[10,13,10,16],[10,17,10,20],[10,21,12,24],[10,25,10,28],[10,29,12,29],[10,30,12,30],[13,0,15,0],[13,1,15,3],[13,4,15,4],[13,5,13,8],[13,9,13,12],[13,13,13,16],[13,17,15,20],[13,21,13,24],[13,25,13,28],[13,29,15,29],[13,30,15,30],[16,0,18,0],[16,1,18,3],[16,4,18,4],[16,5,16,8],[16,9,16,12],[16,13,18,16],[16,17,16,20],[16,21,16,24],[16,25,16,28],[16,29,18,29],[16,30,18,30],[19,0,21,0],[19,1,21,3],[19,4,21,4],[19,5,19,8],[19,9,21,12],[19,13,19,16],[19,17,19,20],[19,21,19,24],[19,25,19,28],[19,29,21,29],[19,30,21,30],[22,0,24,0],[22,1,24,3],[22,4,24,4],[22,5,24,8],[22,9,22,12],[22,13,22,16],[22,17,22,20],[22,21,22,24],[22,25,22,28],[22,29,24,29],[22,30,24,30],[25,0,25,4]]}
[]
["POLOŽKOVÝ LIST                                                                                      "]
[{"$f":"Vstup!C2&IF(Vstup!C3<>\"\",\", \"&Vstup!C3,\"\")","v":"COMPAK SPORTING SPECIÁL, 160 terčů"}]
[{"$f":"Vstup!C4&\", \"&Vstup!C5","v":"COMPAK SPORTING, 3.6.2012"}]
[]
["Skupina: ",null,7,"Kolo :",1,"Rozhodčí:",{"$nulls":23},"∑","Podpis"]
["St. č.","Příjmení, jméno",null,null,"Kat.","Terče"]
[37,{"$nulls":3},{"$error":"#N/A"},"Stanoviště 1",{"$nulls":3},"Stanoviště 2",{"$nulls":3},"Stanoviště 3",{"$nulls":3},"Stanoviště 4",{"$nulls":3},"Stanoviště 5"]
[{"$nulls":5},1,2,3,4,5,6,7,8,9,10,11,12,13,14,15,16,17,18,19,20]
[]
[38,{"$nulls":3},{"$error":"#N/A"},"Stanoviště 2",{"$nulls":3},"Stanoviště 3",{"$nulls":3},"Stanoviště 4",{"$nulls":3},"Stanoviště 5",{"$nulls":7},"Stanoviště 1"]
[{"$nulls":5},1,2,3,4,5,6,7,8,9,10,11,12,13,14,15,16,{"$nulls":4},17,18,19,20]
[]
[39,{"$nulls":3},{"$error":"#N/A"},"Stanoviště 3",{"$nulls":3},"Stanoviště 4",{"$nulls":3},"Stanoviště 5",{"$nulls":7},"Stanoviště 1",{"$nulls":3},"Stanoviště 2"]
[{"$nulls":5},1,2,3,4,5,6,7,8,9,10,11,12,{"$nulls":4},13,14,15,16,17,18,19,20]
[]
[40,{"$nulls":3},{"$error":"#N/A"},"Stanoviště 4",{"$nulls":3},"Stanoviště 5",{"$nulls":7},"Stanoviště 1",{"$nulls":3},"Stanoviště 2",{"$nulls":3},"Stanoviště 3"]
[{"$nulls":5},1,2,3,4,5,6,7,8,{"$nulls":4},9,10,11,12,13,14,15,16,17,18,19,20]
[]
[41,{"$nulls":3},{"$error":"#N/A"},"Stanoviště 5",{"$nulls":7},"Stanoviště 1",{"$nulls":3},"Stanoviště 2",{"$nulls":3},"Stanoviště 3",{"$nulls":3},"Stanoviště 4"]
[{"$nulls":5},1,2,3,4,{"$nulls":4},5,6,7,8,9,10,11,12,13,14,15,16,17,18,19,20]
[]
[42,{"$nulls":3},{"$error":"#N/A"},{"$nulls":4},"Stanoviště 1",{"$nulls":3},"Stanoviště 2",{"$nulls":3},"Stanoviště 3",{"$nulls":3},"Stanoviště 4",{"$nulls":3},"Stanoviště 5"]
[{"$nulls":9},1,2,3,4,5,6,7,8,9,10,11,12,13,14,15,16,17,18,19,20]
[]
["Poznámky:"]

{"sheet":"SkS-8","index":10,"n_rows":26,"n_cols":31,"rows_kept":26,"hidden":true,"merged":[[1,0,1,30],[2,0,2,30],[3,0,3,30],[5,0,5,1],[5,5,5,8],[5,9,5,12],[5,13,5,16],[5,17,5,20],[5,25,5,28],[5,29,6,29],[5,30,6,30],[6,1,6,3],[6,5,6,28],[7,0,9,0],[7,1,9,3],[7,4,9,4],[7,5,7,8],[7,9,7,12],[7,13,7,16],[7,17,7,20],[7,21,7,24],[7,25,9,28],[7,29,9,29],[7,30,9,30],[10,0,12,0],[10,1,12,3],[10,4,12,4],[10,5,10,8],[10,9,10,12],[10,13,10,16],[10,17,10,20],[10,21,12,24],[10,25,10,28],[10,29,12,29],[10,30,12,30],[13,0,15,0],[13,1,15,3],[13,4,15,4],[13,5,13,8],[13,9,13,12],[13,13,13,16],[13,17,15,20],[13,21,13,24],[13,25,13,28],[13,29,15,29],[13,30,15,30],[16,0,18,0],[16,1,18,3],[16,4,18,4],[16,5,16,8],[16,9,16,12],[16,13,18,16],[16,17,16,20],[16,21,16,24],[16,25,16,28],[16,29,18,29],[16,30,18,30],[19,0,21,0],[19,1,21,3],[19,4,21,4],[19,5,19,8],[19,9,21,12],[19,13,19,16],[19,17,19,20],[19,21,19,24],[19,25,19,28],[19,29,21,29],[19,30,21,30],[22,0,24,0],[22,1,24,3],[22,4,24,4],[22,5,24,8],[22,9,22,12],[22,13,22,16],[22,17,22,20],[22,21,22,24],[22,25,22,28],[22,29,24,29],[22,30,24,30],[25,0,25,4]]}
[]
["POLOŽKOVÝ LIST                                                                                      "]
[{"$f":"Vstup!C2&IF(Vstup!C3<>\"\",\", \"&Vstup!C3,\"\")","v":"COMPAK SPORTING SPECIÁL, 160 terčů"}]
[{"$f":"Vstup!C4&\", \"&Vstup!C5","v":"COMPAK SPORTING, 3.6.2012"}]
[]
["Skupina: ",null,8,"Kolo :",1,"Rozhodčí:",{"$nulls":23},"∑","Podpis"]
["St. č.","Příjmení, jméno",null,null,"Kat.","Terče"]
[43,"Divíšek Martin",null,null,"A","Stanoviště 1",{"$nulls":3},"Stanoviště 2",{"$nulls":3},"Stanoviště 3",{"$nulls":3},"Stanoviště 4",{"$nulls":3},"Stanoviště 5"]
[{"$nulls":5},1,2,3,4,5,6,7,8,9,10,11,12,13,14,15,16,17,18,19,20]
[]
[44,"Hřebec Jan",null,null,"A","Stanoviště 2",{"$nulls":3},"Stanoviště 3",{"$nulls":3},"Stanoviště 4",{"$nulls":3},"Stanoviště 5",{"$nulls":7},"Stanoviště 1"]
[{"$nulls":5},1,2,3,4,5,6,7,8,9,10,11,12,13,14,15,16,{"$nulls":4},17,18,19,20]
[]
[45,{"$nulls":3},{"$error":"#N/A"},"Stanoviště 3",{"$nulls":3},"Stanoviště 4",{"$nulls":3},"Stanoviště 5",{"$nulls":7},"Stanoviště 1",{"$nulls":3},"Stanoviště 2"]
[{"$nulls":5},1,2,3,4,5,6,7,8,9,10,11,12,{"$nulls":4},13,14,15,16,17,18,19,20]
[]
[46,{"$nulls":3},{"$error":"#N/A"},"Stanoviště 4",{"$nulls":3},"Stanoviště 5",{"$nulls":7},"Stanoviště 1",{"$nulls":3},"Stanoviště 2",{"$nulls":3},"Stanoviště 3"]
[{"$nulls":5},1,2,3,4,5,6,7,8,{"$nulls":4},9,10,11,12,13,14,15,16,17,18,19,20]
[]
[47,{"$nulls":3},{"$error":"#N/A"},"Stanoviště 5",{"$nulls":7},"Stanoviště 1",{"$nulls":3},"Stanoviště 2",{"$nulls":3},"Stanoviště 3",{"$nulls":3},"Stanoviště 4"]
[{"$nulls":5},1,2,3,4,{"$nulls":4},5,6,7,8,9,10,11,12,13,14,15,16,17,18,19,20]
[]
[48,{"$nulls":3},{"$error":"#N/A"},{"$nulls":4},"Stanoviště 1",{"$nulls":3},"Stanoviště 2",{"$nulls":3},"Stanoviště 3",{"$nulls":3},"Stanoviště 4",{"$nulls":3},"Stanoviště 5"]
[{"$nulls":9},1,2,3,4,5,6,7,8,9,10,11,12,13,14,15,16,17,18,19,20]
[]
["Poznámky:"]

{"sheet":"SkS-16","index":11,"n_rows":20,"n_cols":32,"rows_kept":20,"hidden":true,"merged":[[1,0,1,31],[2,0,2,31],[3,0,3,31],[5,0,5,1],[5,5,5,9],[5,10,5,14],[5,15,5,19],[5,20,5,24],[5,25,5,29],[5,30,6,30],[5,31,6,31],[6,1,6,3],[6,5,6,29],[7,0,8,0],[7,1,8,3],[7,4,8,4],[7,30,8,30],[7,31,8,31],[9,0,10,0],[9,1,10,3],[9,4,10,4],[9,30,10,30],[9,31,10,31],[11,0,12,0],[11,1,12,3],[11,4,12,4],[11,30,12,30],[11,31,12,31],[13,0,14,0],[13,1,14,3],[13,4,14,4],[13,30,14,30],[13,31,14,31],[15,0,16,0],[15,1,16,3],[15,4,16,4],[15,30,16,30],[15,31,16,31],[17,0,18,0],[17,1,18,3],[17,4,18,4],[17,30,18,30],[17,31,18,31],[19,0,19,4]]}
[]
["POLOŽKOVÝ LIST                                                                                      "]
[{"$f":"Vstup!C2&IF(Vstup!C3<>\"\",\", \"&Vstup!C3,\"\")","v":"COMPAK SPORTING SPECIÁL, 160 terčů"}]
[{"$f":"Vstup!C4&\", \"&Vstup!C5","v":"COMPAK SPORTING, 3.6.2012"}]
[]
["Skupina: ",null,1,"Kolo :",1,"Rozhodčí:",{"$nulls":4},"1________________",{"$nulls":4},"2________________",{"$nulls":4},"3________________",{"$nulls":4},"4________________",{"$nulls":4},"∑","Podpis"]
["St. č.","Příjmení, jméno",null,null,"Kat.","Terče"]
[1,"Jankovský Jakub",null,null,"J",25,24,23,22,21,20,19,18,17,16,15,14,13,12,11,10,9,8,7,6,5,4,3,2,1]
[]
[2,"Neuvirt Martin",null,null,"B",25,24,23,22,21,20,19,18,17,16,15,14,13,12,11,10,9,8,7,6,5,4,3,2,1]
[]
[3,"Škanta Marek",null,null,"A",25,24,23,22,21,20,19,18,17,16,15,14,13,12,11,10,9,8,7,6,5,4,3,2,1]
[]
[4,"Neuvirt Václav",null,null,"V",25,24,23,22,21,20,19,18,17,16,15,14,13,12,11,10,9,8,7,6,5,4,3,2,1]
[]
[5,"Koloc Martin",null,null,"B",25,24,23,22,21,20,19,18,17,16,15,14,13,12,11,10,9,8,7,6,5,4,3,2,1]
[]
[6,"Kodeš Václav",null,null,"B",25,24,23,22,21,20,19,18,17,16,15,14,13,12,11,10,9,8,7,6,5,4,3,2,1]
[]
["Poznámky:"]

{"sheet":"SkS-17","index":12,"n_rows":20,"n_cols":32,"rows_kept":20,"hidden":true,"merged":[[1,0,1,31],[2,0,2,31],[3,0,3,31],[5,0,5,1],[5,5,5,9],[5,10,5,14],[5,15,5,19],[5,20,5,24],[5,25,5,29],[5,30,6,30],[5,31,6,31],[6,1,6,3],[6,5,6,29],[7,0,8,0],[7,1,8,3],[7,4,8,4],[7,30,8,30],[7,31,8,31],[9,0,10,0],[9,1,10,3],[9,4,10,4],[9,30,10,30],[9,31,10,31],[11,0,12,0],[11,1,12,3],[11,4,12,4],[11,30,12,30],[11,31,12,31],[13,0,14,0],[13,1,14,3],[13,4,14,4],[13,30,14,30],[13,31,14,31],[15,0,16,0],[15,1,16,3],[15,4,16,4],[15,30,16,30],[15,31,16,31],[17,0,18,0],[17,1,18,3],[17,4,18,4],[17,30,18,30],[17,31,18,31],[19,0,19,4]]}
[]
["POLOŽKOVÝ LIST                                                                                      "]
[{"$f":"Vstup!C2&IF(Vstup!C3<>\"\",\", \"&Vstup!C3,\"\")","v":"COMPAK SPORTING SPECIÁL, 160 terčů"}]
[{"$f":"Vstup!C4&\", \"&Vstup!C5","v":"COMPAK SPORTING, 3.6.2012"}]
[]
["Skupina: ",null,1,"Kolo :",1,"Rozhodčí:",{"$nulls":4},"1________________",{"$nulls":4},"2________________",{"$nulls":4},"3________________",{"$nulls":4},"4________________",{"$nulls":4},"∑","Podpis"]
["St. č.","Příjmení, jméno",null,null,"Kat.","Terče"]
[1,"Jankovský Jakub",null,null,"J",25,24,23,22,21,20,19,18,17,16,15,14,13,12,11,10,9,8,7,6,5,4,3,2,1]
[]
[2,"Neuvirt Martin",null,null,"B",25,24,23,22,21,20,19,18,17,16,15,14,13,12,11,10,9,8,7,6,5,4,3,2,1]
[]
[3,"Škanta Marek",null,null,"A",25,24,23,22,21,20,19,18,17,16,15,14,13,12,11,10,9,8,7,6,5,4,3,2,1]
[]
[4,"Neuvirt Václav",null,null,"V",25,24,23,22,21,20,19,18,17,16,15,14,13,12,11,10,9,8,7,6,5,4,3,2,1]
[]
[5,"Koloc Martin",null,null,"B",25,24,23,22,21,20,19,18,17,16,15,14,13,12,11,10,9,8,7,6,5,4,3,2,1]
[]
[6,"Kodeš Václav",null,null,"B",25,24,23,22,21,20,19,18,17,16,15,14,13,12,11,10,9,8,7,6,5,4,3,2,1]
[]
["Poznámky:"]

{"sheet":"SkS-18","index":13,"n_rows":20,"n_cols":32,"rows_kept":20,"hidden":true,"merged":[[1,0,1,31],[2,0,2,31],[3,0,3,31],[5,0,5,1],[5,5,5,9],[5,10,5,14],[5,15,5,19],[5,20,5,24],[5,25,5,29],[5,30,6,30],[5,31,6,31],[6,1,6,3],[6,5,6,29],[7,0,8,0],[7,1,8,3],[7,4,8,4],[7,30,8,30],[7,31,8,31],[9,0,10,0],[9,1,10,3],[9,4,10,4],[9,30,10,30],[9,31,10,31],[11,0,12,0],[11,1,12,3],[11,4,12,4],[11,30,12,30],[11,31,12,31],[13,0,14,0],[13,1,14,3],[13,4,14,4],[13,30,14,30],[13,31,14,31],[15,0,16,0],[15,1,16,3],[15,4,16,4],[15,30,16,30],[15,31,16,31],[17,0,18,0],[17,1,18,3],[17,4,18,4],[17,30,18,30],[17,31,18,31],[19,0,19,4]]}
[]
["POLOŽKOVÝ LIST                                                                                      "]
[{"$f":"Vstup!C2&IF(Vstup!C3<>\"\",\", \"&Vstup!C3,\"\")","v":"COMPAK SPORTING SPECIÁL, 160 terčů"}]
[{"$f":"Vstup!C4&\", \"&Vstup!C5","v":"COMPAK SPORTING, 3.6.2012"}]
[]
["Skupina: ",null,1,"Kolo :",1,"Rozhodčí:",{"$nulls":4},"1________________",{"$nulls":4},"2________________",{"$nulls":4},"3________________",{"$nulls":4},"4________________",{"$nulls":4},"∑","Podpis"]
["St. č.","Příjmení, jméno",null,null,"Kat.","Terče"]
[1,"Jankovský Jakub",null,null,"J",25,24,23,22,21,20,19,18,17,16,15,14,13,12,11,10,9,8,7,6,5,4,3,2,1]
[]
[2,"Neuvirt Martin",null,null,"B",25,24,23,22,21,20,19,18,17,16,15,14,13,12,11,10,9,8,7,6,5,4,3,2,1]
[]
[3,"Škanta Marek",null,null,"A",25,24,23,22,21,20,19,18,17,16,15,14,13,12,11,10,9,8,7,6,5,4,3,2,1]
[]
[4,"Neuvirt Václav",null,null,"V",25,24,23,22,21,20,19,18,17,16,15,14,13,12,11,10,9,8,7,6,5,4,3,2,1]
[]
[5,"Koloc Martin",null,null,"B",25,24,23,22,21,20,19,18,17,16,15,14,13,12,11,10,9,8,7,6,5,4,3,2,1]
[]
[6,"Kodeš Václav",null,null,"B",25,24,23,22,21,20,19,18,17,16,15,14,13,12,11,10,9,8,7,6,5,4,3,2,1]
[]
["Poznámky:"]

{"sheet":"SkS-19","index":14,"n_rows":20,"n_cols":32,"rows_kept":20,"hidden":true,"merged":[[1,0,1,31],[2,0,2,31],[3,0,3,31],[5,0,5,1],[5,5,5,9],[5,10,5,14],[5,15,5,19],[5,20,5,24],[5,25,5,29],[5,30,6,30],[5,31,6,31],[6,1,6,3],[6,5,6,29],[7,0,8,0],[7,1,8,3],[7,4,8,4],[7,30,8,30],[7,31,8,31],[9,0,10,0],[9,1,10,3],[9,4,10,4],[9,30,10,30],[9,31,10,31],[11,0,12,0],[11,1,12,3],[11,4,12,4],[11,30,12,30],[11,31,12,31],[13,0,14,0],[13,1,14,3],[13,4,14,4],[13,30,14,30],[13,31,14,31],[15,0,16,0],[15,1,16,3],[15,4,16,4],[15,30,16,30],[15,31,16,31],[17,0,18,0],[17,1,18,3],[17,4,18,4],[17,30,18,30],[17,31,18,31],[19,0,19,4]]}
[]
["POLOŽKOVÝ LIST                                                                                      "]
[{"$f":"Vstup!C2&IF(Vstup!C3<>\"\",\", \"&Vstup!C3,\"\")","v":"COMPAK SPORTING SPECIÁL, 160 terčů"}]
[{"$f":"Vstup!C4&\", \"&Vstup!C5","v":"COMPAK SPORTING, 3.6.2012"}]
[]
["Skupina: ",null,1,"Kolo :",1,"Rozhodčí:",{"$nulls":4},"1________________",{"$nulls":4},"2________________",{"$nulls":4},"3________________",{"$nulls":4},"4________________",{"$nulls":4},"∑","Podpis"]
["St. č.","Příjmení, jméno",null,null,"Kat.","Terče"]
[1,"Jankovský Jakub",null,null,"J",25,24,23,22,21,20,19,18,17,16,15,14,13,12,11,10,9,8,7,6,5,4,3,2,1]
[]
[2,"Neuvirt Martin",null,null,"B",25,24,23,22,21,20,19,18,17,16,15,14,13,12,11,10,9,8,7,6,5,4,3,2,1]
[]
[3,"Škanta Marek",null,null,"A",25,24,23,22,21,20,19,18,17,16,15,14,13,12,11,10,9,8,7,6,5,4,3,2,1]
[]
[4,"Neuvirt Václav",null,null,"V",25,24,23,22,21,20,19,18,17,16,15,14,13,12,11,10,9,8,7,6,5,4,3,2,1]
[]
[5,"Koloc Martin",null,null,"B",25,24,23,22,21,20,19,18,17,16,15,14,13,12,11,10,9,8,7,6,5,4,3,2,1]
[]
[6,"Kodeš Václav",null,null,"B",25,24,23,22,21,20,19,18,17,16,15,14,13,12,11,10,9,8,7,6,5,4,3,2,1]
[]
["Poznámky:"]

{"sheet":"SkS-20","index":15,"n_rows":20,"n_cols":32,"rows_kept":20,"hidden":true,"merged":[[1,0,1,31],[2,0,2,31],[3,0,3,31],[5,0,5,1],[5,5,5,9],[5,10,5,14],[5,15,5,19],[5,20,5,24],[5,25,5,29],[5,30,6,30],[5,31,6,31],[6,1,6,3],[6,5,6,29],[7,0,8,0],[7,1,8,3],[7,4,8,4],[7,30,8,30],[7,31,8,31],[9,0,10,0],[9,1,10,3],[9,4,10,4],[9,30,10,30],[9,31,10,31],[11,0,12,0],[11,1,12,3],[11,4,12,4],[11,30,12,30],[11,31,12,31],[13,0,14,0],[13,1,14,3],[13,4,14,4],[13,30,14,30],[13,31,14,31],[15,0,16,0],[15,1,16,3],[15,4,16,4],[15,30,16,30],[15,31,16,31],[17,0,18,0],[17,1,18,3],[17,4,18,4],[17,30,18,30],[17,31,18,31],[19,0,19,4]]}
[]
["POLOŽKOVÝ LIST                                                                                      "]
[{"$f":"Vstup!C2&IF(Vstup!C3<>\"\",\", \"&Vstup!C3,\"\")","v":"COMPAK SPORTING SPECIÁL, 160 terčů"}]
[{"$f":"Vstup!C4&\", \"&Vstup!C5","v":"COMPAK SPORTING, 3.6.2012"}]
[]
["Skupina: ",null,1,"Kolo :",1,"Rozhodčí:",{"$nulls":4},"1________________",{"$nulls":4},"2________________",{"$nulls":4},"3________________",{"$nulls":4},"4________________",{"$nulls":4},"∑","Podpis"]
["St. č.","Příjmení, jméno",null,null,"Kat.","Terče"]
[1,"Jankovský Jakub",null,null,"J",25,24,23,22,21,20,19,18,17,16,15,14,13,12,11,10,9,8,7,6,5,4,3,2,1]
[]
[2,"Neuvirt Martin",null,null,"B",25,24,23,22,21,20,19,18,17,16,15,14,13,12,11,10,9,8,7,6,5,4,3,2,1]
[]
[3,"Škanta Marek",null,null,"A",25,24,23,22,21,20,19,18,17,16,15,14,13,12,11,10,9,8,7,6,5,4,3,2,1]
[]
[4,"Neuvirt Václav",null,null,"V",25,24,23,22,21,20,19,18,17,16,15,14,13,12,11,10,9,8,7,6,5,4,3,2,1]
[]
[5,"Koloc Martin",null,null,"B",25,24,23,22,21,20,19,18,17,16,15,14,13,12,11,10,9,8,7,6,5,4,3,2,1]
[]
[6,"Kodeš Václav",null,null,"B",25,24,23,22,21,20,19,18,17,16,15,14,13,12,11,10,9,8,7,6,5,4,3,2,1]
[]
["Poznámky:"]

{"sheet":"SkS-9","index":16,"n_rows":26,"n_cols":31,"rows_kept":26,"hidden":true,"merged":[[1,0,1,30],[2,0,2,30],[3,0,3,30],[5,0,5,1],[5,5,5,8],[5,9,5,12],[5,13,5,16],[5,17,5,20],[5,25,5,28],[5,29,6,29],[5,30,6,30],[6,1,6,3],[6,5,6,28],[7,0,9,0],[7,1,9,3],[7,4,9,4],[7,5,7,8],[7,9,7,12],[7,13,7,16],[7,17,7,20],[7,21,7,24],[7,25,9,28],[7,29,9,29],[7,30,9,30],[10,0,12,0],[10,1,12,3],[10,4,12,4],[10,5,10,8],[10,9,10,12],[10,13,10,16],[10,17,10,20],[10,21,12,24],[10,25,10,28],[10,29,12,29],[10,30,12,30],[13,0,15,0],[13,1,15,3],[13,4,15,4],[13,5,13,8],[13,9,13,12],[13,13,13,16],[13,17,15,20],[13,21,13,24],[13,25,13,28],[13,29,15,29],[13,30,15,30],[16,0,18,0],[16,1,18,3],[16,4,18,4],[16,5,16,8],[16,9,16,12],[16,13,18,16],[16,17,16,20],[16,21,16,24],[16,25,16,28],[16,29,18,29],[16,30,18,30],[19,0,21,0],[19,1,21,3],[19,4,21,4],[19,5,19,8],[19,9,21,12],[19,13,19,16],[19,17,19,20],[19,21,19,24],[19,25,19,28],[19,29,21,29],[19,30,21,30],[22,0,24,0],[22,1,24,3],[22,4,24,4],[22,5,24,8],[22,9,22,12],[22,13,22,16],[22,17,22,20],[22,21,22,24],[22,25,22,28],[22,29,24,29],[22,30,24,30],[25,0,25,4]]}
[]
["POLOŽKOVÝ LIST                                                                                      "]
[{"$f":"Vstup!C2&IF(Vstup!C3<>\"\",\", \"&Vstup!C3,\"\")","v":"COMPAK SPORTING SPECIÁL, 160 terčů"}]
[{"$f":"Vstup!C4&\", \"&Vstup!C5","v":"COMPAK SPORTING, 3.6.2012"}]
[]
["Skupina: ",null,9,"Kolo :",1,"Rozhodčí:",{"$nulls":23},"∑","Podpis"]
["St. č.","Příjmení, jméno",null,null,"Kat.","Terče"]
[49,{"$nulls":3},{"$error":"#N/A"},"Stanoviště 1",{"$nulls":3},"Stanoviště 2",{"$nulls":3},"Stanoviště 3",{"$nulls":3},"Stanoviště 4",{"$nulls":3},"Stanoviště 5"]
[{"$nulls":5},1,2,3,4,5,6,7,8,9,10,11,12,13,14,15,16,17,18,19,20]
[]
[50,{"$nulls":3},{"$error":"#N/A"},"Stanoviště 2",{"$nulls":3},"Stanoviště 3",{"$nulls":3},"Stanoviště 4",{"$nulls":3},"Stanoviště 5",{"$nulls":7},"Stanoviště 1"]
[{"$nulls":5},1,2,3,4,5,6,7,8,9,10,11,12,13,14,15,16,{"$nulls":4},17,18,19,20]
[]
[51,{"$nulls":3},{"$error":"#N/A"},"Stanoviště 3",{"$nulls":3},"Stanoviště 4",{"$nulls":3},"Stanoviště 5",{"$nulls":7},"Stanoviště 1",{"$nulls":3},"Stanoviště 2"]
[{"$nulls":5},1,2,3,4,5,6,7,8,9,10,11,12,{"$nulls":4},13,14,15,16,17,18,19,20]
[]
[52,{"$nulls":3},{"$error":"#N/A"},"Stanoviště 4",{"$nulls":3},"Stanoviště 5",{"$nulls":7},"Stanoviště 1",{"$nulls":3},"Stanoviště 2",{"$nulls":3},"Stanoviště 3"]
[{"$nulls":5},1,2,3,4,5,6,7,8,{"$nulls":4},9,10,11,12,13,14,15,16,17,18,19,20]
[]
[53,{"$nulls":3},{"$error":"#N/A"},"Stanoviště 5",{"$nulls":7},"Stanoviště 1",{"$nulls":3},"Stanoviště 2",{"$nulls":3},"Stanoviště 3",{"$nulls":3},"Stanoviště 4"]
[{"$nulls":5},1,2,3,4,{"$nulls":4},5,6,7,8,9,10,11,12,13,14,15,16,17,18,19,20]
[]
[54,{"$nulls":3},{"$error":"#N/A"},{"$nulls":4},"Stanoviště 1",{"$nulls":3},"Stanoviště 2",{"$nulls":3},"Stanoviště 3",{"$nulls":3},"Stanoviště 4",{"$nulls":3},"Stanoviště 5"]
[{"$nulls":9},1,2,3,4,5,6,7,8,9,10,11,12,13,14,15,16,17,18,19,20]
[]
["Poznámky:"]

{"sheet":"SkS-10","index":17,"n_rows":26,"n_cols":31,"rows_kept":26,"hidden":true,"merged":[[1,0,1,30],[2,0,2,30],[3,0,3,30],[5,0,5,1],[5,5,5,8],[5,9,5,12],[5,13,5,16],[5,17,5,20],[5,25,5,28],[5,29,6,29],[5,30,6,30],[6,1,6,3],[6,5,6,28],[7,0,9,0],[7,1,9,3],[7,4,9,4],[7,5,7,8],[7,9,7,12],[7,13,7,16],[7,17,7,20],[7,21,7,24],[7,25,9,28],[7,29,9,29],[7,30,9,30],[10,0,12,0],[10,1,12,3],[10,4,12,4],[10,5,10,8],[10,9,10,12],[10,13,10,16],[10,17,10,20],[10,21,12,24],[10,25,10,28],[10,29,12,29],[10,30,12,30],[13,0,15,0],[13,1,15,3],[13,4,15,4],[13,5,13,8],[13,9,13,12],[13,13,13,16],[13,17,15,20],[13,21,13,24],[13,25,13,28],[13,29,15,29],[13,30,15,30],[16,0,18,0],[16,1,18,3],[16,4,18,4],[16,5,16,8],[16,9,16,12],[16,13,18,16],[16,17,16,20],[16,21,16,24],[16,25,16,28],[16,29,18,29],[16,30,18,30],[19,0,21,0],[19,1,21,3],[19,4,21,4],[19,5,19,8],[19,9,21,12],[19,13,19,16],[19,17,19,20],[19,21,19,24],[19,25,19,28],[19,29,21,29],[19,30,21,30],[22,0,24,0],[22,1,24,3],[22,4,24,4],[22,5,24,8],[22,9,22,12],[22,13,22,16],[22,17,22,20],[22,21,22,24],[22,25,22,28],[22,29,24,29],[22,30,24,30],[25,0,25,4]]}
[]
["POLOŽKOVÝ LIST                                                                                      "]
[{"$f":"Vstup!C2&IF(Vstup!C3<>\"\",\", \"&Vstup!C3,\"\")","v":"COMPAK SPORTING SPECIÁL, 160 terčů"}]
[{"$f":"Vstup!C4&\", \"&Vstup!C5","v":"COMPAK SPORTING, 3.6.2012"}]
[]
["Skupina: ",null,10,"Kolo :",1,"Rozhodčí:",{"$nulls":23},"∑","Podpis"]
["St. č.","Příjmení, jméno",null,null,"Kat.","Terče"]
[55,{"$nulls":3},{"$error":"#N/A"},"Stanoviště 1",{"$nulls":3},"Stanoviště 2",{"$nulls":3},"Stanoviště 3",{"$nulls":3},"Stanoviště 4",{"$nulls":3},"Stanoviště 5"]
[{"$nulls":5},1,2,3,4,5,6,7,8,9,10,11,12,13,14,15,16,17,18,19,20]
[]
[56,{"$nulls":3},{"$error":"#N/A"},"Stanoviště 2",{"$nulls":3},"Stanoviště 3",{"$nulls":3},"Stanoviště 4",{"$nulls":3},"Stanoviště 5",{"$nulls":7},"Stanoviště 1"]
[{"$nulls":5},1,2,3,4,5,6,7,8,9,10,11,12,13,14,15,16,{"$nulls":4},17,18,19,20]
[]
[57,{"$nulls":3},{"$error":"#N/A"},"Stanoviště 3",{"$nulls":3},"Stanoviště 4",{"$nulls":3},"Stanoviště 5",{"$nulls":7},"Stanoviště 1",{"$nulls":3},"Stanoviště 2"]
[{"$nulls":5},1,2,3,4,5,6,7,8,9,10,11,12,{"$nulls":4},13,14,15,16,17,18,19,20]
[]
[58,{"$nulls":3},{"$error":"#N/A"},"Stanoviště 4",{"$nulls":3},"Stanoviště 5",{"$nulls":7},"Stanoviště 1",{"$nulls":3},"Stanoviště 2",{"$nulls":3},"Stanoviště 3"]
[{"$nulls":5},1,2,3,4,5,6,7,8,{"$nulls":4},9,10,11,12,13,14,15,16,17,18,19,20]
[]
[59,{"$nulls":3},{"$error":"#N/A"},"Stanoviště 5",{"$nulls":7},"Stanoviště 1",{"$nulls":3},"Stanoviště 2",{"$nulls":3},"Stanoviště 3",{"$nulls":3},"Stanoviště 4"]
[{"$nulls":5},1,2,3,4,{"$nulls":4},5,6,7,8,9,10,11,12,13,14,15,16,17,18,19,20]
[]
[60,{"$nulls":3},{"$error":"#N/A"},{"$nulls":4},"Stanoviště 1",{"$nulls":3},"Stanoviště 2",{"$nulls":3},"Stanoviště 3",{"$nulls":3},"Stanoviště 4",{"$nulls":3},"Stanoviště 5"]
[{"$nulls":9},1,2,3,4,5,6,7,8,9,10,11,12,13,14,15,16,17,18,19,20]
[]
["Poznámky:"]

{"sheet":"SkS-11","index":18,"n_rows":26,"n_cols":31,"rows_kept":26,"hidden":true,"merged":[[1,0,1,30],[2,0,2,30],[3,0,3,30],[5,0,5,1],[5,5,5,8],[5,9,5,12],[5,13,5,16],[5,17,5,20],[5,25,5,28],[5,29,6,29],[5,30,6,30],[6,1,6,3],[6,5,6,28],[7,0,9,0],[7,1,9,3],[7,4,9,4],[7,5,7,8],[7,9,7,12],[7,13,7,16],[7,17,7,20],[7,21,7,24],[7,25,9,28],[7,29,9,29],[7,30,9,30],[10,0,12,0],[10,1,12,3],[10,4,12,4],[10,5,10,8],[10,9,10,12],[10,13,10,16],[10,17,10,20],[10,21,12,24],[10,25,10,28],[10,29,12,29],[10,30,12,30],[13,0,15,0],[13,1,15,3],[13,4,15,4],[13,5,13,8],[13,9,13,12],[13,13,13,16],[13,17,15,20],[13,21,13,24],[13,25,13,28],[13,29,15,29],[13,30,15,30],[16,0,18,0],[16,1,18,3],[16,4,18,4],[16,5,16,8],[16,9,16,12],[16,13,18,16],[16,17,16,20],[16,21,16,24],[16,25,16,28],[16,29,18,29],[16,30,18,30],[19,0,21,0],[19,1,21,3],[19,4,21,4],[19,5,19,8],[19,9,21,12],[19,13,19,16],[19,17,19,20],[19,21,19,24],[19,25,19,28],[19,29,21,29],[19,30,21,30],[22,0,24,0],[22,1,24,3],[22,4,24,4],[22,5,24,8],[22,9,22,12],[22,13,22,16],[22,17,22,20],[22,21,22,24],[22,25,22,28],[22,29,24,29],[22,30,24,30],[25,0,25,4]]}
[]
["POLOŽKOVÝ LIST                                                                                      "]
[{"$f":"Vstup!C2&IF(Vstup!C3<>\"\",\", \"&Vstup!C3,\"\")","v":"COMPAK SPORTING SPECIÁL, 160 terčů"}]
[{"$f":"Vstup!C4&\", \"&Vstup!C5","v":"COMPAK SPORTING, 3.6.2012"}]
[]
["Skupina: ",null,11,"Kolo :",1,"Rozhodčí:",{"$nulls":23},"∑","Podpis"]
["St. č.","Příjmení, jméno",null,null,"Kat.","Terče"]
[61,{"$nulls":3},{"$error":"#N/A"},"Stanoviště 1",{"$nulls":3},"Stanoviště 2",{"$nulls":3},"Stanoviště 3",{"$nulls":3},"Stanoviště 4",{"$nulls":3},"Stanoviště 5"]
[{"$nulls":5},1,2,3,4,5,6,7,8,9,10,11,12,13,14,15,16,17,18,19,20]
[]
[62,{"$nulls":3},{"$error":"#N/A"},"Stanoviště 2",{"$nulls":3},"Stanoviště 3",{"$nulls":3},"Stanoviště 4",{"$nulls":3},"Stanoviště 5",{"$nulls":7},"Stanoviště 1"]
[{"$nulls":5},1,2,3,4,5,6,7,8,9,10,11,12,13,14,15,16,{"$nulls":4},17,18,19,20]
[]
[63,{"$nulls":3},{"$error":"#N/A"},"Stanoviště 3",{"$nulls":3},"Stanoviště 4",{"$nulls":3},"Stanoviště 5",{"$nulls":7},"Stanoviště 1",{"$nulls":3},"Stanoviště 2"]
[{"$nulls":5},1,2,3,4,5,6,7,8,9,10,11,12,{"$nulls":4},13,14,15,16,17,18,19,20]
[]
[64,{"$nulls":3},{"$error":"#N/A"},"Stanoviště 4",{"$nulls":3},"Stanoviště 5",{"$nulls":7},"Stanoviště 1",{"$nulls":3},"Stanoviště 2",{"$nulls":3},"Stanoviště 3"]
[{"$nulls":5},1,2,3,4,5,6,7,8,{"$nulls":4},9,10,11,12,13,14,15,16,17,18,19,20]
[]
[65,{"$nulls":3},{"$error":"#N/A"},"Stanoviště 5",{"$nulls":7},"Stanoviště 1",{"$nulls":3},"Stanoviště 2",{"$nulls":3},"Stanoviště 3",{"$nulls":3},"Stanoviště 4"]
[{"$nulls":5},1,2,3,4,{"$nulls":4},5,6,7,8,9,10,11,12,13,14,15,16,17,18,19,20]
[]
[66,{"$nulls":3},{"$error":"#N/A"},{"$nulls":4},"Stanoviště 1",{"$nulls":3},"Stanoviště 2",{"$nulls":3},"Stanoviště 3",{"$nulls":3},"Stanoviště 4",{"$nulls":3},"Stanoviště 5"]
[{"$nulls":9},1,2,3,4,5,6,7,8,9,10,11,12,13,14,15,16,17,18,19,20]
[]
["Poznámky:"]

{"sheet":"SkS-12","index":19,"n_rows":26,"n_cols":31,"rows_kept":26,"hidden":true,"merged":[[1,0,1,30],[2,0,2,30],[3,0,3,30],[5,0,5,1],[5,5,5,8],[5,9,5,12],[5,13,5,16],[5,17,5,20],[5,25,5,28],[5,29,6,29],[5,30,6,30],[6,1,6,3],[6,5,6,28],[7,0,9,0],[7,1,9,3],[7,4,9,4],[7,5,7,8],[7,9,7,12],[7,13,7,16],[7,17,7,20],[7,21,7,24],[7,25,9,28],[7,29,9,29],[7,30,9,30],[10,0,12,0],[10,1,12,3],[10,4,12,4],[10,5,10,8],[10,9,10,12],[10,13,10,16],[10,17,10,20],[10,21,12,24],[10,25,10,28],[10,29,12,29],[10,30,12,30],[13,0,15,0],[13,1,15,3],[13,4,15,4],[13,5,13,8],[13,9,13,12],[13,13,13,16],[13,17,15,20],[13,21,13,24],[13,25,13,28],[13,29,15,29],[13,30,15,30],[16,0,18,0],[16,1,18,3],[16,4,18,4],[16,5,16,8],[16,9,16,12],[16,13,18,16],[16,17,16,20],[16,21,16,24],[16,25,16,28],[16,29,18,29],[16,30,18,30],[19,0,21,0],[19,1,21,3],[19,4,21,4],[19,5,19,8],[19,9,21,12],[19,13,19,16],[19,17,19,20],[19,21,19,24],[19,25,19,28],[19,29,21,29],[19,30,21,30],[22,0,24,0],[22,1,24,3],[22,4,24,4],[22,5,24,8],[22,9,22,12],[22,13,22,16],[22,17,22,20],[22,21,22,24],[22,25,22,28],[22,29,24,29],[22,30,24,30],[25,0,25,4]]}
[]
["POLOŽKOVÝ LIST                                                                                      "]
[{"$f":"Vstup!C2&IF(Vstup!C3<>\"\",\", \"&Vstup!C3,\"\")","v":"COMPAK SPORTING SPECIÁL, 160 terčů"}]
[{"$f":"Vstup!C4&\", \"&Vstup!C5","v":"COMPAK SPORTING, 3.6.2012"}]
[]
["Skupina: ",null,12,"Kolo :",1,"Rozhodčí:",{"$nulls":23},"∑","Podpis"]
["St. č.","Příjmení, jméno",null,null,"Kat.","Terče"]
[43,{"$nulls":3},{"$error":"#N/A"},"Stanoviště 1",{"$nulls":3},"Stanoviště 2",{"$nulls":3},"Stanoviště 3",{"$nulls":3},"Stanoviště 4",{"$nulls":3},"Stanoviště 5"]
[{"$nulls":5},1,2,3,4,5,6,7,8,9,10,11,12,13,14,15,16,17,18,19,20]
[]
[44,{"$nulls":3},{"$error":"#N/A"},"Stanoviště 2",{"$nulls":3},"Stanoviště 3",{"$nulls":3},"Stanoviště 4",{"$nulls":3},"Stanoviště 5",{"$nulls":7},"Stanoviště 1"]
[{"$nulls":5},1,2,3,4,5,6,7,8,9,10,11,12,13,14,15,16,{"$nulls":4},17,18,19,20]
[]
[45,{"$nulls":3},{"$error":"#N/A"},"Stanoviště 3",{"$nulls":3},"Stanoviště 4",{"$nulls":3},"Stanoviště 5",{"$nulls":7},"Stanoviště 1",{"$nulls":3},"Stanoviště 2"]
[{"$nulls":5},1,2,3,4,5,6,7,8,9,10,11,12,{"$nulls":4},13,14,15,16,17,18,19,20]
[]
[46,{"$nulls":3},{"$error":"#N/A"},"Stanoviště 4",{"$nulls":3},"Stanoviště 5",{"$nulls":7},"Stanoviště 1",{"$nulls":3},"Stanoviště 2",{"$nulls":3},"Stanoviště 3"]
[{"$nulls":5},1,2,3,4,5,6,7,8,{"$nulls":4},9,10,11,12,13,14,15,16,17,18,19,20]
[]
[47,{"$nulls":3},{"$error":"#N/A"},"Stanoviště 5",{"$nulls":7},"Stanoviště 1",{"$nulls":3},"Stanoviště 2",{"$nulls":3},"Stanoviště 3",{"$nulls":3},"Stanoviště 4"]
[{"$nulls":5},1,2,3,4,{"$nulls":4},5,6,7,8,9,10,11,12,13,14,15,16,17,18,19,20]
[]
[48,{"$nulls":3},{"$error":"#N/A"},{"$nulls":4},"Stanoviště 1",{"$nulls":3},"Stanoviště 2",{"$nulls":3},"Stanoviště 3",{"$nulls":3},"Stanoviště 4",{"$nulls":3},"Stanoviště 5"]
[{"$nulls":9},1,2,3,4,5,6,7,8,9,10,11,12,13,14,15,16,17,18,19,20]
[]
["Poznámky:"]

{"sheet":"SkS-13","index":20,"n_rows":26,"n_cols":31,"rows_kept":26,"hidden":true,"merged":[[1,0,1,30],[2,0,2,30],[3,0,3,30],[5,0,5,1],[5,5,5,8],[5,9,5,12],[5,13,5,16],[5,17,5,20],[5,25,5,28],[5,29,6,29],[5,30,6,30],[6,1,6,3],[6,5,6,28],[7,0,9,0],[7,1,9,3],[7,4,9,4],[7,5,7,8],[7,9,7,12],[7,13,7,16],[7,17,7,20],[7,21,7,24],[7,25,9,28],[7,29,9,29],[7,30,9,30],[10,0,12,0],[10,1,12,3],[10,4,12,4],[10,5,10,8],[10,9,10,12],[10,13,10,16],[10,17,10,20],[10,21,12,24],[10,25,10,28],[10,29,12,29],[10,30,12,30],[13,0,15,0],[13,1,15,3],[13,4,15,4],[13,5,13,8],[13,9,13,12],[13,13,13,16],[13,17,15,20],[13,21,13,24],[13,25,13,28],[13,29,15,29],[13,30,15,30],[16,0,18,0],[16,1,18,3],[16,4,18,4],[16,5,16,8],[16,9,16,12],[16,13,18,16],[16,17,16,20],[16,21,16,24],[16,25,16,28],[16,29,18,29],[16,30,18,30],[19,0,21,0],[19,1,21,3],[19,4,21,4],[19,5,19,8],[19,9,21,12],[19,13,19,16],[19,17,19,20],[19,21,19,24],[19,25,19,28],[19,29,21,29],[19,30,21,30],[22,0,24,0],[22,1,24,3],[22,4,24,4],[22,5,24,8],[22,9,22,12],[22,13,22,16],[22,17,22,20],[22,21,22,24],[22,25,22,28],[22,29,24,29],[22,30,24,30],[25,0,25,4]]}
[]
["POLOŽKOVÝ LIST                                                                                      "]
[{"$f":"Vstup!C2&IF(Vstup!C3<>\"\",\", \"&Vstup!C3,\"\")","v":"COMPAK SPORTING SPECIÁL, 160 terčů"}]
[{"$f":"Vstup!C4&\", \"&Vstup!C5","v":"COMPAK SPORTING, 3.6.2012"}]
[]
["Skupina: ",null,13,"Kolo :",1,"Rozhodčí:",{"$nulls":23},"∑","Podpis"]
["St. č.","Příjmení, jméno",null,null,"Kat.","Terče"]
[43,{"$nulls":3},{"$error":"#N/A"},"Stanoviště 1",{"$nulls":3},"Stanoviště 2",{"$nulls":3},"Stanoviště 3",{"$nulls":3},"Stanoviště 4",{"$nulls":3},"Stanoviště 5"]
[{"$nulls":5},1,2,3,4,5,6,7,8,9,10,11,12,13,14,15,16,17,18,19,20]
[]
[44,{"$nulls":3},{"$error":"#N/A"},"Stanoviště 2",{"$nulls":3},"Stanoviště 3",{"$nulls":3},"Stanoviště 4",{"$nulls":3},"Stanoviště 5",{"$nulls":7},"Stanoviště 1"]
[{"$nulls":5},1,2,3,4,5,6,7,8,9,10,11,12,13,14,15,16,{"$nulls":4},17,18,19,20]
[]
[45,{"$nulls":3},{"$error":"#N/A"},"Stanoviště 3",{"$nulls":3},"Stanoviště 4",{"$nulls":3},"Stanoviště 5",{"$nulls":7},"Stanoviště 1",{"$nulls":3},"Stanoviště 2"]
[{"$nulls":5},1,2,3,4,5,6,7,8,9,10,11,12,{"$nulls":4},13,14,15,16,17,18,19,20]
[]
[46,{"$nulls":3},{"$error":"#N/A"},"Stanoviště 4",{"$nulls":3},"Stanoviště 5",{"$nulls":7},"Stanoviště 1",{"$nulls":3},"Stanoviště 2",{"$nulls":3},"Stanoviště 3"]
[{"$nulls":5},1,2,3,4,5,6,7,8,{"$nulls":4},9,10,11,12,13,14,15,16,17,18,19,20]
[]
[47,{"$nulls":3},{"$error":"#N/A"},"Stanoviště 5",{"$nulls":7},"Stanoviště 1",{"$nulls":3},"Stanoviště 2",{"$nulls":3},"Stanoviště 3",{"$nulls":3},"Stanoviště 4"]
[{"$nulls":5},1,2,3,4,{"$nulls":4},5,6,7,8,9,10,11,12,13,14,15,16,17,18,19,20]
[]
[48,{"$nulls":3},{"$error":"#N/A"},{"$nulls":4},"Stanoviště 1",{"$nulls":3},"Stanoviště 2",{"$nulls":3},"Stanoviště 3",{"$nulls":3},"Stanoviště 4",{"$nulls":3},"Stanoviště 5"]
[{"$nulls":9},1,2,3,4,5,6,7,8,9,10,11,12,13,14,15,16,17,18,19,20]
[]
["Poznámky:"]

{"sheet":"SkS-14","index":21,"n_rows":26,"n_cols":31,"rows_kept":26,"hidden":true,"merged":[[1,0,1,30],[2,0,2,30],[3,0,3,30],[5,0,5,1],[5,5,5,8],[5,9,5,12],[5,13,5,16],[5,17,5,20],[5,25,5,28],[5,29,6,29],[5,30,6,30],[6,1,6,3],[6,5,6,28],[7,0,9,0],[7,1,9,3],[7,4,9,4],[7,5,7,8],[7,9,7,12],[7,13,7,16],[7,17,7,20],[7,21,7,24],[7,25,9,28],[7,29,9,29],[7,30,9,30],[10,0,12,0],[10,1,12,3],[10,4,12,4],[10,5,10,8],[10,9,10,12],[10,13,10,16],[10,17,10,20],[10,21,12,24],[10,25,10,28],[10,29,12,29],[10,30,12,30],[13,0,15,0],[13,1,15,3],[13,4,15,4],[13,5,13,8],[13,9,13,12],[13,13,13,16],[13,17,15,20],[13,21,13,24],[13,25,13,28],[13,29,15,29],[13,30,15,30],[16,0,18,0],[16,1,18,3],[16,4,18,4],[16,5,16,8],[16,9,16,12],[16,13,18,16],[16,17,16,20],[16,21,16,24],[16,25,16,28],[16,29,18,29],[16,30,18,30],[19,0,21,0],[19,1,21,3],[19,4,21,4],[19,5,19,8],[19,9,21,12],[19,13,19,16],[19,17,19,20],[19,21,19,24],[19,25,19,28],[19,29,21,29],[19,30,21,30],[22,0,24,0],[22,1,24,3],[22,4,24,4],[22,5,24,8],[22,9,22,12],[22,13,22,16],[22,17,22,20],[22,21,22,24],[22,25,22,28],[22,29,24,29],[22,30,24,30],[25,0,25,4]]}
[]
["POLOŽKOVÝ LIST                                                                                      "]
[{"$f":"Vstup!C2&IF(Vstup!C3<>\"\",\", \"&Vstup!C3,\"\")","v":"COMPAK SPORTING SPECIÁL, 160 terčů"}]
[{"$f":"Vstup!C4&\", \"&Vstup!C5","v":"COMPAK SPORTING, 3.6.2012"}]
[]
["Skupina: ",null,14,"Kolo :",1,"Rozhodčí:",{"$nulls":23},"∑","Podpis"]
["St. č.","Příjmení, jméno",null,null,"Kat.","Terče"]
[43,{"$nulls":3},{"$error":"#N/A"},"Stanoviště 1",{"$nulls":3},"Stanoviště 2",{"$nulls":3},"Stanoviště 3",{"$nulls":3},"Stanoviště 4",{"$nulls":3},"Stanoviště 5"]
[{"$nulls":5},1,2,3,4,5,6,7,8,9,10,11,12,13,14,15,16,17,18,19,20]
[]
[44,{"$nulls":3},{"$error":"#N/A"},"Stanoviště 2",{"$nulls":3},"Stanoviště 3",{"$nulls":3},"Stanoviště 4",{"$nulls":3},"Stanoviště 5",{"$nulls":7},"Stanoviště 1"]
[{"$nulls":5},1,2,3,4,5,6,7,8,9,10,11,12,13,14,15,16,{"$nulls":4},17,18,19,20]
[]
[45,{"$nulls":3},{"$error":"#N/A"},"Stanoviště 3",{"$nulls":3},"Stanoviště 4",{"$nulls":3},"Stanoviště 5",{"$nulls":7},"Stanoviště 1",{"$nulls":3},"Stanoviště 2"]
[{"$nulls":5},1,2,3,4,5,6,7,8,9,10,11,12,{"$nulls":4},13,14,15,16,17,18,19,20]
[]
[46,{"$nulls":3},{"$error":"#N/A"},"Stanoviště 4",{"$nulls":3},"Stanoviště 5",{"$nulls":7},"Stanoviště 1",{"$nulls":3},"Stanoviště 2",{"$nulls":3},"Stanoviště 3"]
[{"$nulls":5},1,2,3,4,5,6,7,8,{"$nulls":4},9,10,11,12,13,14,15,16,17,18,19,20]
[]
[47,{"$nulls":3},{"$error":"#N/A"},"Stanoviště 5",{"$nulls":7},"Stanoviště 1",{"$nulls":3},"Stanoviště 2",{"$nulls":3},"Stanoviště 3",{"$nulls":3},"Stanoviště 4"]
[{"$nulls":5},1,2,3,4,{"$nulls":4},5,6,7,8,9,10,11,12,13,14,15,16,17,18,19,20]
[]
[48,{"$nulls":3},{"$error":"#N/A"},{"$nulls":4},"Stanoviště 1",{"$nulls":3},"Stanoviště 2",{"$nulls":3},"Stanoviště 3",{"$nulls":3},"Stanoviště 4",{"$nulls":3},"Stanoviště 5"]
[{"$nulls":9},1,2,3,4,5,6,7,8,9,10,11,12,13,14,15,16,17,18,19,20]
[]
["Poznámky:"]

{"sheet":"SkS-15","index":22,"n_rows":26,"n_cols":31,"rows_kept":26,"hidden":true,"merged":[[1,0,1,30],[2,0,2,30],[3,0,3,30],[5,0,5,1],[5,5,5,8],[5,9,5,12],[5,13,5,16],[5,17,5,20],[5,25,5,28],[5,29,6,29],[5,30,6,30],[6,1,6,3],[6,5,6,28],[7,0,9,0],[7,1,9,3],[7,4,9,4],[7,5,7,8],[7,9,7,12],[7,13,7,16],[7,17,7,20],[7,21,7,24],[7,25,9,28],[7,29,9,29],[7,30,9,30],[10,0,12,0],[10,1,12,3],[10,4,12,4],[10,5,10,8],[10,9,10,12],[10,13,10,16],[10,17,10,20],[10,21,12,24],[10,25,10,28],[10,29,12,29],[10,30,12,30],[13,0,15,0],[13,1,15,3],[13,4,15,4],[13,5,13,8],[13,9,13,12],[13,13,13,16],[13,17,15,20],[13,21,13,24],[13,25,13,28],[13,29,15,29],[13,30,15,30],[16,0,18,0],[16,1,18,3],[16,4,18,4],[16,5,16,8],[16,9,16,12],[16,13,18,16],[16,17,16,20],[16,21,16,24],[16,25,16,28],[16,29,18,29],[16,30,18,30],[19,0,21,0],[19,1,21,3],[19,4,21,4],[19,5,19,8],[19,9,21,12],[19,13,19,16],[19,17,19,20],[19,21,19,24],[19,25,19,28],[19,29,21,29],[19,30,21,30],[22,0,24,0],[22,1,24,3],[22,4,24,4],[22,5,24,8],[22,9,22,12],[22,13,22,16],[22,17,22,20],[22,21,22,24],[22,25,22,28],[22,29,24,29],[22,30,24,30],[25,0,25,4]]}
[]
["POLOŽKOVÝ LIST                                                                                      "]
[{"$f":"Vstup!C2&IF(Vstup!C3<>\"\",\", \"&Vstup!C3,\"\")","v":"COMPAK SPORTING SPECIÁL, 160 terčů"}]
[{"$f":"Vstup!C4&\", \"&Vstup!C5","v":"COMPAK SPORTING, 3.6.2012"}]
[]
["Skupina: ",null,15,"Kolo :",1,"Rozhodčí:",{"$nulls":23},"∑","Podpis"]
["St. č.","Příjmení, jméno",null,null,"Kat.","Terče"]
[43,{"$nulls":3},{"$error":"#N/A"},"Stanoviště 1",{"$nulls":3},"Stanoviště 2",{"$nulls":3},"Stanoviště 3",{"$nulls":3},"Stanoviště 4",{"$nulls":3},"Stanoviště 5"]
[{"$nulls":5},1,2,3,4,5,6,7,8,9,10,11,12,13,14,15,16,17,18,19,20]
[]
[44,{"$nulls":3},{"$error":"#N/A"},"Stanoviště 2",{"$nulls":3},"Stanoviště 3",{"$nulls":3},"Stanoviště 4",{"$nulls":3},"Stanoviště 5",{"$nulls":7},"Stanoviště 1"]
[{"$nulls":5},1,2,3,4,5,6,7,8,9,10,11,12,13,14,15,16,{"$nulls":4},17,18,19,20]
[]
[45,{"$nulls":3},{"$error":"#N/A"},"Stanoviště 3",{"$nulls":3},"Stanoviště 4",{"$nulls":3},"Stanoviště 5",{"$nulls":7},"Stanoviště 1",{"$nulls":3},"Stanoviště 2"]
[{"$nulls":5},1,2,3,4,5,6,7,8,9,10,11,12,{"$nulls":4},13,14,15,16,17,18,19,20]
[]
[46,{"$nulls":3},{"$error":"#N/A"},"Stanoviště 4",{"$nulls":3},"Stanoviště 5",{"$nulls":7},"Stanoviště 1",{"$nulls":3},"Stanoviště 2",{"$nulls":3},"Stanoviště 3"]
[{"$nulls":5},1,2,3,4,5,6,7,8,{"$nulls":4},9,10,11,12,13,14,15,16,17,18,19,20]
[]
[47,{"$nulls":3},{"$error":"#N/A"},"Stanoviště 5",{"$nulls":7},"Stanoviště 1",{"$nulls":3},"Stanoviště 2",{"$nulls":3},"Stanoviště 3",{"$nulls":3},"Stanoviště 4"]
[{"$nulls":5},1,2,3,4,{"$nulls":4},5,6,7,8,9,10,11,12,13,14,15,16,17,18,19,20]
[]
[48,{"$nulls":3},{"$error":"#N/A"},{"$nulls":4},"Stanoviště 1",{"$nulls":3},"Stanoviště 2",{"$nulls":3},"Stanoviště 3",{"$nulls":3},"Stanoviště 4",{"$nulls":3},"Stanoviště 5"]
[{"$nulls":9},1,2,3,4,5,6,7,8,9,10,11,12,13,14,15,16,17,18,19,20]
[]
["Poznámky:"]

{"sheet":"VList-CS160","index":23,"n_rows":133,"n_cols":15,"rows_kept":133,"merged":[[0,0,0,13],[1,0,1,13],[2,0,2,13],[3,0,3,13],[4,0,6,0],[4,1,6,1],[4,2,6,2],[4,3,4,10],[4,11,6,11],[4,12,6,13],[5,3,6,3],[5,4,6,4],[5,5,6,5],[5,6,6,6],[5,7,6,7],[5,8,6,8],[5,9,6,9],[5,10,6,10],[8,0,8,13],[17,0,17,13],[25,0,25,13],[39,0,39,13],[43,0,43,13]]}
[{"$f":"Vstup!C2","v":"COMPAK SPORTING SPECIÁL"}]
[{"$f":"Vstup!C3&\" - \"&Vstup!C5","v":"160 terčů - 3.6.2012"}]
[]
["VÝSLEDKOVÁ LISTINA"]
["Pořadí","Příjmení, jméno","Kategorie","Střeliště",{"$nulls":7},"R","Σ"]
[{"$nulls":3},{"$f":"Data!F2","v":"SKEET I"},{"$f":"Data!F3","v":"SKEET II"},{"$f":"Data!F4","v":"TRAP I"},{"$f":"Data!F5","v":"TRAP II"},{"$f":"Data!F6","v":"SKEET I/2"},{"$f":"Data!F7","v":"SKEET II/2"},{"$f":"Data!F8","v":"TRAP I/2"},{"$f":"Data!F9","v":"TRAP II/2"}]
[]
[null,{"$f":"IF(Vstup!C44<>\"\",Vstup!C44,\"\")","v":""},{"$f":"IF(Vstup!C44<>\"\",Vstup!D44,\"\")","v":""},{"$f":"VLOOKUP($B8,'Vysledky-doplneni'!$C$7:$L$126,3,0)","v":0},{"$f":"VLOOKUP($B8,'Vysledky-doplneni'!$C$7:$L$126,4,0)","v":0},{"$f":"VLOOKUP($B8,'Vysledky-doplneni'!$C$7:$L$126,5,0)","v":0},{"$f":"VLOOKUP($B8,'Vysledky-doplneni'!$C$7:$L$126,6,0)","v":0},{"$f":"VLOOKUP($B8,'Vysledky-doplneni'!$C$7:$L$126,7,0)","v":0},{"$f":"VLOOKUP($B8,'Vysledky-doplneni'!$C$7:$L$126,8,0)","v":0},{"$f":"VLOOKUP($B8,'Vysledky-doplneni'!$C$7:$L$126,9,0)","v":0},{"$f":"VLOOKUP($B8,'Vysledky-doplneni'!$C$7:$L$126,10,0)","v":0},null,{"$f":"SUM(D8:H8)","v":0},{"$f":"(M8/(20*O8))","v":{"$error":"#DIV/0!"}},{"$f":"COUNTIF(D8:K8,\">0\")","v":0}]
["KATEGORIE A"]
[1,{"$f":"IF(Vstup!C22<>\"\",Vstup!C22,\"\")","v":"Zázvorka Pavel"},{"$f":"IF(Vstup!C22<>\"\",Vstup!D22,\"\")","v":"A"},{"$f":"VLOOKUP($B10,'Vysledky-doplneni'!$C$7:$L$126,3,0)","v":19},{"$f":"VLOOKUP($B10,'Vysledky-doplneni'!$C$7:$L$126,4,0)","v":18},{"$f":"VLOOKUP($B10,'Vysledky-doplneni'!$C$7:$L$126,5,0)","v":17},{"$f":"VLOOKUP($B10,'Vysledky-doplneni'!$C$7:$L$126,6,0)","v":18},{"$f":"VLOOKUP($B10,'Vysledky-doplneni'!$C$7:$L$126,7,0)","v":18},{"$f":"VLOOKUP($B10,'Vysledky-doplneni'!$C$7:$L$126,8,0)","v":17},{"$f":"VLOOKUP($B10,'Vysledky-doplneni'!$C$7:$L$126,9,0)","v":17},{"$f":"VLOOKUP($B10,'Vysledky-doplneni'!$C$7:$L$126,10,0)","v":18},null,{"$f":"SUM(D10:K10)","v":142},{"$f":"(M10/(20*O10))","v":{"v":0.8875,"d":"88.8%"}},{"$f":"COUNTIF(D10:K10,\">0\")","v":8}]
["2",{"$f":"IF(Vstup!C45<>\"\",Vstup!C45,\"\")","v":"Wlodarczyk Remigiusz"},{"$f":"IF(Vstup!C45<>\"\",Vstup!D45,\"\")","v":"A"},{"$f":"VLOOKUP($B11,'Vysledky-doplneni'!$C$7:$L$126,3,0)","v":18},{"$f":"VLOOKUP($B11,'Vysledky-doplneni'!$C$7:$L$126,4,0)","v":13},{"$f":"VLOOKUP($B11,'Vysledky-doplneni'!$C$7:$L$126,5,0)","v":17},{"$f":"VLOOKUP($B11,'Vysledky-doplneni'!$C$7:$L$126,6,0)","v":17},{"$f":"VLOOKUP($B11,'Vysledky-doplneni'!$C$7:$L$126,7,0)","v":17},{"$f":"VLOOKUP($B11,'Vysledky-doplneni'!$C$7:$L$126,8,0)","v":12},{"$f":"VLOOKUP($B11,'Vysledky-doplneni'!$C$7:$L$126,9,0)","v":18},{"$f":"VLOOKUP($B11,'Vysledky-doplneni'!$C$7:$L$126,10,0)","v":18},null,130,{"v":0.8125,"d":"81.3%"},8]
["3",{"$f":"IF(Vstup!C25<>\"\",Vstup!C25,\"\")","v":"Divíšek Martin"},{"$f":"IF(Vstup!C25<>\"\",Vstup!D25,\"\")","v":"A"},{"$f":"VLOOKUP($B12,'Vysledky-doplneni'!$C$7:$L$126,3,0)","v":17},{"$f":"VLOOKUP($B12,'Vysledky-doplneni'!$C$7:$L$126,4,0)","v":16},{"$f":"VLOOKUP($B12,'Vysledky-doplneni'!$C$7:$L$126,5,0)","v":19},{"$f":"VLOOKUP($B12,'Vysledky-doplneni'!$C$7:$L$126,6,0)","v":16},{"$f":"VLOOKUP($B12,'Vysledky-doplneni'!$C$7:$L$126,7,0)","v":17},{"$f":"VLOOKUP($B12,'Vysledky-doplneni'!$C$7:$L$126,8,0)","v":10},{"$f":"VLOOKUP($B12,'Vysledky-doplneni'!$C$7:$L$126,9,0)","v":16},{"$f":"VLOOKUP($B12,'Vysledky-doplneni'!$C$7:$L$126,10,0)","v":14},10,125,{"v":0.78125,"d":"78.1%"},8]
["4",{"$f":"IF(Vstup!C32<>\"\",Vstup!C32,\"\")","v":"Hřebec Jan "},{"$f":"IF(Vstup!C32<>\"\",Vstup!D32,\"\")","v":"A"},{"$f":"VLOOKUP($B13,'Vysledky-doplneni'!$C$7:$L$126,3,0)","v":15},{"$f":"VLOOKUP($B13,'Vysledky-doplneni'!$C$7:$L$126,4,0)","v":15},{"$f":"VLOOKUP($B13,'Vysledky-doplneni'!$C$7:$L$126,5,0)","v":19},{"$f":"VLOOKUP($B13,'Vysledky-doplneni'!$C$7:$L$126,6,0)","v":17},{"$f":"VLOOKUP($B13,'Vysledky-doplneni'!$C$7:$L$126,7,0)","v":16},{"$f":"VLOOKUP($B13,'Vysledky-doplneni'!$C$7:$L$126,8,0)","v":13},{"$f":"VLOOKUP($B13,'Vysledky-doplneni'!$C$7:$L$126,9,0)","v":14},{"$f":"VLOOKUP($B13,'Vysledky-doplneni'!$C$7:$L$126,10,0)","v":16},6,125,{"v":0.78125,"d":"78.1%"},8]
["5",{"$f":"IF(Vstup!C16<>\"\",Vstup!C16,\"\")","v":"Zigo Martin "},{"$f":"IF(Vstup!C16<>\"\",Vstup!D16,\"\")","v":"A"},{"$f":"VLOOKUP($B14,'Vysledky-doplneni'!$C$7:$L$126,3,0)","v":12},{"$f":"VLOOKUP($B14,'Vysledky-doplneni'!$C$7:$L$126,4,0)","v":11},{"$f":"VLOOKUP($B14,'Vysledky-doplneni'!$C$7:$L$126,5,0)","v":16},{"$f":"VLOOKUP($B14,'Vysledky-doplneni'!$C$7:$L$126,6,0)","v":15},{"$f":"VLOOKUP($B14,'Vysledky-doplneni'!$C$7:$L$126,7,0)","v":18},{"$f":"VLOOKUP($B14,'Vysledky-doplneni'!$C$7:$L$126,8,0)","v":9},{"$f":"VLOOKUP($B14,'Vysledky-doplneni'!$C$7:$L$126,9,0)","v":17},{"$f":"VLOOKUP($B14,'Vysledky-doplneni'!$C$7:$L$126,10,0)","v":17},null,115,{"v":0.71875,"d":"71.9%"},8]
["6",{"$f":"IF(Vstup!C13<>\"\",Vstup!C13,\"\")","v":"Černošek Milan"},{"$f":"IF(Vstup!C13<>\"\",Vstup!D13,\"\")","v":"A"},{"$f":"VLOOKUP($B15,'Vysledky-doplneni'!$C$7:$L$126,3,0)","v":20},{"$f":"VLOOKUP($B15,'Vysledky-doplneni'!$C$7:$L$126,4,0)","v":16},{"$f":"VLOOKUP($B15,'Vysledky-doplneni'!$C$7:$L$126,5,0)","v":13},{"$f":"VLOOKUP($B15,'Vysledky-doplneni'!$C$7:$L$126,6,0)","v":15},{"$f":"VLOOKUP($B15,'Vysledky-doplneni'!$C$7:$L$126,7,0)","v":15},{"$f":"VLOOKUP($B15,'Vysledky-doplneni'!$C$7:$L$126,8,0)","v":10},{"$f":"VLOOKUP($B15,'Vysledky-doplneni'!$C$7:$L$126,9,0)","v":13},{"$f":"VLOOKUP($B15,'Vysledky-doplneni'!$C$7:$L$126,10,0)","v":13},null,115,{"v":0.71875,"d":"71.9%"},8]
["7",{"$f":"IF(Vstup!C28<>\"\",Vstup!C28,\"\")","v":"Kotrc Karel"},{"$f":"IF(Vstup!C28<>\"\",Vstup!D28,\"\")","v":"A"},{"$f":"VLOOKUP($B16,'Vysledky-doplneni'!$C$7:$L$126,3,0)","v":18},{"$f":"VLOOKUP($B16,'Vysledky-doplneni'!$C$7:$L$126,4,0)","v":12},{"$f":"VLOOKUP($B16,'Vysledky-doplneni'!$C$7:$L$126,5,0)","v":16},{"$f":"VLOOKUP($B16,'Vysledky-doplneni'!$C$7:$L$126,6,0)","v":17},{"$f":"VLOOKUP($B16,'Vysledky-doplneni'!$C$7:$L$126,7,0)","v":16},{"$f":"VLOOKUP($B16,'Vysledky-doplneni'!$C$7:$L$126,8,0)","v":10},{"$f":"VLOOKUP($B16,'Vysledky-doplneni'!$C$7:$L$126,9,0)","v":15},{"$f":"VLOOKUP($B16,'Vysledky-doplneni'!$C$7:$L$126,10,0)","v":11},null,115,{"v":0.71875,"d":"71.9%"},8]
["8",{"$f":"IF(Vstup!C23<>\"\",Vstup!C23,\"\")","v":"Štengl Jiří"},{"$f":"IF(Vstup!C23<>\"\",Vstup!D23,\"\")","v":"A"},{"$f":"VLOOKUP($B17,'Vysledky-doplneni'!$C$7:$L$126,3,0)","v":17},{"$f":"VLOOKUP($B17,'Vysledky-doplneni'!$C$7:$L$126,4,0)","v":16},{"$f":"VLOOKUP($B17,'Vysledky-doplneni'!$C$7:$L$126,5,0)","v":18},{"$f":"VLOOKUP($B17,'Vysledky-doplneni'!$C$7:$L$126,6,0)","v":14},{"$f":"VLOOKUP($B17,'Vysledky-doplneni'!$C$7:$L$126,7,0)","v":14},{"$f":"VLOOKUP($B17,'Vysledky-doplneni'!$C$7:$L$126,8,0)","v":11},{"$f":"VLOOKUP($B17,'Vysledky-doplneni'!$C$7:$L$126,9,0)","v":9},{"$f":"VLOOKUP($B17,'Vysledky-doplneni'!$C$7:$L$126,10,0)","v":15},null,114,{"v":0.7125,"d":"71.3%"},8]
["KATEGORIE B"]
[1,{"$f":"IF(Vstup!C34<>\"\",Vstup!C34,\"\")","v":"Lengyel Jan "},{"$f":"IF(Vstup!C34<>\"\",Vstup!D34,\"\")","v":"B"},{"$f":"VLOOKUP($B19,'Vysledky-doplneni'!$C$7:$L$126,3,0)","v":19},{"$f":"VLOOKUP($B19,'Vysledky-doplneni'!$C$7:$L$126,4,0)","v":14},{"$f":"VLOOKUP($B19,'Vysledky-doplneni'!$C$7:$L$126,5,0)","v":16},{"$f":"VLOOKUP($B19,'Vysledky-doplneni'!$C$7:$L$126,6,0)","v":14},{"$f":"VLOOKUP($B19,'Vysledky-doplneni'!$C$7:$L$126,7,0)","v":16},{"$f":"VLOOKUP($B19,'Vysledky-doplneni'!$C$7:$L$126,8,0)","v":12},{"$f":"VLOOKUP($B19,'Vysledky-doplneni'!$C$7:$L$126,9,0)","v":15},{"$f":"VLOOKUP($B19,'Vysledky-doplneni'!$C$7:$L$126,10,0)","v":16},null,{"$f":"SUM(D19:K19)","v":122},{"$f":"(M19/(20*O19))","v":{"v":0.7625,"d":"76.3%"}},8]
["2",{"$f":"IF(Vstup!C35<>\"\",Vstup!C35,\"\")","v":"Lengyel Jiří"},{"$f":"IF(Vstup!C35<>\"\",Vstup!D35,\"\")","v":"B"},{"$f":"VLOOKUP($B20,'Vysledky-doplneni'!$C$7:$L$126,3,0)","v":16},{"$f":"VLOOKUP($B20,'Vysledky-doplneni'!$C$7:$L$126,4,0)","v":15},{"$f":"VLOOKUP($B20,'Vysledky-doplneni'!$C$7:$L$126,5,0)","v":13},{"$f":"VLOOKUP($B20,'Vysledky-doplneni'!$C$7:$L$126,6,0)","v":17},{"$f":"VLOOKUP($B20,'Vysledky-doplneni'!$C$7:$L$126,7,0)","v":13},{"$f":"VLOOKUP($B20,'Vysledky-doplneni'!$C$7:$L$126,8,0)","v":12},{"$f":"VLOOKUP($B20,'Vysledky-doplneni'!$C$7:$L$126,9,0)","v":14},{"$f":"VLOOKUP($B20,'Vysledky-doplneni'!$C$7:$L$126,10,0)","v":18},null,118,{"v":0.7375,"d":"73.8%"},8]
["3",{"$f":"IF(Vstup!C41<>\"\",Vstup!C41,\"\")","v":"Štícha Lubomír"},{"$f":"IF(Vstup!C41<>\"\",Vstup!D41,\"\")","v":"B"},{"$f":"VLOOKUP($B21,'Vysledky-doplneni'!$C$7:$L$126,3,0)","v":17},{"$f":"VLOOKUP($B21,'Vysledky-doplneni'!$C$7:$L$126,4,0)","v":12},{"$f":"VLOOKUP($B21,'Vysledky-doplneni'!$C$7:$L$126,5,0)","v":13},{"$f":"VLOOKUP($B21,'Vysledky-doplneni'!$C$7:$L$126,6,0)","v":15},{"$f":"VLOOKUP($B21,'Vysledky-doplneni'!$C$7:$L$126,7,0)","v":15},{"$f":"VLOOKUP($B21,'Vysledky-doplneni'!$C$7:$L$126,8,0)","v":10},{"$f":"VLOOKUP($B21,'Vysledky-doplneni'!$C$7:$L$126,9,0)","v":15},{"$f":"VLOOKUP($B21,'Vysledky-doplneni'!$C$7:$L$126,10,0)","v":16},null,113,{"v":0.70625,"d":"70.6%"},8]
["4",{"$f":"IF(Vstup!C33<>\"\",Vstup!C33,\"\")","v":"Lengyel Ivan"},{"$f":"IF(Vstup!C33<>\"\",Vstup!D33,\"\")","v":"B"},{"$f":"VLOOKUP($B22,'Vysledky-doplneni'!$C$7:$L$126,3,0)","v":15},{"$f":"VLOOKUP($B22,'Vysledky-doplneni'!$C$7:$L$126,4,0)","v":11},{"$f":"VLOOKUP($B22,'Vysledky-doplneni'!$C$7:$L$126,5,0)","v":15},{"$f":"VLOOKUP($B22,'Vysledky-doplneni'!$C$7:$L$126,6,0)","v":15},{"$f":"VLOOKUP($B22,'Vysledky-doplneni'!$C$7:$L$126,7,0)","v":13},{"$f":"VLOOKUP($B22,'Vysledky-doplneni'!$C$7:$L$126,8,0)","v":8},{"$f":"VLOOKUP($B22,'Vysledky-doplneni'!$C$7:$L$126,9,0)","v":11},{"$f":"VLOOKUP($B22,'Vysledky-doplneni'!$C$7:$L$126,10,0)","v":15},null,103,{"v":0.64375,"d":"64.4%"},8]
["5",{"$f":"IF(Vstup!C21<>\"\",Vstup!C21,\"\")","v":"Husar Vladimír "},{"$f":"IF(Vstup!C21<>\"\",Vstup!D21,\"\")","v":"B"},{"$f":"VLOOKUP($B23,'Vysledky-doplneni'!$C$7:$L$126,3,0)","v":16},{"$f":"VLOOKUP($B23,'Vysledky-doplneni'!$C$7:$L$126,4,0)","v":7},{"$f":"VLOOKUP($B23,'Vysledky-doplneni'!$C$7:$L$126,5,0)","v":16},{"$f":"VLOOKUP($B23,'Vysledky-doplneni'!$C$7:$L$126,6,0)","v":10},{"$f":"VLOOKUP($B23,'Vysledky-doplneni'!$C$7:$L$126,7,0)","v":14},{"$f":"VLOOKUP($B23,'Vysledky-doplneni'!$C$7:$L$126,8,0)","v":10},{"$f":"VLOOKUP($B23,'Vysledky-doplneni'!$C$7:$L$126,9,0)","v":17},{"$f":"VLOOKUP($B23,'Vysledky-doplneni'!$C$7:$L$126,10,0)","v":13},null,103,{"v":0.64375,"d":"64.4%"},8]
["6",{"$f":"IF(Vstup!C10<>\"\",Vstup!C10,\"\")","v":"Koloc Martin"},{"$f":"IF(Vstup!C10<>\"\",Vstup!D10,\"\")","v":"B"},{"$f":"VLOOKUP($B24,'Vysledky-doplneni'!$C$7:$L$126,3,0)","v":13},{"$f":"VLOOKUP($B24,'Vysledky-doplneni'!$C$7:$L$126,4,0)","v":11},{"$f":"VLOOKUP($B24,'Vysledky-doplneni'!$C$7:$L$126,5,0)","v":17},{"$f":"VLOOKUP($B24,'Vysledky-doplneni'!$C$7:$L$126,6,0)","v":17},{"$f":"VLOOKUP($B24,'Vysledky-doplneni'!$C$7:$L$126,7,0)","v":9},{"$f":"VLOOKUP($B24,'Vysledky-doplneni'!$C$7:$L$126,8,0)","v":7},{"$f":"VLOOKUP($B24,'Vysledky-doplneni'!$C$7:$L$126,9,0)","v":14},{"$f":"VLOOKUP($B24,'Vysledky-doplneni'!$C$7:$L$126,10,0)","v":13},null,101,{"v":0.63125,"d":"63.1%"},8]
["7",{"$f":"IF(Vstup!C39<>\"\",Vstup!C39,\"\")","v":"Neuvirt Martin"},{"$f":"IF(Vstup!C39<>\"\",Vstup!D39,\"\")","v":"B"},{"$f":"VLOOKUP($B25,'Vysledky-doplneni'!$C$7:$L$126,3,0)","v":13},{"$f":"VLOOKUP($B25,'Vysledky-doplneni'!$C$7:$L$126,4,0)","v":7},{"$f":"VLOOKUP($B25,'Vysledky-doplneni'!$C$7:$L$126,5,0)","v":13},{"$f":"VLOOKUP($B25,'Vysledky-doplneni'!$C$7:$L$126,6,0)","v":16},{"$f":"VLOOKUP($B25,'Vysledky-doplneni'!$C$7:$L$126,7,0)","v":7},{"$f":"VLOOKUP($B25,'Vysledky-doplneni'!$C$7:$L$126,8,0)","v":8},{"$f":"VLOOKUP($B25,'Vysledky-doplneni'!$C$7:$L$126,9,0)","v":14},{"$f":"VLOOKUP($B25,'Vysledky-doplneni'!$C$7:$L$126,10,0)","v":16},null,94,{"v":0.5875,"d":"58.8%"},8]
["KATEGORIE C"]
[1,{"$f":"IF(Vstup!C47<>\"\",Vstup!C47,\"\")","v":"Cieplik Waldemar"},{"$f":"IF(Vstup!C47<>\"\",Vstup!D47,\"\")","v":"C"},{"$f":"VLOOKUP($B27,'Vysledky-doplneni'!$C$7:$L$126,3,0)","v":13},{"$f":"VLOOKUP($B27,'Vysledky-doplneni'!$C$7:$L$126,4,0)","v":14},{"$f":"VLOOKUP($B27,'Vysledky-doplneni'!$C$7:$L$126,5,0)","v":17},{"$f":"VLOOKUP($B27,'Vysledky-doplneni'!$C$7:$L$126,6,0)","v":12},{"$f":"VLOOKUP($B27,'Vysledky-doplneni'!$C$7:$L$126,7,0)","v":16},{"$f":"VLOOKUP($B27,'Vysledky-doplneni'!$C$7:$L$126,8,0)","v":9},{"$f":"VLOOKUP($B27,'Vysledky-doplneni'!$C$7:$L$126,9,0)","v":16},{"$f":"VLOOKUP($B27,'Vysledky-doplneni'!$C$7:$L$126,10,0)","v":15},null,{"$f":"SUM(D27:K27)","v":112},{"$f":"(M27/(20*O27))","v":{"v":0.7,"d":"70.0%"}},8]
["2",{"$f":"IF(Vstup!C18<>\"\",Vstup!C18,\"\")","v":"Mikulka Peter"},{"$f":"IF(Vstup!C18<>\"\",Vstup!D18,\"\")","v":"C"},{"$f":"VLOOKUP($B28,'Vysledky-doplneni'!$C$7:$L$126,3,0)","v":15},{"$f":"VLOOKUP($B28,'Vysledky-doplneni'!$C$7:$L$126,4,0)","v":8},{"$f":"VLOOKUP($B28,'Vysledky-doplneni'!$C$7:$L$126,5,0)","v":15},{"$f":"VLOOKUP($B28,'Vysledky-doplneni'!$C$7:$L$126,6,0)","v":12},{"$f":"VLOOKUP($B28,'Vysledky-doplneni'!$C$7:$L$126,7,0)","v":17},{"$f":"VLOOKUP($B28,'Vysledky-doplneni'!$C$7:$L$126,8,0)","v":4},{"$f":"VLOOKUP($B28,'Vysledky-doplneni'!$C$7:$L$126,9,0)","v":13},{"$f":"VLOOKUP($B28,'Vysledky-doplneni'!$C$7:$L$126,10,0)","v":15},null,99,{"v":0.61875,"d":"61.9%"},8]
["3",{"$f":"IF(Vstup!C46<>\"\",Vstup!C46,\"\")","v":"Jedros Witold"},{"$f":"IF(Vstup!C46<>\"\",Vstup!D46,\"\")","v":"C"},{"$f":"VLOOKUP($B29,'Vysledky-doplneni'!$C$7:$L$126,3,0)","v":14},{"$f":"VLOOKUP($B29,'Vysledky-doplneni'!$C$7:$L$126,4,0)","v":13},{"$f":"VLOOKUP($B29,'Vysledky-doplneni'!$C$7:$L$126,5,0)","v":13},{"$f":"VLOOKUP($B29,'Vysledky-doplneni'!$C$7:$L$126,6,0)","v":17},{"$f":"VLOOKUP($B29,'Vysledky-doplneni'!$C$7:$L$126,7,0)","v":11},{"$f":"VLOOKUP($B29,'Vysledky-doplneni'!$C$7:$L$126,8,0)","v":9},{"$f":"VLOOKUP($B29,'Vysledky-doplneni'!$C$7:$L$126,9,0)","v":12},{"$f":"VLOOKUP($B29,'Vysledky-doplneni'!$C$7:$L$126,10,0)","v":9},null,98,{"v":0.6125,"d":"61.3%"},8]
["4",{"$f":"IF(Vstup!C24<>\"\",Vstup!C24,\"\")","v":"Korál Petr"},{"$f":"IF(Vstup!C24<>\"\",Vstup!D24,\"\")","v":"C"},{"$f":"VLOOKUP($B30,'Vysledky-doplneni'!$C$7:$L$126,3,0)","v":12},{"$f":"VLOOKUP($B30,'Vysledky-doplneni'!$C$7:$L$126,4,0)","v":13},{"$f":"VLOOKUP($B30,'Vysledky-doplneni'!$C$7:$L$126,5,0)","v":10},{"$f":"VLOOKUP($B30,'Vysledky-doplneni'!$C$7:$L$126,6,0)","v":14},{"$f":"VLOOKUP($B30,'Vysledky-doplneni'!$C$7:$L$126,7,0)","v":13},{"$f":"VLOOKUP($B30,'Vysledky-doplneni'!$C$7:$L$126,8,0)","v":8},{"$f":"VLOOKUP($B30,'Vysledky-doplneni'!$C$7:$L$126,9,0)","v":9},{"$f":"VLOOKUP($B30,'Vysledky-doplneni'!$C$7:$L$126,10,0)","v":14},null,93,{"v":0.58125,"d":"58.1%"},8]
["5",{"$f":"IF(Vstup!C37<>\"\",Vstup!C37,\"\")","v":"Horák František"},{"$f":"IF(Vstup!C37<>\"\",Vstup!D37,\"\")","v":"C"},{"$f":"VLOOKUP($B31,'Vysledky-doplneni'!$C$7:$L$126,3,0)","v":13},{"$f":"VLOOKUP($B31,'Vysledky-doplneni'!$C$7:$L$126,4,0)","v":11},{"$f":"VLOOKUP($B31,'Vysledky-doplneni'!$C$7:$L$126,5,0)","v":15},{"$f":"VLOOKUP($B31,'Vysledky-doplneni'!$C$7:$L$126,6,0)","v":12},{"$f":"VLOOKUP($B31,'Vysledky-doplneni'!$C$7:$L$126,7,0)","v":7},{"$f":"VLOOKUP($B31,'Vysledky-doplneni'!$C$7:$L$126,8,0)","v":6},{"$f":"VLOOKUP($B31,'Vysledky-doplneni'!$C$7:$L$126,9,0)","v":10},{"$f":"VLOOKUP($B31,'Vysledky-doplneni'!$C$7:$L$126,10,0)","v":15},null,89,{"v":0.55625,"d":"55.6%"},8]
["6",{"$f":"IF(Vstup!C30<>\"\",Vstup!C30,\"\")","v":"Mrázek Lubomír"},{"$f":"IF(Vstup!C30<>\"\",Vstup!D30,\"\")","v":"C"},{"$f":"VLOOKUP($B32,'Vysledky-doplneni'!$C$7:$L$126,3,0)","v":15},{"$f":"VLOOKUP($B32,'Vysledky-doplneni'!$C$7:$L$126,4,0)","v":3},{"$f":"VLOOKUP($B32,'Vysledky-doplneni'!$C$7:$L$126,5,0)","v":15},{"$f":"VLOOKUP($B32,'Vysledky-doplneni'!$C$7:$L$126,6,0)","v":16},{"$f":"VLOOKUP($B32,'Vysledky-doplneni'!$C$7:$L$126,7,0)","v":7},{"$f":"VLOOKUP($B32,'Vysledky-doplneni'!$C$7:$L$126,8,0)","v":7},{"$f":"VLOOKUP($B32,'Vysledky-doplneni'!$C$7:$L$126,9,0)","v":13},{"$f":"VLOOKUP($B32,'Vysledky-doplneni'!$C$7:$L$126,10,0)","v":12},null,88,{"v":0.55,"d":"55.0%"},8]
["7",{"$f":"IF(Vstup!C9<>\"\",Vstup!C9,\"\")","v":"Dolanský Jan"},{"$f":"IF(Vstup!C9<>\"\",Vstup!D9,\"\")","v":"C"},{"$f":"VLOOKUP($B33,'Vysledky-doplneni'!$C$7:$L$126,3,0)","v":15},{"$f":"VLOOKUP($B33,'Vysledky-doplneni'!$C$7:$L$126,4,0)","v":4},{"$f":"VLOOKUP($B33,'Vysledky-doplneni'!$C$7:$L$126,5,0)","v":13},{"$f":"VLOOKUP($B33,'Vysledky-doplneni'!$C$7:$L$126,6,0)","v":13},{"$f":"VLOOKUP($B33,'Vysledky-doplneni'!$C$7:$L$126,7,0)","v":13},{"$f":"VLOOKUP($B33,'Vysledky-doplneni'!$C$7:$L$126,8,0)","v":3},{"$f":"VLOOKUP($B33,'Vysledky-doplneni'!$C$7:$L$126,9,0)","v":10},{"$f":"VLOOKUP($B33,'Vysledky-doplneni'!$C$7:$L$126,10,0)","v":14},null,85,{"v":0.53125,"d":"53.1%"},8]
["8",{"$f":"IF(Vstup!C19<>\"\",Vstup!C19,\"\")","v":"Hedvik Jaromír"},{"$f":"IF(Vstup!C19<>\"\",Vstup!D19,\"\")","v":"C"},{"$f":"VLOOKUP($B34,'Vysledky-doplneni'!$C$7:$L$126,3,0)","v":13},{"$f":"VLOOKUP($B34,'Vysledky-doplneni'!$C$7:$L$126,4,0)","v":15},{"$f":"VLOOKUP($B34,'Vysledky-doplneni'!$C$7:$L$126,5,0)","v":13},{"$f":"VLOOKUP($B34,'Vysledky-doplneni'!$C$7:$L$126,6,0)","v":11},{"$f":"VLOOKUP($B34,'Vysledky-doplneni'!$C$7:$L$126,7,0)","v":12},{"$f":"VLOOKUP($B34,'Vysledky-doplneni'!$C$7:$L$126,8,0)","v":9},{"$f":"VLOOKUP($B34,'Vysledky-doplneni'!$C$7:$L$126,9,0)","v":5},{"$f":"VLOOKUP($B34,'Vysledky-doplneni'!$C$7:$L$126,10,0)","v":7},null,85,{"v":0.53125,"d":"53.1%"},8]
["9",{"$f":"IF(Vstup!C12<>\"\",Vstup!C12,\"\")","v":"Hoštička Eduard"},{"$f":"IF(Vstup!C12<>\"\",Vstup!D12,\"\")","v":"C"},{"$f":"VLOOKUP($B35,'Vysledky-doplneni'!$C$7:$L$126,3,0)","v":13},{"$f":"VLOOKUP($B35,'Vysledky-doplneni'!$C$7:$L$126,4,0)","v":7},{"$f":"VLOOKUP($B35,'Vysledky-doplneni'!$C$7:$L$126,5,0)","v":13},{"$f":"VLOOKUP($B35,'Vysledky-doplneni'!$C$7:$L$126,6,0)","v":9},{"$f":"VLOOKUP($B35,'Vysledky-doplneni'!$C$7:$L$126,7,0)","v":11},{"$f":"VLOOKUP($B35,'Vysledky-doplneni'!$C$7:$L$126,8,0)","v":9},{"$f":"VLOOKUP($B35,'Vysledky-doplneni'!$C$7:$L$126,9,0)","v":12},{"$f":"VLOOKUP($B35,'Vysledky-doplneni'!$C$7:$L$126,10,0)","v":10},null,84,{"v":0.525,"d":"52.5%"},8]
["10",{"$f":"IF(Vstup!C42<>\"\",Vstup!C42,\"\")","v":"Vavrečka Michal"},{"$f":"IF(Vstup!C42<>\"\",Vstup!D42,\"\")","v":"C"},{"$f":"VLOOKUP($B36,'Vysledky-doplneni'!$C$7:$L$126,3,0)","v":12},{"$f":"VLOOKUP($B36,'Vysledky-doplneni'!$C$7:$L$126,4,0)","v":7},{"$f":"VLOOKUP($B36,'Vysledky-doplneni'!$C$7:$L$126,5,0)","v":12},{"$f":"VLOOKUP($B36,'Vysledky-doplneni'!$C$7:$L$126,6,0)","v":11},{"$f":"VLOOKUP($B36,'Vysledky-doplneni'!$C$7:$L$126,7,0)","v":9},{"$f":"VLOOKUP($B36,'Vysledky-doplneni'!$C$7:$L$126,8,0)","v":5},{"$f":"VLOOKUP($B36,'Vysledky-doplneni'!$C$7:$L$126,9,0)","v":14},{"$f":"VLOOKUP($B36,'Vysledky-doplneni'!$C$7:$L$126,10,0)","v":11},null,81,{"v":0.50625,"d":"50.6%"},8]
["11",{"$f":"IF(Vstup!C11<>\"\",Vstup!C11,\"\")","v":"Greš Marek"},{"$f":"IF(Vstup!C11<>\"\",Vstup!D11,\"\")","v":"C"},{"$f":"VLOOKUP($B37,'Vysledky-doplneni'!$C$7:$L$126,3,0)","v":14},{"$f":"VLOOKUP($B37,'Vysledky-doplneni'!$C$7:$L$126,4,0)","v":8},{"$f":"VLOOKUP($B37,'Vysledky-doplneni'!$C$7:$L$126,5,0)","v":10},{"$f":"VLOOKUP($B37,'Vysledky-doplneni'!$C$7:$L$126,6,0)","v":11},{"$f":"VLOOKUP($B37,'Vysledky-doplneni'!$C$7:$L$126,7,0)","v":10},{"$f":"VLOOKUP($B37,'Vysledky-doplneni'!$C$7:$L$126,8,0)","v":6},{"$f":"VLOOKUP($B37,'Vysledky-doplneni'!$C$7:$L$126,9,0)","v":8},{"$f":"VLOOKUP($B37,'Vysledky-doplneni'!$C$7:$L$126,10,0)","v":13},null,80,{"v":0.5,"d":"50.0%"},8]
["12",{"$f":"IF(Vstup!C27<>\"\",Vstup!C27,\"\")","v":"Jirků Milan "},{"$f":"IF(Vstup!C27<>\"\",Vstup!D27,\"\")","v":"C"},{"$f":"VLOOKUP($B38,'Vysledky-doplneni'!$C$7:$L$126,3,0)","v":9},{"$f":"VLOOKUP($B38,'Vysledky-doplneni'!$C$7:$L$126,4,0)","v":10},{"$f":"VLOOKUP($B38,'Vysledky-doplneni'!$C$7:$L$126,5,0)","v":10},{"$f":"VLOOKUP($B38,'Vysledky-doplneni'!$C$7:$L$126,6,0)","v":10},{"$f":"VLOOKUP($B38,'Vysledky-doplneni'!$C$7:$L$126,7,0)","v":8},{"$f":"VLOOKUP($B38,'Vysledky-doplneni'!$C$7:$L$126,8,0)","v":8},{"$f":"VLOOKUP($B38,'Vysledky-doplneni'!$C$7:$L$126,9,0)","v":10},{"$f":"VLOOKUP($B38,'Vysledky-doplneni'!$C$7:$L$126,10,0)","v":7},null,72,{"v":0.45,"d":"45.0%"},8]
[13,{"$f":"IF(Vstup!C43<>\"\",Vstup!C43,\"\")","v":"Jelínek Aleš"},{"$f":"IF(Vstup!C43<>\"\",Vstup!D43,\"\")","v":"C"},{"$f":"VLOOKUP($B39,'Vysledky-doplneni'!$C$7:$L$126,3,0)","v":14},{"$f":"VLOOKUP($B39,'Vysledky-doplneni'!$C$7:$L$126,4,0)","v":3},{"$f":"VLOOKUP($B39,'Vysledky-doplneni'!$C$7:$L$126,5,0)","v":10},{"$f":"VLOOKUP($B39,'Vysledky-doplneni'!$C$7:$L$126,6,0)","v":7},{"$f":"VLOOKUP($B39,'Vysledky-doplneni'!$C$7:$L$126,7,0)","v":8},{"$f":"VLOOKUP($B39,'Vysledky-doplneni'!$C$7:$L$126,8,0)","v":4},{"$f":"VLOOKUP($B39,'Vysledky-doplneni'!$C$7:$L$126,9,0)","v":4},{"$f":"VLOOKUP($B39,'Vysledky-doplneni'!$C$7:$L$126,10,0)","v":5},null,55,{"v":0.34375,"d":"34.4%"},8]
["KATEGORIE JUNIOŘI"]
[1,{"$f":"IF(Vstup!C20<>\"\",Vstup!C20,\"\")","v":"Jankovský Jakub "},{"$f":"IF(Vstup!C20<>\"\",Vstup!D20,\"\")","v":"J"},{"$f":"VLOOKUP($B41,'Vysledky-doplneni'!$C$7:$L$126,3,0)","v":17},{"$f":"VLOOKUP($B41,'Vysledky-doplneni'!$C$7:$L$126,4,0)","v":17},{"$f":"VLOOKUP($B41,'Vysledky-doplneni'!$C$7:$L$126,5,0)","v":17},{"$f":"VLOOKUP($B41,'Vysledky-doplneni'!$C$7:$L$126,6,0)","v":18},{"$f":"VLOOKUP($B41,'Vysledky-doplneni'!$C$7:$L$126,7,0)","v":14},{"$f":"VLOOKUP($B41,'Vysledky-doplneni'!$C$7:$L$126,8,0)","v":9},{"$f":"VLOOKUP($B41,'Vysledky-doplneni'!$C$7:$L$126,9,0)","v":17},{"$f":"VLOOKUP($B41,'Vysledky-doplneni'!$C$7:$L$126,10,0)","v":17},null,{"$f":"SUM(D41:K41)","v":126},{"$f":"(M41/(20*O41))","v":{"v":0.7875,"d":"78.8%"}},8]
[2,{"$f":"IF(Vstup!C31<>\"\",Vstup!C31,\"\")","v":"Hřebec Jan ml."},{"$f":"IF(Vstup!C31<>\"\",Vstup!D31,\"\")","v":"J"},{"$f":"VLOOKUP($B42,'Vysledky-doplneni'!$C$7:$L$126,3,0)","v":16},{"$f":"VLOOKUP($B42,'Vysledky-doplneni'!$C$7:$L$126,4,0)","v":14},{"$f":"VLOOKUP($B42,'Vysledky-doplneni'!$C$7:$L$126,5,0)","v":13},{"$f":"VLOOKUP($B42,'Vysledky-doplneni'!$C$7:$L$126,6,0)","v":13},{"$f":"VLOOKUP($B42,'Vysledky-doplneni'!$C$7:$L$126,7,0)","v":14},{"$f":"VLOOKUP($B42,'Vysledky-doplneni'!$C$7:$L$126,8,0)","v":7},{"$f":"VLOOKUP($B42,'Vysledky-doplneni'!$C$7:$L$126,9,0)","v":13},{"$f":"VLOOKUP($B42,'Vysledky-doplneni'!$C$7:$L$126,10,0)","v":17},null,107,{"$f":"(M42/(20*O42))","v":{"v":0.66875,"d":"66.9%"}},8]
[3,{"$f":"IF(Vstup!C26<>\"\",Vstup!C26,\"\")","v":"Divíšek Martin ml."},{"$f":"IF(Vstup!C26<>\"\",Vstup!D26,\"\")","v":"J"},{"$f":"VLOOKUP($B43,'Vysledky-doplneni'!$C$7:$L$126,3,0)","v":14},{"$f":"VLOOKUP($B43,'Vysledky-doplneni'!$C$7:$L$126,4,0)","v":10},{"$f":"VLOOKUP($B43,'Vysledky-doplneni'!$C$7:$L$126,5,0)","v":12},{"$f":"VLOOKUP($B43,'Vysledky-doplneni'!$C$7:$L$126,6,0)","v":10},{"$f":"VLOOKUP($B43,'Vysledky-doplneni'!$C$7:$L$126,7,0)","v":13},{"$f":"VLOOKUP($B43,'Vysledky-doplneni'!$C$7:$L$126,8,0)","v":8},{"$f":"VLOOKUP($B43,'Vysledky-doplneni'!$C$7:$L$126,9,0)","v":11},{"$f":"VLOOKUP($B43,'Vysledky-doplneni'!$C$7:$L$126,10,0)","v":10},null,88,{"$f":"(M43/(20*O43))","v":{"v":0.55,"d":"55.0%"}},8]
["KATEGORIE VETERÁNI"]
[1,{"$f":"IF(Vstup!C17<>\"\",Vstup!C17,\"\")","v":"Uher Jaromír"},{"$f":"IF(Vstup!C17<>\"\",Vstup!D17,\"\")","v":"V"},{"$f":"VLOOKUP($B45,'Vysledky-doplneni'!$C$7:$L$126,3,0)","v":18},{"$f":"VLOOKUP($B45,'Vysledky-doplneni'!$C$7:$L$126,4,0)","v":16},{"$f":"VLOOKUP($B45,'Vysledky-doplneni'!$C$7:$L$126,5,0)","v":17},{"$f":"VLOOKUP($B45,'Vysledky-doplneni'!$C$7:$L$126,6,0)","v":18},{"$f":"VLOOKUP($B45,'Vysledky-doplneni'!$C$7:$L$126,7,0)","v":17},{"$f":"VLOOKUP($B45,'Vysledky-doplneni'!$C$7:$L$126,8,0)","v":13},{"$f":"VLOOKUP($B45,'Vysledky-doplneni'!$C$7:$L$126,9,0)","v":14},{"$f":"VLOOKUP($B45,'Vysledky-doplneni'!$C$7:$L$126,10,0)","v":17},null,{"$f":"SUM(D45:K45)","v":130},{"$f":"(M45/(20*O45))","v":{"v":0.8125,"d":"81.3%"}},8]
["2",{"$f":"IF(Vstup!C15<>\"\",Vstup!C15,\"\")","v":"Otáhal Milan "},{"$f":"IF(Vstup!C15<>\"\",Vstup!D15,\"\")","v":"V"},{"$f":"VLOOKUP($B46,'Vysledky-doplneni'!$C$7:$L$126,3,0)","v":18},{"$f":"VLOOKUP($B46,'Vysledky-doplneni'!$C$7:$L$126,4,0)","v":13},{"$f":"VLOOKUP($B46,'Vysledky-doplneni'!$C$7:$L$126,5,0)","v":14},{"$f":"VLOOKUP($B46,'Vysledky-doplneni'!$C$7:$L$126,6,0)","v":17},{"$f":"VLOOKUP($B46,'Vysledky-doplneni'!$C$7:$L$126,7,0)","v":18},{"$f":"VLOOKUP($B46,'Vysledky-doplneni'!$C$7:$L$126,8,0)","v":14},{"$f":"VLOOKUP($B46,'Vysledky-doplneni'!$C$7:$L$126,9,0)","v":14},{"$f":"VLOOKUP($B46,'Vysledky-doplneni'!$C$7:$L$126,10,0)","v":13},null,121,{"v":0.75625,"d":"75.6%"},8]
["3",{"$f":"IF(Vstup!C29<>\"\",Vstup!C29,\"\")","v":"Říha Milan "},{"$f":"IF(Vstup!C29<>\"\",Vstup!D29,\"\")","v":"V"},{"$f":"VLOOKUP($B47,'Vysledky-doplneni'!$C$7:$L$126,3,0)","v":18},{"$f":"VLOOKUP($B47,'Vysledky-doplneni'!$C$7:$L$126,4,0)","v":13},{"$f":"VLOOKUP($B47,'Vysledky-doplneni'!$C$7:$L$126,5,0)","v":17},{"$f":"VLOOKUP($B47,'Vysledky-doplneni'!$C$7:$L$126,6,0)","v":16},{"$f":"VLOOKUP($B47,'Vysledky-doplneni'!$C$7:$L$126,7,0)","v":10},{"$f":"VLOOKUP($B47,'Vysledky-doplneni'!$C$7:$L$126,8,0)","v":12},{"$f":"VLOOKUP($B47,'Vysledky-doplneni'!$C$7:$L$126,9,0)","v":14},{"$f":"VLOOKUP($B47,'Vysledky-doplneni'!$C$7:$L$126,10,0)","v":16},null,116,{"v":0.725,"d":"72.5%"},8]
["4",{"$f":"IF(Vstup!C14<>\"\",Vstup!C14,\"\")","v":"Vadlejch Josef"},{"$f":"IF(Vstup!C14<>\"\",Vstup!D14,\"\")","v":"V"},{"$f":"VLOOKUP($B48,'Vysledky-doplneni'!$C$7:$L$126,3,0)","v":13},{"$f":"VLOOKUP($B48,'Vysledky-doplneni'!$C$7:$L$126,4,0)","v":12},{"$f":"VLOOKUP($B48,'Vysledky-doplneni'!$C$7:$L$126,5,0)","v":16},{"$f":"VLOOKUP($B48,'Vysledky-doplneni'!$C$7:$L$126,6,0)","v":13},{"$f":"VLOOKUP($B48,'Vysledky-doplneni'!$C$7:$L$126,7,0)","v":13},{"$f":"VLOOKUP($B48,'Vysledky-doplneni'!$C$7:$L$126,8,0)","v":11},{"$f":"VLOOKUP($B48,'Vysledky-doplneni'!$C$7:$L$126,9,0)","v":14},{"$f":"VLOOKUP($B48,'Vysledky-doplneni'!$C$7:$L$126,10,0)","v":14},null,106,{"v":0.6625,"d":"66.3%"},8]
["5",{"$f":"IF(Vstup!C40<>\"\",Vstup!C40,\"\")","v":"Neuvirt Václav"},{"$f":"IF(Vstup!C40<>\"\",Vstup!D40,\"\")","v":"V"},{"$f":"VLOOKUP($B49,'Vysledky-doplneni'!$C$7:$L$126,3,0)","v":14},{"$f":"VLOOKUP($B49,'Vysledky-doplneni'!$C$7:$L$126,4,0)","v":12},{"$f":"VLOOKUP($B49,'Vysledky-doplneni'!$C$7:$L$126,5,0)","v":12},{"$f":"VLOOKUP($B49,'Vysledky-doplneni'!$C$7:$L$126,6,0)","v":12},{"$f":"VLOOKUP($B49,'Vysledky-doplneni'!$C$7:$L$126,7,0)","v":15},{"$f":"VLOOKUP($B49,'Vysledky-doplneni'!$C$7:$L$126,8,0)","v":11},{"$f":"VLOOKUP($B49,'Vysledky-doplneni'!$C$7:$L$126,9,0)","v":10},{"$f":"VLOOKUP($B49,'Vysledky-doplneni'!$C$7:$L$126,10,0)","v":8},null,94,{"v":0.5875,"d":"58.8%"},8]
["6",{"$f":"IF(Vstup!C38<>\"\",Vstup!C38,\"\")","v":"Kubík Jindřich"},{"$f":"IF(Vstup!C38<>\"\",Vstup!D38,\"\")","v":"V"},{"$f":"VLOOKUP($B50,'Vysledky-doplneni'!$C$7:$L$126,3,0)","v":11},{"$f":"VLOOKUP($B50,'Vysledky-doplneni'!$C$7:$L$126,4,0)","v":9},{"$f":"VLOOKUP($B50,'Vysledky-doplneni'!$C$7:$L$126,5,0)","v":12},{"$f":"VLOOKUP($B50,'Vysledky-doplneni'!$C$7:$L$126,6,0)","v":14},{"$f":"VLOOKUP($B50,'Vysledky-doplneni'!$C$7:$L$126,7,0)","v":13},{"$f":"VLOOKUP($B50,'Vysledky-doplneni'!$C$7:$L$126,8,0)","v":10},{"$f":"VLOOKUP($B50,'Vysledky-doplneni'!$C$7:$L$126,9,0)","v":11},{"$f":"VLOOKUP($B50,'Vysledky-doplneni'!$C$7:$L$126,10,0)","v":10},null,90,{"v":0.5625,"d":"56.3%"},8]
["7",{"$f":"IF(Vstup!C36<>\"\",Vstup!C36,\"\")","v":"Jelínek Jiří"},{"$f":"IF(Vstup!C36<>\"\",Vstup!D36,\"\")","v":"V"},{"$f":"VLOOKUP($B51,'Vysledky-doplneni'!$C$7:$L$126,3,0)","v":16},{"$f":"VLOOKUP($B51,'Vysledky-doplneni'!$C$7:$L$126,4,0)","v":11},{"$f":"VLOOKUP($B51,'Vysledky-doplneni'!$C$7:$L$126,5,0)","v":11},{"$f":"VLOOKUP($B51,'Vysledky-doplneni'!$C$7:$L$126,6,0)","v":11},{"$f":"VLOOKUP($B51,'Vysledky-doplneni'!$C$7:$L$126,7,0)","v":11},{"$f":"VLOOKUP($B51,'Vysledky-doplneni'!$C$7:$L$126,8,0)","v":6},{"$f":"VLOOKUP($B51,'Vysledky-doplneni'!$C$7:$L$126,9,0)","v":13},{"$f":"VLOOKUP($B51,'Vysledky-doplneni'!$C$7:$L$126,10,0)","v":6},null,85,{"v":0.53125,"d":"53.1%"},8]
[null,{"$f":"IF(Vstup!C48<>\"\",Vstup!C48,\"\")","v":""},{"$f":"IF(Vstup!C48<>\"\",Vstup!D48,\"\")","v":""},{"$f":"VLOOKUP($B52,'Vysledky-doplneni'!$C$7:$L$126,3,0)","v":0},{"$f":"VLOOKUP($B52,'Vysledky-doplneni'!$C$7:$L$126,4,0)","v":0},{"$f":"VLOOKUP($B52,'Vysledky-doplneni'!$C$7:$L$126,5,0)","v":0},{"$f":"VLOOKUP($B52,'Vysledky-doplneni'!$C$7:$L$126,6,0)","v":0},{"$f":"VLOOKUP($B52,'Vysledky-doplneni'!$C$7:$L$126,7,0)","v":0},{"$f":"VLOOKUP($B52,'Vysledky-doplneni'!$C$7:$L$126,8,0)","v":0},{"$f":"VLOOKUP($B52,'Vysledky-doplneni'!$C$7:$L$126,9,0)","v":0},{"$f":"VLOOKUP($B52,'Vysledky-doplneni'!$C$7:$L$126,10,0)","v":0},null,{"$f":"SUM(D52:H52)","v":0},{"$f":"(M52/(20*O52))","v":{"$error":"#DIV/0!"}},0]
[null,{"$f":"IF(Vstup!C49<>\"\",Vstup!C49,\"\")","v":""},{"$f":"IF(Vstup!C49<>\"\",Vstup!D49,\"\")","v":""},{"$f":"VLOOKUP($B53,'Vysledky-doplneni'!$C$7:$L$126,3,0)","v":0},{"$f":"VLOOKUP($B53,'Vysledky-doplneni'!$C$7:$L$126,4,0)","v":0},{"$f":"VLOOKUP($B53,'Vysledky-doplneni'!$C$7:$L$126,5,0)","v":0},{"$f":"VLOOKUP($B53,'Vysledky-doplneni'!$C$7:$L$126,6,0)","v":0},{"$f":"VLOOKUP($B53,'Vysledky-doplneni'!$C$7:$L$126,7,0)","v":0},{"$f":"VLOOKUP($B53,'Vysledky-doplneni'!$C$7:$L$126,8,0)","v":0},{"$f":"VLOOKUP($B53,'Vysledky-doplneni'!$C$7:$L$126,9,0)","v":0},{"$f":"VLOOKUP($B53,'Vysledky-doplneni'!$C$7:$L$126,10,0)","v":0},null,0,{"$error":"#DIV/0!"},0]
[{"$f":"IF(Vstup!C50<>\"\",Vstup!B50,\"\")","v":""},{"$f":"IF(Vstup!C50<>\"\",Vstup!C50,\"\")","v":""},{"$f":"IF(Vstup!C50<>\"\",Vstup!D50,\"\")","v":""},{"$f":"VLOOKUP($B54,'Vysledky-doplneni'!$C$7:$L$126,3,0)","v":0},{"$f":"VLOOKUP($B54,'Vysledky-doplneni'!$C$7:$L$126,4,0)","v":0},{"$f":"VLOOKUP($B54,'Vysledky-doplneni'!$C$7:$L$126,5,0)","v":0},{"$f":"VLOOKUP($B54,'Vysledky-doplneni'!$C$7:$L$126,6,0)","v":0},{"$f":"VLOOKUP($B54,'Vysledky-doplneni'!$C$7:$L$126,7,0)","v":0},{"$f":"VLOOKUP($B54,'Vysledky-doplneni'!$C$7:$L$126,8,0)","v":0},{"$f":"VLOOKUP($B54,'Vysledky-doplneni'!$C$7:$L$126,9,0)","v":0},{"$f":"VLOOKUP($B54,'Vysledky-doplneni'!$C$7:$L$126,10,0)","v":0},null,0,{"$error":"#DIV/0!"},0]
[{"$f":"IF(Vstup!C51<>\"\",Vstup!B51,\"\")","v":""},{"$f":"IF(Vstup!C51<>\"\",Vstup!C51,\"\")","v":""},{"$f":"IF(Vstup!C51<>\"\",Vstup!D51,\"\")","v":""},{"$f":"VLOOKUP($B55,'Vysledky-doplneni'!$C$7:$L$126,3,0)","v":0},{"$f":"VLOOKUP($B55,'Vysledky-doplneni'!$C$7:$L$126,4,0)","v":0},{"$f":"VLOOKUP($B55,'Vysledky-doplneni'!$C$7:$L$126,5,0)","v":0},{"$f":"VLOOKUP($B55,'Vysledky-doplneni'!$C$7:$L$126,6,0)","v":0},{"$f":"VLOOKUP($B55,'Vysledky-doplneni'!$C$7:$L$126,7,0)","v":0},{"$f":"VLOOKUP($B55,'Vysledky-doplneni'!$C$7:$L$126,8,0)","v":0},{"$f":"VLOOKUP($B55,'Vysledky-doplneni'!$C$7:$L$126,9,0)","v":0},{"$f":"VLOOKUP($B55,'Vysledky-doplneni'!$C$7:$L$126,10,0)","v":0},null,0,{"$error":"#DIV/0!"},0]
[{"$f":"IF(Vstup!C52<>\"\",Vstup!B52,\"\")","v":""},{"$f":"IF(Vstup!C52<>\"\",Vstup!C52,\"\")","v":""},{"$f":"IF(Vstup!C52<>\"\",Vstup!D52,\"\")","v":""},{"$f":"VLOOKUP($B56,'Vysledky-doplneni'!$C$7:$L$126,3,0)","v":0},{"$f":"VLOOKUP($B56,'Vysledky-doplneni'!$C$7:$L$126,4,0)","v":0},{"$f":"VLOOKUP($B56,'Vysledky-doplneni'!$C$7:$L$126,5,0)","v":0},{"$f":"VLOOKUP($B56,'Vysledky-doplneni'!$C$7:$L$126,6,0)","v":0},{"$f":"VLOOKUP($B56,'Vysledky-doplneni'!$C$7:$L$126,7,0)","v":0},{"$f":"VLOOKUP($B56,'Vysledky-doplneni'!$C$7:$L$126,8,0)","v":0},{"$f":"VLOOKUP($B56,'Vysledky-doplneni'!$C$7:$L$126,9,0)","v":0},{"$f":"VLOOKUP($B56,'Vysledky-doplneni'!$C$7:$L$126,10,0)","v":0},null,0,{"$error":"#DIV/0!"},0]
[{"$f":"IF(Vstup!C53<>\"\",Vstup!B53,\"\")","v":""},{"$f":"IF(Vstup!C53<>\"\",Vstup!C53,\"\")","v":""},{"$f":"IF(Vstup!C53<>\"\",Vstup!D53,\"\")","v":""},{"$f":"VLOOKUP($B57,'Vysledky-doplneni'!$C$7:$L$126,3,0)","v":0},{"$f":"VLOOKUP($B57,'Vysledky-doplneni'!$C$7:$L$126,4,0)","v":0},{"$f":"VLOOKUP($B57,'Vysledky-doplneni'!$C$7:$L$126,5,0)","v":0},{"$f":"VLOOKUP($B57,'Vysledky-doplneni'!$C$7:$L$126,6,0)","v":0},{"$f":"VLOOKUP($B57,'Vysledky-doplneni'!$C$7:$L$126,7,0)","v":0},{"$f":"VLOOKUP($B57,'Vysledky-doplneni'!$C$7:$L$126,8,0)","v":0},{"$f":"VLOOKUP($B57,'Vysledky-doplneni'!$C$7:$L$126,9,0)","v":0},{"$f":"VLOOKUP($B57,'Vysledky-doplneni'!$C$7:$L$126,10,0)","v":0},null,0,{"$error":"#DIV/0!"},0]
[{"$f":"IF(Vstup!C54<>\"\",Vstup!B54,\"\")","v":""},{"$f":"IF(Vstup!C54<>\"\",Vstup!C54,\"\")","v":""},{"$f":"IF(Vstup!C54<>\"\",Vstup!D54,\"\")","v":""},{"$f":"VLOOKUP($B58,'Vysledky-doplneni'!$C$7:$L$126,3,0)","v":0},{"$f":"VLOOKUP($B58,'Vysledky-doplneni'!$C$7:$L$126,4,0)","v":0},{"$f":"VLOOKUP($B58,'Vysledky-doplneni'!$C$7:$L$126,5,0)","v":0},{"$f":"VLOOKUP($B58,'Vysledky-doplneni'!$C$7:$L$126,6,0)","v":0},{"$f":"VLOOKUP($B58,'Vysledky-doplneni'!$C$7:$L$126,7,0)","v":0},{"$f":"VLOOKUP($B58,'Vysledky-doplneni'!$C$7:$L$126,8,0)","v":0},{"$f":"VLOOKUP($B58,'Vysledky-doplneni'!$C$7:$L$126,9,0)","v":0},{"$f":"VLOOKUP($B58,'Vysledky-doplneni'!$C$7:$L$126,10,0)","v":0},null,0,{"$error":"#DIV/0!"},0]
[{"$f":"IF(Vstup!C55<>\"\",Vstup!B55,\"\")","v":""},{"$f":"IF(Vstup!C55<>\"\",Vstup!C55,\"\")","v":""},{"$f":"IF(Vstup!C55<>\"\",Vstup!D55,\"\")","v":""},{"$f":"VLOOKUP($B59,'Vysledky-doplneni'!$C$7:$L$126,3,0)","v":0},{"$f":"VLOOKUP($B59,'Vysledky-doplneni'!$C$7:$L$126,4,0)","v":0},{"$f":"VLOOKUP($B59,'Vysledky-doplneni'!$C$7:$L$126,5,0)","v":0},{"$f":"VLOOKUP($B59,'Vysledky-doplneni'!$C$7:$L$126,6,0)","v":0},{"$f":"VLOOKUP($B59,'Vysledky-doplneni'!$C$7:$L$126,7,0)","v":0},{"$f":"VLOOKUP($B59,'Vysledky-doplneni'!$C$7:$L$126,8,0)","v":0},{"$f":"VLOOKUP($B59,'Vysledky-doplneni'!$C$7:$L$126,9,0)","v":0},{"$f":"VLOOKUP($B59,'Vysledky-doplneni'!$C$7:$L$126,10,0)","v":0},null,0,{"$error":"#DIV/0!"},0]
[{"$f":"IF(Vstup!C56<>\"\",Vstup!B56,\"\")","v":""},{"$f":"IF(Vstup!C56<>\"\",Vstup!C56,\"\")","v":""},{"$f":"IF(Vstup!C56<>\"\",Vstup!D56,\"\")","v":""},{"$f":"VLOOKUP($B60,'Vysledky-doplneni'!$C$7:$L$126,3,0)","v":0},{"$f":"VLOOKUP($B60,'Vysledky-doplneni'!$C$7:$L$126,4,0)","v":0},{"$f":"VLOOKUP($B60,'Vysledky-doplneni'!$C$7:$L$126,5,0)","v":0},{"$f":"VLOOKUP($B60,'Vysledky-doplneni'!$C$7:$L$126,6,0)","v":0},{"$f":"VLOOKUP($B60,'Vysledky-doplneni'!$C$7:$L$126,7,0)","v":0},{"$f":"VLOOKUP($B60,'Vysledky-doplneni'!$C$7:$L$126,8,0)","v":0},{"$f":"VLOOKUP($B60,'Vysledky-doplneni'!$C$7:$L$126,9,0)","v":0},{"$f":"VLOOKUP($B60,'Vysledky-doplneni'!$C$7:$L$126,10,0)","v":0},null,0,{"$error":"#DIV/0!"},0]
[{"$f":"IF(Vstup!C57<>\"\",Vstup!B57,\"\")","v":""},{"$f":"IF(Vstup!C57<>\"\",Vstup!C57,\"\")","v":""},{"$f":"IF(Vstup!C57<>\"\",Vstup!D57,\"\")","v":""},{"$f":"VLOOKUP($B61,'Vysledky-doplneni'!$C$7:$L$126,3,0)","v":0},{"$f":"VLOOKUP($B61,'Vysledky-doplneni'!$C$7:$L$126,4,0)","v":0},{"$f":"VLOOKUP($B61,'Vysledky-doplneni'!$C$7:$L$126,5,0)","v":0},{"$f":"VLOOKUP($B61,'Vysledky-doplneni'!$C$7:$L$126,6,0)","v":0},{"$f":"VLOOKUP($B61,'Vysledky-doplneni'!$C$7:$L$126,7,0)","v":0},{"$f":"VLOOKUP($B61,'Vysledky-doplneni'!$C$7:$L$126,8,0)","v":0},{"$f":"VLOOKUP($B61,'Vysledky-doplneni'!$C$7:$L$126,9,0)","v":0},{"$f":"VLOOKUP($B61,'Vysledky-doplneni'!$C$7:$L$126,10,0)","v":0},null,0,{"$error":"#DIV/0!"},0]
[{"$f":"IF(Vstup!C58<>\"\",Vstup!B58,\"\")","v":""},{"$f":"IF(Vstup!C58<>\"\",Vstup!C58,\"\")","v":""},{"$f":"IF(Vstup!C58<>\"\",Vstup!D58,\"\")","v":""},{"$f":"VLOOKUP($B62,'Vysledky-doplneni'!$C$7:$L$126,3,0)","v":0},{"$f":"VLOOKUP($B62,'Vysledky-doplneni'!$C$7:$L$126,4,0)","v":0},{"$f":"VLOOKUP($B62,'Vysledky-doplneni'!$C$7:$L$126,5,0)","v":0},{"$f":"VLOOKUP($B62,'Vysledky-doplneni'!$C$7:$L$126,6,0)","v":0},{"$f":"VLOOKUP($B62,'Vysledky-doplneni'!$C$7:$L$126,7,0)","v":0},{"$f":"VLOOKUP($B62,'Vysledky-doplneni'!$C$7:$L$126,8,0)","v":0},{"$f":"VLOOKUP($B62,'Vysledky-doplneni'!$C$7:$L$126,9,0)","v":0},{"$f":"VLOOKUP($B62,'Vysledky-doplneni'!$C$7:$L$126,10,0)","v":0},null,0,{"$error":"#DIV/0!"},0]
[{"$f":"IF(Vstup!C59<>\"\",Vstup!B59,\"\")","v":""},{"$f":"IF(Vstup!C59<>\"\",Vstup!C59,\"\")","v":""},{"$f":"IF(Vstup!C59<>\"\",Vstup!D59,\"\")","v":""},{"$f":"VLOOKUP($B63,'Vysledky-doplneni'!$C$7:$L$126,3,0)","v":0},{"$f":"VLOOKUP($B63,'Vysledky-doplneni'!$C$7:$L$126,4,0)","v":0},{"$f":"VLOOKUP($B63,'Vysledky-doplneni'!$C$7:$L$126,5,0)","v":0},{"$f":"VLOOKUP($B63,'Vysledky-doplneni'!$C$7:$L$126,6,0)","v":0},{"$f":"VLOOKUP($B63,'Vysledky-doplneni'!$C$7:$L$126,7,0)","v":0},{"$f":"VLOOKUP($B63,'Vysledky-doplneni'!$C$7:$L$126,8,0)","v":0},{"$f":"VLOOKUP($B63,'Vysledky-doplneni'!$C$7:$L$126,9,0)","v":0},{"$f":"VLOOKUP($B63,'Vysledky-doplneni'!$C$7:$L$126,10,0)","v":0},null,0,{"$error":"#DIV/0!"},0]
[{"$f":"IF(Vstup!C60<>\"\",Vstup!B60,\"\")","v":""},{"$f":"IF(Vstup!C60<>\"\",Vstup!C60,\"\")","v":""},{"$f":"IF(Vstup!C60<>\"\",Vstup!D60,\"\")","v":""},{"$f":"VLOOKUP($B64,'Vysledky-doplneni'!$C$7:$L$126,3,0)","v":0},{"$f":"VLOOKUP($B64,'Vysledky-doplneni'!$C$7:$L$126,4,0)","v":0},{"$f":"VLOOKUP($B64,'Vysledky-doplneni'!$C$7:$L$126,5,0)","v":0},{"$f":"VLOOKUP($B64,'Vysledky-doplneni'!$C$7:$L$126,6,0)","v":0},{"$f":"VLOOKUP($B64,'Vysledky-doplneni'!$C$7:$L$126,7,0)","v":0},{"$f":"VLOOKUP($B64,'Vysledky-doplneni'!$C$7:$L$126,8,0)","v":0},{"$f":"VLOOKUP($B64,'Vysledky-doplneni'!$C$7:$L$126,9,0)","v":0},{"$f":"VLOOKUP($B64,'Vysledky-doplneni'!$C$7:$L$126,10,0)","v":0},null,0,{"$error":"#DIV/0!"},0]
[{"$f":"IF(Vstup!C61<>\"\",Vstup!B61,\"\")","v":""},{"$f":"IF(Vstup!C61<>\"\",Vstup!C61,\"\")","v":""},{"$f":"IF(Vstup!C61<>\"\",Vstup!D61,\"\")","v":""},{"$f":"VLOOKUP($B65,'Vysledky-doplneni'!$C$7:$L$126,3,0)","v":0},{"$f":"VLOOKUP($B65,'Vysledky-doplneni'!$C$7:$L$126,4,0)","v":0},{"$f":"VLOOKUP($B65,'Vysledky-doplneni'!$C$7:$L$126,5,0)","v":0},{"$f":"VLOOKUP($B65,'Vysledky-doplneni'!$C$7:$L$126,6,0)","v":0},{"$f":"VLOOKUP($B65,'Vysledky-doplneni'!$C$7:$L$126,7,0)","v":0},{"$f":"VLOOKUP($B65,'Vysledky-doplneni'!$C$7:$L$126,8,0)","v":0},{"$f":"VLOOKUP($B65,'Vysledky-doplneni'!$C$7:$L$126,9,0)","v":0},{"$f":"VLOOKUP($B65,'Vysledky-doplneni'!$C$7:$L$126,10,0)","v":0},null,0,{"$error":"#DIV/0!"},0]
[{"$f":"IF(Vstup!C62<>\"\",Vstup!B62,\"\")","v":""},{"$f":"IF(Vstup!C62<>\"\",Vstup!C62,\"\")","v":""},{"$f":"IF(Vstup!C62<>\"\",Vstup!D62,\"\")","v":""},{"$f":"VLOOKUP($B66,'Vysledky-doplneni'!$C$7:$L$126,3,0)","v":0},{"$f":"VLOOKUP($B66,'Vysledky-doplneni'!$C$7:$L$126,4,0)","v":0},{"$f":"VLOOKUP($B66,'Vysledky-doplneni'!$C$7:$L$126,5,0)","v":0},{"$f":"VLOOKUP($B66,'Vysledky-doplneni'!$C$7:$L$126,6,0)","v":0},{"$f":"VLOOKUP($B66,'Vysledky-doplneni'!$C$7:$L$126,7,0)","v":0},{"$f":"VLOOKUP($B66,'Vysledky-doplneni'!$C$7:$L$126,8,0)","v":0},{"$f":"VLOOKUP($B66,'Vysledky-doplneni'!$C$7:$L$126,9,0)","v":0},{"$f":"VLOOKUP($B66,'Vysledky-doplneni'!$C$7:$L$126,10,0)","v":0},null,0,{"$error":"#DIV/0!"},0]
[{"$f":"IF(Vstup!C63<>\"\",Vstup!B63,\"\")","v":""},{"$f":"IF(Vstup!C63<>\"\",Vstup!C63,\"\")","v":""},{"$f":"IF(Vstup!C63<>\"\",Vstup!D63,\"\")","v":""},{"$f":"VLOOKUP($B67,'Vysledky-doplneni'!$C$7:$L$126,3,0)","v":0},{"$f":"VLOOKUP($B67,'Vysledky-doplneni'!$C$7:$L$126,4,0)","v":0},{"$f":"VLOOKUP($B67,'Vysledky-doplneni'!$C$7:$L$126,5,0)","v":0},{"$f":"VLOOKUP($B67,'Vysledky-doplneni'!$C$7:$L$126,6,0)","v":0},{"$f":"VLOOKUP($B67,'Vysledky-doplneni'!$C$7:$L$126,7,0)","v":0},{"$f":"VLOOKUP($B67,'Vysledky-doplneni'!$C$7:$L$126,8,0)","v":0},{"$f":"VLOOKUP($B67,'Vysledky-doplneni'!$C$7:$L$126,9,0)","v":0},{"$f":"VLOOKUP($B67,'Vysledky-doplneni'!$C$7:$L$126,10,0)","v":0},null,0,{"$error":"#DIV/0!"},0]
[{"$f":"IF(Vstup!C64<>\"\",Vstup!B64,\"\")","v":""},{"$f":"IF(Vstup!C64<>\"\",Vstup!C64,\"\")","v":""},{"$f":"IF(Vstup!C64<>\"\",Vstup!D64,\"\")","v":""},{"$f":"VLOOKUP($B68,'Vysledky-doplneni'!$C$7:$L$126,3,0)","v":0},{"$f":"VLOOKUP($B68,'Vysledky-doplneni'!$C$7:$L$126,4,0)","v":0},{"$f":"VLOOKUP($B68,'Vysledky-doplneni'!$C$7:$L$126,5,0)","v":0},{"$f":"VLOOKUP($B68,'Vysledky-doplneni'!$C$7:$L$126,6,0)","v":0},{"$f":"VLOOKUP($B68,'Vysledky-doplneni'!$C$7:$L$126,7,0)","v":0},{"$f":"VLOOKUP($B68,'Vysledky-doplneni'!$C$7:$L$126,8,0)","v":0},{"$f":"VLOOKUP($B68,'Vysledky-doplneni'!$C$7:$L$126,9,0)","v":0},{"$f":"VLOOKUP($B68,'Vysledky-doplneni'!$C$7:$L$126,10,0)","v":0},null,0,{"$error":"#DIV/0!"},0]
[{"$f":"IF(Vstup!C65<>\"\",Vstup!B65,\"\")","v":""},{"$f":"IF(Vstup!C65<>\"\",Vstup!C65,\"\")","v":""},{"$f":"IF(Vstup!C65<>\"\",Vstup!D65,\"\")","v":""},{"$f":"VLOOKUP($B69,'Vysledky-doplneni'!$C$7:$L$126,3,0)","v":0},{"$f":"VLOOKUP($B69,'Vysledky-doplneni'!$C$7:$L$126,4,0)","v":0},{"$f":"VLOOKUP($B69,'Vysledky-doplneni'!$C$7:$L$126,5,0)","v":0},{"$f":"VLOOKUP($B69,'Vysledky-doplneni'!$C$7:$L$126,6,0)","v":0},{"$f":"VLOOKUP($B69,'Vysledky-doplneni'!$C$7:$L$126,7,0)","v":0},{"$f":"VLOOKUP($B69,'Vysledky-doplneni'!$C$7:$L$126,8,0)","v":0},{"$f":"VLOOKUP($B69,'Vysledky-doplneni'!$C$7:$L$126,9,0)","v":0},{"$f":"VLOOKUP($B69,'Vysledky-doplneni'!$C$7:$L$126,10,0)","v":0},null,0,{"$error":"#DIV/0!"},0]
[{"$f":"IF(Vstup!C66<>\"\",Vstup!B66,\"\")","v":""},{"$f":"IF(Vstup!C66<>\"\",Vstup!C66,\"\")","v":""},{"$f":"IF(Vstup!C66<>\"\",Vstup!D66,\"\")","v":""},{"$f":"VLOOKUP($B70,'Vysledky-doplneni'!$C$7:$L$126,3,0)","v":0},{"$f":"VLOOKUP($B70,'Vysledky-doplneni'!$C$7:$L$126,4,0)","v":0},{"$f":"VLOOKUP($B70,'Vysledky-doplneni'!$C$7:$L$126,5,0)","v":0},{"$f":"VLOOKUP($B70,'Vysledky-doplneni'!$C$7:$L$126,6,0)","v":0},{"$f":"VLOOKUP($B70,'Vysledky-doplneni'!$C$7:$L$126,7,0)","v":0},{"$f":"VLOOKUP($B70,'Vysledky-doplneni'!$C$7:$L$126,8,0)","v":0},{"$f":"VLOOKUP($B70,'Vysledky-doplneni'!$C$7:$L$126,9,0)","v":0},{"$f":"VLOOKUP($B70,'Vysledky-doplneni'!$C$7:$L$126,10,0)","v":0},null,0,{"$error":"#DIV/0!"},0]
[{"$f":"IF(Vstup!C67<>\"\",Vstup!B67,\"\")","v":""},{"$f":"IF(Vstup!C67<>\"\",Vstup!C67,\"\")","v":""},{"$f":"IF(Vstup!C67<>\"\",Vstup!D67,\"\")","v":""},{"$f":"VLOOKUP($B71,'Vysledky-doplneni'!$C$7:$L$126,3,0)","v":0},{"$f":"VLOOKUP($B71,'Vysledky-doplneni'!$C$7:$L$126,4,0)","v":0},{"$f":"VLOOKUP($B71,'Vysledky-doplneni'!$C$7:$L$126,5,0)","v":0},{"$f":"VLOOKUP($B71,'Vysledky-doplneni'!$C$7:$L$126,6,0)","v":0},{"$f":"VLOOKUP($B71,'Vysledky-doplneni'!$C$7:$L$126,7,0)","v":0},{"$f":"VLOOKUP($B71,'Vysledky-doplneni'!$C$7:$L$126,8,0)","v":0},{"$f":"VLOOKUP($B71,'Vysledky-doplneni'!$C$7:$L$126,9,0)","v":0},{"$f":"VLOOKUP($B71,'Vysledky-doplneni'!$C$7:$L$126,10,0)","v":0},null,0,{"$error":"#DIV/0!"},0]
[{"$f":"IF(Vstup!C68<>\"\",Vstup!B68,\"\")","v":""},{"$f":"IF(Vstup!C68<>\"\",Vstup!C68,\"\")","v":""},{"$f":"IF(Vstup!C68<>\"\",Vstup!D68,\"\")","v":""},{"$f":"VLOOKUP($B72,'Vysledky-doplneni'!$C$7:$L$126,3,0)","v":0},{"$f":"VLOOKUP($B72,'Vysledky-doplneni'!$C$7:$L$126,4,0)","v":0},{"$f":"VLOOKUP($B72,'Vysledky-doplneni'!$C$7:$L$126,5,0)","v":0},{"$f":"VLOOKUP($B72,'Vysledky-doplneni'!$C$7:$L$126,6,0)","v":0},{"$f":"VLOOKUP($B72,'Vysledky-doplneni'!$C$7:$L$126,7,0)","v":0},{"$f":"VLOOKUP($B72,'Vysledky-doplneni'!$C$7:$L$126,8,0)","v":0},{"$f":"VLOOKUP($B72,'Vysledky-doplneni'!$C$7:$L$126,9,0)","v":0},{"$f":"VLOOKUP($B72,'Vysledky-doplneni'!$C$7:$L$126,10,0)","v":0},null,0,{"$error":"#DIV/0!"},0]
[{"$f":"IF(Vstup!C69<>\"\",Vstup!B69,\"\")","v":""},{"$f":"IF(Vstup!C69<>\"\",Vstup!C69,\"\")","v":""},{"$f":"IF(Vstup!C69<>\"\",Vstup!D69,\"\")","v":""},{"$f":"VLOOKUP($B73,'Vysledky-doplneni'!$C$7:$L$126,3,0)","v":0},{"$f":"VLOOKUP($B73,'Vysledky-doplneni'!$C$7:$L$126,4,0)","v":0},{"$f":"VLOOKUP($B73,'Vysledky-doplneni'!$C$7:$L$126,5,0)","v":0},{"$f":"VLOOKUP($B73,'Vysledky-doplneni'!$C$7:$L$126,6,0)","v":0},{"$f":"VLOOKUP($B73,'Vysledky-doplneni'!$C$7:$L$126,7,0)","v":0},{"$f":"VLOOKUP($B73,'Vysledky-doplneni'!$C$7:$L$126,8,0)","v":0},{"$f":"VLOOKUP($B73,'Vysledky-doplneni'!$C$7:$L$126,9,0)","v":0},{"$f":"VLOOKUP($B73,'Vysledky-doplneni'!$C$7:$L$126,10,0)","v":0},null,0,{"$error":"#DIV/0!"},0]
[{"$f":"IF(Vstup!C70<>\"\",Vstup!B70,\"\")","v":""},{"$f":"IF(Vstup!C70<>\"\",Vstup!C70,\"\")","v":""},{"$f":"IF(Vstup!C70<>\"\",Vstup!D70,\"\")","v":""},{"$f":"VLOOKUP($B74,'Vysledky-doplneni'!$C$7:$L$126,3,0)","v":0},{"$f":"VLOOKUP($B74,'Vysledky-doplneni'!$C$7:$L$126,4,0)","v":0},{"$f":"VLOOKUP($B74,'Vysledky-doplneni'!$C$7:$L$126,5,0)","v":0},{"$f":"VLOOKUP($B74,'Vysledky-doplneni'!$C$7:$L$126,6,0)","v":0},{"$f":"VLOOKUP($B74,'Vysledky-doplneni'!$C$7:$L$126,7,0)","v":0},{"$f":"VLOOKUP($B74,'Vysledky-doplneni'!$C$7:$L$126,8,0)","v":0},{"$f":"VLOOKUP($B74,'Vysledky-doplneni'!$C$7:$L$126,9,0)","v":0},{"$f":"VLOOKUP($B74,'Vysledky-doplneni'!$C$7:$L$126,10,0)","v":0},null,0,{"$error":"#DIV/0!"},0]
[{"$f":"IF(Vstup!C71<>\"\",Vstup!B71,\"\")","v":""},{"$f":"IF(Vstup!C71<>\"\",Vstup!C71,\"\")","v":""},{"$f":"IF(Vstup!C71<>\"\",Vstup!D71,\"\")","v":""},{"$f":"VLOOKUP($B75,'Vysledky-doplneni'!$C$7:$L$126,3,0)","v":0},{"$f":"VLOOKUP($B75,'Vysledky-doplneni'!$C$7:$L$126,4,0)","v":0},{"$f":"VLOOKUP($B75,'Vysledky-doplneni'!$C$7:$L$126,5,0)","v":0},{"$f":"VLOOKUP($B75,'Vysledky-doplneni'!$C$7:$L$126,6,0)","v":0},{"$f":"VLOOKUP($B75,'Vysledky-doplneni'!$C$7:$L$126,7,0)","v":0},{"$f":"VLOOKUP($B75,'Vysledky-doplneni'!$C$7:$L$126,8,0)","v":0},{"$f":"VLOOKUP($B75,'Vysledky-doplneni'!$C$7:$L$126,9,0)","v":0},{"$f":"VLOOKUP($B75,'Vysledky-doplneni'!$C$7:$L$126,10,0)","v":0},null,0,{"$error":"#DIV/0!"},0]
[{"$f":"IF(Vstup!C72<>\"\",Vstup!B72,\"\")","v":""},{"$f":"IF(Vstup!C72<>\"\",Vstup!C72,\"\")","v":""},{"$f":"IF(Vstup!C72<>\"\",Vstup!D72,\"\")","v":""},{"$f":"VLOOKUP($B76,'Vysledky-doplneni'!$C$7:$L$126,3,0)","v":0},{"$f":"VLOOKUP($B76,'Vysledky-doplneni'!$C$7:$L$126,4,0)","v":0},{"$f":"VLOOKUP($B76,'Vysledky-doplneni'!$C$7:$L$126,5,0)","v":0},{"$f":"VLOOKUP($B76,'Vysledky-doplneni'!$C$7:$L$126,6,0)","v":0},{"$f":"VLOOKUP($B76,'Vysledky-doplneni'!$C$7:$L$126,7,0)","v":0},{"$f":"VLOOKUP($B76,'Vysledky-doplneni'!$C$7:$L$126,8,0)","v":0},{"$f":"VLOOKUP($B76,'Vysledky-doplneni'!$C$7:$L$126,9,0)","v":0},{"$f":"VLOOKUP($B76,'Vysledky-doplneni'!$C$7:$L$126,10,0)","v":0},null,0,{"$error":"#DIV/0!"},0]
[{"$f":"IF(Vstup!C73<>\"\",Vstup!B73,\"\")","v":""},{"$f":"IF(Vstup!C73<>\"\",Vstup!C73,\"\")","v":""},{"$f":"IF(Vstup!C73<>\"\",Vstup!D73,\"\")","v":""},{"$f":"VLOOKUP($B77,'Vysledky-doplneni'!$C$7:$L$126,3,0)","v":0},{"$f":"VLOOKUP($B77,'Vysledky-doplneni'!$C$7:$L$126,4,0)","v":0},{"$f":"VLOOKUP($B77,'Vysledky-doplneni'!$C$7:$L$126,5,0)","v":0},{"$f":"VLOOKUP($B77,'Vysledky-doplneni'!$C$7:$L$126,6,0)","v":0},{"$f":"VLOOKUP($B77,'Vysledky-doplneni'!$C$7:$L$126,7,0)","v":0},{"$f":"VLOOKUP($B77,'Vysledky-doplneni'!$C$7:$L$126,8,0)","v":0},{"$f":"VLOOKUP($B77,'Vysledky-doplneni'!$C$7:$L$126,9,0)","v":0},{"$f":"VLOOKUP($B77,'Vysledky-doplneni'!$C$7:$L$126,10,0)","v":0},null,0,{"$error":"#DIV/0!"},0]
[{"$f":"IF(Vstup!C74<>\"\",Vstup!B74,\"\")","v":""},{"$f":"IF(Vstup!C74<>\"\",Vstup!C74,\"\")","v":""},{"$f":"IF(Vstup!C74<>\"\",Vstup!D74,\"\")","v":""},{"$f":"VLOOKUP($B78,'Vysledky-doplneni'!$C$7:$L$126,3,0)","v":0},{"$f":"VLOOKUP($B78,'Vysledky-doplneni'!$C$7:$L$126,4,0)","v":0},{"$f":"VLOOKUP($B78,'Vysledky-doplneni'!$C$7:$L$126,5,0)","v":0},{"$f":"VLOOKUP($B78,'Vysledky-doplneni'!$C$7:$L$126,6,0)","v":0},{"$f":"VLOOKUP($B78,'Vysledky-doplneni'!$C$7:$L$126,7,0)","v":0},{"$f":"VLOOKUP($B78,'Vysledky-doplneni'!$C$7:$L$126,8,0)","v":0},{"$f":"VLOOKUP($B78,'Vysledky-doplneni'!$C$7:$L$126,9,0)","v":0},{"$f":"VLOOKUP($B78,'Vysledky-doplneni'!$C$7:$L$126,10,0)","v":0},null,{"$f":"SUM(D78:H78)","v":0},{"$f":"(M78/(20*O78))","v":{"$error":"#DIV/0!"}},{"$f":"COUNTIF(D78:K78,\">0\")","v":0}]
[{"$f":"IF(Vstup!C75<>\"\",Vstup!B75,\"\")","v":""},{"$f":"IF(Vstup!C75<>\"\",Vstup!C75,\"\")","v":""},{"$f":"IF(Vstup!C75<>\"\",Vstup!D75,\"\")","v":""},{"$f":"VLOOKUP($B79,'Vysledky-doplneni'!$C$7:$L$126,3,0)","v":0},{"$f":"VLOOKUP($B79,'Vysledky-doplneni'!$C$7:$L$126,4,0)","v":0},{"$f":"VLOOKUP($B79,'Vysledky-doplneni'!$C$7:$L$126,5,0)","v":0},{"$f":"VLOOKUP($B79,'Vysledky-doplneni'!$C$7:$L$126,6,0)","v":0},{"$f":"VLOOKUP($B79,'Vysledky-doplneni'!$C$7:$L$126,7,0)","v":0},{"$f":"VLOOKUP($B79,'Vysledky-doplneni'!$C$7:$L$126,8,0)","v":0},{"$f":"VLOOKUP($B79,'Vysledky-doplneni'!$C$7:$L$126,9,0)","v":0},{"$f":"VLOOKUP($B79,'Vysledky-doplneni'!$C$7:$L$126,10,0)","v":0},null,0,{"$error":"#DIV/0!"},0]
[{"$f":"IF(Vstup!C76<>\"\",Vstup!B76,\"\")","v":""},{"$f":"IF(Vstup!C76<>\"\",Vstup!C76,\"\")","v":""},{"$f":"IF(Vstup!C76<>\"\",Vstup!D76,\"\")","v":""},{"$f":"VLOOKUP($B80,'Vysledky-doplneni'!$C$7:$L$126,3,0)","v":0},{"$f":"VLOOKUP($B80,'Vysledky-doplneni'!$C$7:$L$126,4,0)","v":0},{"$f":"VLOOKUP($B80,'Vysledky-doplneni'!$C$7:$L$126,5,0)","v":0},{"$f":"VLOOKUP($B80,'Vysledky-doplneni'!$C$7:$L$126,6,0)","v":0},{"$f":"VLOOKUP($B80,'Vysledky-doplneni'!$C$7:$L$126,7,0)","v":0},{"$f":"VLOOKUP($B80,'Vysledky-doplneni'!$C$7:$L$126,8,0)","v":0},{"$f":"VLOOKUP($B80,'Vysledky-doplneni'!$C$7:$L$126,9,0)","v":0},{"$f":"VLOOKUP($B80,'Vysledky-doplneni'!$C$7:$L$126,10,0)","v":0},null,0,{"$error":"#DIV/0!"},0]
[{"$f":"IF(Vstup!C77<>\"\",Vstup!B77,\"\")","v":""},{"$f":"IF(Vstup!C77<>\"\",Vstup!C77,\"\")","v":""},{"$f":"IF(Vstup!C77<>\"\",Vstup!D77,\"\")","v":""},{"$f":"VLOOKUP($B81,'Vysledky-doplneni'!$C$7:$L$126,3,0)","v":0},{"$f":"VLOOKUP($B81,'Vysledky-doplneni'!$C$7:$L$126,4,0)","v":0},{"$f":"VLOOKUP($B81,'Vysledky-doplneni'!$C$7:$L$126,5,0)","v":0},{"$f":"VLOOKUP($B81,'Vysledky-doplneni'!$C$7:$L$126,6,0)","v":0},{"$f":"VLOOKUP($B81,'Vysledky-doplneni'!$C$7:$L$126,7,0)","v":0},{"$f":"VLOOKUP($B81,'Vysledky-doplneni'!$C$7:$L$126,8,0)","v":0},{"$f":"VLOOKUP($B81,'Vysledky-doplneni'!$C$7:$L$126,9,0)","v":0},{"$f":"VLOOKUP($B81,'Vysledky-doplneni'!$C$7:$L$126,10,0)","v":0},null,0,{"$error":"#DIV/0!"},0]
[{"$f":"IF(Vstup!C78<>\"\",Vstup!B78,\"\")","v":""},{"$f":"IF(Vstup!C78<>\"\",Vstup!C78,\"\")","v":""},{"$f":"IF(Vstup!C78<>\"\",Vstup!D78,\"\")","v":""},{"$f":"VLOOKUP($B82,'Vysledky-doplneni'!$C$7:$L$126,3,0)","v":0},{"$f":"VLOOKUP($B82,'Vysledky-doplneni'!$C$7:$L$126,4,0)","v":0},{"$f":"VLOOKUP($B82,'Vysledky-doplneni'!$C$7:$L$126,5,0)","v":0},{"$f":"VLOOKUP($B82,'Vysledky-doplneni'!$C$7:$L$126,6,0)","v":0},{"$f":"VLOOKUP($B82,'Vysledky-doplneni'!$C$7:$L$126,7,0)","v":0},{"$f":"VLOOKUP($B82,'Vysledky-doplneni'!$C$7:$L$126,8,0)","v":0},{"$f":"VLOOKUP($B82,'Vysledky-doplneni'!$C$7:$L$126,9,0)","v":0},{"$f":"VLOOKUP($B82,'Vysledky-doplneni'!$C$7:$L$126,10,0)","v":0},null,0,{"$error":"#DIV/0!"},0]
[{"$f":"IF(Vstup!C79<>\"\",Vstup!B79,\"\")","v":""},{"$f":"IF(Vstup!C79<>\"\",Vstup!C79,\"\")","v":""},{"$f":"IF(Vstup!C79<>\"\",Vstup!D79,\"\")","v":""},{"$f":"VLOOKUP($B83,'Vysledky-doplneni'!$C$7:$L$126,3,0)","v":0},{"$f":"VLOOKUP($B83,'Vysledky-doplneni'!$C$7:$L$126,4,0)","v":0},{"$f":"VLOOKUP($B83,'Vysledky-doplneni'!$C$7:$L$126,5,0)","v":0},{"$f":"VLOOKUP($B83,'Vysledky-doplneni'!$C$7:$L$126,6,0)","v":0},{"$f":"VLOOKUP($B83,'Vysledky-doplneni'!$C$7:$L$126,7,0)","v":0},{"$f":"VLOOKUP($B83,'Vysledky-doplneni'!$C$7:$L$126,8,0)","v":0},{"$f":"VLOOKUP($B83,'Vysledky-doplneni'!$C$7:$L$126,9,0)","v":0},{"$f":"VLOOKUP($B83,'Vysledky-doplneni'!$C$7:$L$126,10,0)","v":0},null,0,{"$error":"#DIV/0!"},0]
[{"$f":"IF(Vstup!C80<>\"\",Vstup!B80,\"\")","v":""},{"$f":"IF(Vstup!C80<>\"\",Vstup!C80,\"\")","v":""},{"$f":"IF(Vstup!C80<>\"\",Vstup!D80,\"\")","v":""},{"$f":"VLOOKUP($B84,'Vysledky-doplneni'!$C$7:$L$126,3,0)","v":0},{"$f":"VLOOKUP($B84,'Vysledky-doplneni'!$C$7:$L$126,4,0)","v":0},{"$f":"VLOOKUP($B84,'Vysledky-doplneni'!$C$7:$L$126,5,0)","v":0},{"$f":"VLOOKUP($B84,'Vysledky-doplneni'!$C$7:$L$126,6,0)","v":0},{"$f":"VLOOKUP($B84,'Vysledky-doplneni'!$C$7:$L$126,7,0)","v":0},{"$f":"VLOOKUP($B84,'Vysledky-doplneni'!$C$7:$L$126,8,0)","v":0},{"$f":"VLOOKUP($B84,'Vysledky-doplneni'!$C$7:$L$126,9,0)","v":0},{"$f":"VLOOKUP($B84,'Vysledky-doplneni'!$C$7:$L$126,10,0)","v":0},null,0,{"$error":"#DIV/0!"},0]
[{"$f":"IF(Vstup!C81<>\"\",Vstup!B81,\"\")","v":""},{"$f":"IF(Vstup!C81<>\"\",Vstup!C81,\"\")","v":""},{"$f":"IF(Vstup!C81<>\"\",Vstup!D81,\"\")","v":""},{"$f":"VLOOKUP($B85,'Vysledky-doplneni'!$C$7:$L$126,3,0)","v":0},{"$f":"VLOOKUP($B85,'Vysledky-doplneni'!$C$7:$L$126,4,0)","v":0},{"$f":"VLOOKUP($B85,'Vysledky-doplneni'!$C$7:$L$126,5,0)","v":0},{"$f":"VLOOKUP($B85,'Vysledky-doplneni'!$C$7:$L$126,6,0)","v":0},{"$f":"VLOOKUP($B85,'Vysledky-doplneni'!$C$7:$L$126,7,0)","v":0},{"$f":"VLOOKUP($B85,'Vysledky-doplneni'!$C$7:$L$126,8,0)","v":0},{"$f":"VLOOKUP($B85,'Vysledky-doplneni'!$C$7:$L$126,9,0)","v":0},{"$f":"VLOOKUP($B85,'Vysledky-doplneni'!$C$7:$L$126,10,0)","v":0},null,0,{"$error":"#DIV/0!"},0]
[{"$f":"IF(Vstup!C82<>\"\",Vstup!B82,\"\")","v":""},{"$f":"IF(Vstup!C82<>\"\",Vstup!C82,\"\")","v":""},{"$f":"IF(Vstup!C82<>\"\",Vstup!D82,\"\")","v":""},{"$f":"VLOOKUP($B86,'Vysledky-doplneni'!$C$7:$L$126,3,0)","v":0},{"$f":"VLOOKUP($B86,'Vysledky-doplneni'!$C$7:$L$126,4,0)","v":0},{"$f":"VLOOKUP($B86,'Vysledky-doplneni'!$C$7:$L$126,5,0)","v":0},{"$f":"VLOOKUP($B86,'Vysledky-doplneni'!$C$7:$L$126,6,0)","v":0},{"$f":"VLOOKUP($B86,'Vysledky-doplneni'!$C$7:$L$126,7,0)","v":0},{"$f":"VLOOKUP($B86,'Vysledky-doplneni'!$C$7:$L$126,8,0)","v":0},{"$f":"VLOOKUP($B86,'Vysledky-doplneni'!$C$7:$L$126,9,0)","v":0},{"$f":"VLOOKUP($B86,'Vysledky-doplneni'!$C$7:$L$126,10,0)","v":0},null,0,{"$error":"#DIV/0!"},0]
[{"$f":"IF(Vstup!C83<>\"\",Vstup!B83,\"\")","v":""},{"$f":"IF(Vstup!C83<>\"\",Vstup!C83,\"\")","v":""},{"$f":"IF(Vstup!C83<>\"\",Vstup!D83,\"\")","v":""},{"$f":"VLOOKUP($B87,'Vysledky-doplneni'!$C$7:$L$126,3,0)","v":0},{"$f":"VLOOKUP($B87,'Vysledky-doplneni'!$C$7:$L$126,4,0)","v":0},{"$f":"VLOOKUP($B87,'Vysledky-doplneni'!$C$7:$L$126,5,0)","v":0},{"$f":"VLOOKUP($B87,'Vysledky-doplneni'!$C$7:$L$126,6,0)","v":0},{"$f":"VLOOKUP($B87,'Vysledky-doplneni'!$C$7:$L$126,7,0)","v":0},{"$f":"VLOOKUP($B87,'Vysledky-doplneni'!$C$7:$L$126,8,0)","v":0},{"$f":"VLOOKUP($B87,'Vysledky-doplneni'!$C$7:$L$126,9,0)","v":0},{"$f":"VLOOKUP($B87,'Vysledky-doplneni'!$C$7:$L$126,10,0)","v":0},null,0,{"$error":"#DIV/0!"},0]
[{"$f":"IF(Vstup!C84<>\"\",Vstup!B84,\"\")","v":""},{"$f":"IF(Vstup!C84<>\"\",Vstup!C84,\"\")","v":""},{"$f":"IF(Vstup!C84<>\"\",Vstup!D84,\"\")","v":""},{"$f":"VLOOKUP($B88,'Vysledky-doplneni'!$C$7:$L$126,3,0)","v":0},{"$f":"VLOOKUP($B88,'Vysledky-doplneni'!$C$7:$L$126,4,0)","v":0},{"$f":"VLOOKUP($B88,'Vysledky-doplneni'!$C$7:$L$126,5,0)","v":0},{"$f":"VLOOKUP($B88,'Vysledky-doplneni'!$C$7:$L$126,6,0)","v":0},{"$f":"VLOOKUP($B88,'Vysledky-doplneni'!$C$7:$L$126,7,0)","v":0},{"$f":"VLOOKUP($B88,'Vysledky-doplneni'!$C$7:$L$126,8,0)","v":0},{"$f":"VLOOKUP($B88,'Vysledky-doplneni'!$C$7:$L$126,9,0)","v":0},{"$f":"VLOOKUP($B88,'Vysledky-doplneni'!$C$7:$L$126,10,0)","v":0},null,0,{"$error":"#DIV/0!"},0]
[{"$f":"IF(Vstup!C85<>\"\",Vstup!B85,\"\")","v":""},{"$f":"IF(Vstup!C85<>\"\",Vstup!C85,\"\")","v":""},{"$f":"IF(Vstup!C85<>\"\",Vstup!D85,\"\")","v":""},{"$f":"VLOOKUP($B89,'Vysledky-doplneni'!$C$7:$L$126,3,0)","v":0},{"$f":"VLOOKUP($B89,'Vysledky-doplneni'!$C$7:$L$126,4,0)","v":0},{"$f":"VLOOKUP($B89,'Vysledky-doplneni'!$C$7:$L$126,5,0)","v":0},{"$f":"VLOOKUP($B89,'Vysledky-doplneni'!$C$7:$L$126,6,0)","v":0},{"$f":"VLOOKUP($B89,'Vysledky-doplneni'!$C$7:$L$126,7,0)","v":0},{"$f":"VLOOKUP($B89,'Vysledky-doplneni'!$C$7:$L$126,8,0)","v":0},{"$f":"VLOOKUP($B89,'Vysledky-doplneni'!$C$7:$L$126,9,0)","v":0},{"$f":"VLOOKUP($B89,'Vysledky-doplneni'!$C$7:$L$126,10,0)","v":0},null,0,{"$error":"#DIV/0!"},0]
[{"$f":"IF(Vstup!C86<>\"\",Vstup!B86,\"\")","v":""},{"$f":"IF(Vstup!C86<>\"\",Vstup!C86,\"\")","v":""},{"$f":"IF(Vstup!C86<>\"\",Vstup!D86,\"\")","v":""},{"$f":"VLOOKUP($B90,'Vysledky-doplneni'!$C$7:$L$126,3,0)","v":0},{"$f":"VLOOKUP($B90,'Vysledky-doplneni'!$C$7:$L$126,4,0)","v":0},{"$f":"VLOOKUP($B90,'Vysledky-doplneni'!$C$7:$L$126,5,0)","v":0},{"$f":"VLOOKUP($B90,'Vysledky-doplneni'!$C$7:$L$126,6,0)","v":0},{"$f":"VLOOKUP($B90,'Vysledky-doplneni'!$C$7:$L$126,7,0)","v":0},{"$f":"VLOOKUP($B90,'Vysledky-doplneni'!$C$7:$L$126,8,0)","v":0},{"$f":"VLOOKUP($B90,'Vysledky-doplneni'!$C$7:$L$126,9,0)","v":0},{"$f":"VLOOKUP($B90,'Vysledky-doplneni'!$C$7:$L$126,10,0)","v":0},null,0,{"$error":"#DIV/0!"},0]
[{"$f":"IF(Vstup!C87<>\"\",Vstup!B87,\"\")","v":""},{"$f":"IF(Vstup!C87<>\"\",Vstup!C87,\"\")","v":""},{"$f":"IF(Vstup!C87<>\"\",Vstup!D87,\"\")","v":""},{"$f":"VLOOKUP($B91,'Vysledky-doplneni'!$C$7:$L$126,3,0)","v":0},{"$f":"VLOOKUP($B91,'Vysledky-doplneni'!$C$7:$L$126,4,0)","v":0},{"$f":"VLOOKUP($B91,'Vysledky-doplneni'!$C$7:$L$126,5,0)","v":0},{"$f":"VLOOKUP($B91,'Vysledky-doplneni'!$C$7:$L$126,6,0)","v":0},{"$f":"VLOOKUP($B91,'Vysledky-doplneni'!$C$7:$L$126,7,0)","v":0},{"$f":"VLOOKUP($B91,'Vysledky-doplneni'!$C$7:$L$126,8,0)","v":0},{"$f":"VLOOKUP($B91,'Vysledky-doplneni'!$C$7:$L$126,9,0)","v":0},{"$f":"VLOOKUP($B91,'Vysledky-doplneni'!$C$7:$L$126,10,0)","v":0},null,0,{"$error":"#DIV/0!"},0]
[{"$f":"IF(Vstup!C88<>\"\",Vstup!B88,\"\")","v":""},{"$f":"IF(Vstup!C88<>\"\",Vstup!C88,\"\")","v":""},{"$f":"IF(Vstup!C88<>\"\",Vstup!D88,\"\")","v":""},{"$f":"VLOOKUP($B92,'Vysledky-doplneni'!$C$7:$L$126,3,0)","v":0},{"$f":"VLOOKUP($B92,'Vysledky-doplneni'!$C$7:$L$126,4,0)","v":0},{"$f":"VLOOKUP($B92,'Vysledky-doplneni'!$C$7:$L$126,5,0)","v":0},{"$f":"VLOOKUP($B92,'Vysledky-doplneni'!$C$7:$L$126,6,0)","v":0},{"$f":"VLOOKUP($B92,'Vysledky-doplneni'!$C$7:$L$126,7,0)","v":0},{"$f":"VLOOKUP($B92,'Vysledky-doplneni'!$C$7:$L$126,8,0)","v":0},{"$f":"VLOOKUP($B92,'Vysledky-doplneni'!$C$7:$L$126,9,0)","v":0},{"$f":"VLOOKUP($B92,'Vysledky-doplneni'!$C$7:$L$126,10,0)","v":0},null,0,{"$error":"#DIV/0!"},0]
[{"$f":"IF(Vstup!C89<>\"\",Vstup!B89,\"\")","v":""},{"$f":"IF(Vstup!C89<>\"\",Vstup!C89,\"\")","v":""},{"$f":"IF(Vstup!C89<>\"\",Vstup!D89,\"\")","v":""},{"$f":"VLOOKUP($B93,'Vysledky-doplneni'!$C$7:$L$126,3,0)","v":0},{"$f":"VLOOKUP($B93,'Vysledky-doplneni'!$C$7:$L$126,4,0)","v":0},{"$f":"VLOOKUP($B93,'Vysledky-doplneni'!$C$7:$L$126,5,0)","v":0},{"$f":"VLOOKUP($B93,'Vysledky-doplneni'!$C$7:$L$126,6,0)","v":0},{"$f":"VLOOKUP($B93,'Vysledky-doplneni'!$C$7:$L$126,7,0)","v":0},{"$f":"VLOOKUP($B93,'Vysledky-doplneni'!$C$7:$L$126,8,0)","v":0},{"$f":"VLOOKUP($B93,'Vysledky-doplneni'!$C$7:$L$126,9,0)","v":0},{"$f":"VLOOKUP($B93,'Vysledky-doplneni'!$C$7:$L$126,10,0)","v":0},null,0,{"$error":"#DIV/0!"},0]
[{"$f":"IF(Vstup!C90<>\"\",Vstup!B90,\"\")","v":""},{"$f":"IF(Vstup!C90<>\"\",Vstup!C90,\"\")","v":""},{"$f":"IF(Vstup!C90<>\"\",Vstup!D90,\"\")","v":""},{"$f":"VLOOKUP($B94,'Vysledky-doplneni'!$C$7:$L$126,3,0)","v":0},{"$f":"VLOOKUP($B94,'Vysledky-doplneni'!$C$7:$L$126,4,0)","v":0},{"$f":"VLOOKUP($B94,'Vysledky-doplneni'!$C$7:$L$126,5,0)","v":0},{"$f":"VLOOKUP($B94,'Vysledky-doplneni'!$C$7:$L$126,6,0)","v":0},{"$f":"VLOOKUP($B94,'Vysledky-doplneni'!$C$7:$L$126,7,0)","v":0},{"$f":"VLOOKUP($B94,'Vysledky-doplneni'!$C$7:$L$126,8,0)","v":0},{"$f":"VLOOKUP($B94,'Vysledky-doplneni'!$C$7:$L$126,9,0)","v":0},{"$f":"VLOOKUP($B94,'Vysledky-doplneni'!$C$7:$L$126,10,0)","v":0},null,0,{"$error":"#DIV/0!"},0]
[{"$f":"IF(Vstup!C91<>\"\",Vstup!B91,\"\")","v":""},{"$f":"IF(Vstup!C91<>\"\",Vstup!C91,\"\")","v":""},{"$f":"IF(Vstup!C91<>\"\",Vstup!D91,\"\")","v":""},{"$f":"VLOOKUP($B95,'Vysledky-doplneni'!$C$7:$L$126,3,0)","v":0},{"$f":"VLOOKUP($B95,'Vysledky-doplneni'!$C$7:$L$126,4,0)","v":0},{"$f":"VLOOKUP($B95,'Vysledky-doplneni'!$C$7:$L$126,5,0)","v":0},{"$f":"VLOOKUP($B95,'Vysledky-doplneni'!$C$7:$L$126,6,0)","v":0},{"$f":"VLOOKUP($B95,'Vysledky-doplneni'!$C$7:$L$126,7,0)","v":0},{"$f":"VLOOKUP($B95,'Vysledky-doplneni'!$C$7:$L$126,8,0)","v":0},{"$f":"VLOOKUP($B95,'Vysledky-doplneni'!$C$7:$L$126,9,0)","v":0},{"$f":"VLOOKUP($B95,'Vysledky-doplneni'!$C$7:$L$126,10,0)","v":0},null,0,{"$error":"#DIV/0!"},0]
[{"$f":"IF(Vstup!C92<>\"\",Vstup!B92,\"\")","v":""},{"$f":"IF(Vstup!C92<>\"\",Vstup!C92,\"\")","v":""},{"$f":"IF(Vstup!C92<>\"\",Vstup!D92,\"\")","v":""},{"$f":"VLOOKUP($B96,'Vysledky-doplneni'!$C$7:$L$126,3,0)","v":0},{"$f":"VLOOKUP($B96,'Vysledky-doplneni'!$C$7:$L$126,4,0)","v":0},{"$f":"VLOOKUP($B96,'Vysledky-doplneni'!$C$7:$L$126,5,0)","v":0},{"$f":"VLOOKUP($B96,'Vysledky-doplneni'!$C$7:$L$126,6,0)","v":0},{"$f":"VLOOKUP($B96,'Vysledky-doplneni'!$C$7:$L$126,7,0)","v":0},{"$f":"VLOOKUP($B96,'Vysledky-doplneni'!$C$7:$L$126,8,0)","v":0},{"$f":"VLOOKUP($B96,'Vysledky-doplneni'!$C$7:$L$126,9,0)","v":0},{"$f":"VLOOKUP($B96,'Vysledky-doplneni'!$C$7:$L$126,10,0)","v":0},null,0,{"$error":"#DIV/0!"},0]
[{"$f":"IF(Vstup!C93<>\"\",Vstup!B93,\"\")","v":""},{"$f":"IF(Vstup!C93<>\"\",Vstup!C93,\"\")","v":""},{"$f":"IF(Vstup!C93<>\"\",Vstup!D93,\"\")","v":""},{"$f":"VLOOKUP($B97,'Vysledky-doplneni'!$C$7:$L$126,3,0)","v":0},{"$f":"VLOOKUP($B97,'Vysledky-doplneni'!$C$7:$L$126,4,0)","v":0},{"$f":"VLOOKUP($B97,'Vysledky-doplneni'!$C$7:$L$126,5,0)","v":0},{"$f":"VLOOKUP($B97,'Vysledky-doplneni'!$C$7:$L$126,6,0)","v":0},{"$f":"VLOOKUP($B97,'Vysledky-doplneni'!$C$7:$L$126,7,0)","v":0},{"$f":"VLOOKUP($B97,'Vysledky-doplneni'!$C$7:$L$126,8,0)","v":0},{"$f":"VLOOKUP($B97,'Vysledky-doplneni'!$C$7:$L$126,9,0)","v":0},{"$f":"VLOOKUP($B97,'Vysledky-doplneni'!$C$7:$L$126,10,0)","v":0},null,0,{"$error":"#DIV/0!"},0]
[{"$f":"IF(Vstup!C94<>\"\",Vstup!B94,\"\")","v":""},{"$f":"IF(Vstup!C94<>\"\",Vstup!C94,\"\")","v":""},{"$f":"IF(Vstup!C94<>\"\",Vstup!D94,\"\")","v":""},{"$f":"VLOOKUP($B98,'Vysledky-doplneni'!$C$7:$L$126,3,0)","v":0},{"$f":"VLOOKUP($B98,'Vysledky-doplneni'!$C$7:$L$126,4,0)","v":0},{"$f":"VLOOKUP($B98,'Vysledky-doplneni'!$C$7:$L$126,5,0)","v":0},{"$f":"VLOOKUP($B98,'Vysledky-doplneni'!$C$7:$L$126,6,0)","v":0},{"$f":"VLOOKUP($B98,'Vysledky-doplneni'!$C$7:$L$126,7,0)","v":0},{"$f":"VLOOKUP($B98,'Vysledky-doplneni'!$C$7:$L$126,8,0)","v":0},{"$f":"VLOOKUP($B98,'Vysledky-doplneni'!$C$7:$L$126,9,0)","v":0},{"$f":"VLOOKUP($B98,'Vysledky-doplneni'!$C$7:$L$126,10,0)","v":0},null,0,{"$error":"#DIV/0!"},0]
[{"$f":"IF(Vstup!C95<>\"\",Vstup!B95,\"\")","v":""},{"$f":"IF(Vstup!C95<>\"\",Vstup!C95,\"\")","v":""},{"$f":"IF(Vstup!C95<>\"\",Vstup!D95,\"\")","v":""},{"$f":"VLOOKUP($B99,'Vysledky-doplneni'!$C$7:$L$126,3,0)","v":0},{"$f":"VLOOKUP($B99,'Vysledky-doplneni'!$C$7:$L$126,4,0)","v":0},{"$f":"VLOOKUP($B99,'Vysledky-doplneni'!$C$7:$L$126,5,0)","v":0},{"$f":"VLOOKUP($B99,'Vysledky-doplneni'!$C$7:$L$126,6,0)","v":0},{"$f":"VLOOKUP($B99,'Vysledky-doplneni'!$C$7:$L$126,7,0)","v":0},{"$f":"VLOOKUP($B99,'Vysledky-doplneni'!$C$7:$L$126,8,0)","v":0},{"$f":"VLOOKUP($B99,'Vysledky-doplneni'!$C$7:$L$126,9,0)","v":0},{"$f":"VLOOKUP($B99,'Vysledky-doplneni'!$C$7:$L$126,10,0)","v":0},null,0,{"$error":"#DIV/0!"},0]
[{"$f":"IF(Vstup!C96<>\"\",Vstup!B96,\"\")","v":""},{"$f":"IF(Vstup!C96<>\"\",Vstup!C96,\"\")","v":""},{"$f":"IF(Vstup!C96<>\"\",Vstup!D96,\"\")","v":""},{"$f":"VLOOKUP($B100,'Vysledky-doplneni'!$C$7:$L$126,3,0)","v":0},{"$f":"VLOOKUP($B100,'Vysledky-doplneni'!$C$7:$L$126,4,0)","v":0},{"$f":"VLOOKUP($B100,'Vysledky-doplneni'!$C$7:$L$126,5,0)","v":0},{"$f":"VLOOKUP($B100,'Vysledky-doplneni'!$C$7:$L$126,6,0)","v":0},{"$f":"VLOOKUP($B100,'Vysledky-doplneni'!$C$7:$L$126,7,0)","v":0},{"$f":"VLOOKUP($B100,'Vysledky-doplneni'!$C$7:$L$126,8,0)","v":0},{"$f":"VLOOKUP($B100,'Vysledky-doplneni'!$C$7:$L$126,9,0)","v":0},{"$f":"VLOOKUP($B100,'Vysledky-doplneni'!$C$7:$L$126,10,0)","v":0},null,0,{"$error":"#DIV/0!"},0]
[{"$f":"IF(Vstup!C97<>\"\",Vstup!B97,\"\")","v":""},{"$f":"IF(Vstup!C97<>\"\",Vstup!C97,\"\")","v":""},{"$f":"IF(Vstup!C97<>\"\",Vstup!D97,\"\")","v":""},{"$f":"VLOOKUP($B101,'Vysledky-doplneni'!$C$7:$L$126,3,0)","v":0},{"$f":"VLOOKUP($B101,'Vysledky-doplneni'!$C$7:$L$126,4,0)","v":0},{"$f":"VLOOKUP($B101,'Vysledky-doplneni'!$C$7:$L$126,5,0)","v":0},{"$f":"VLOOKUP($B101,'Vysledky-doplneni'!$C$7:$L$126,6,0)","v":0},{"$f":"VLOOKUP($B101,'Vysledky-doplneni'!$C$7:$L$126,7,0)","v":0},{"$f":"VLOOKUP($B101,'Vysledky-doplneni'!$C$7:$L$126,8,0)","v":0},{"$f":"VLOOKUP($B101,'Vysledky-doplneni'!$C$7:$L$126,9,0)","v":0},{"$f":"VLOOKUP($B101,'Vysledky-doplneni'!$C$7:$L$126,10,0)","v":0},null,0,{"$error":"#DIV/0!"},0]
[{"$f":"IF(Vstup!C98<>\"\",Vstup!B98,\"\")","v":""},{"$f":"IF(Vstup!C98<>\"\",Vstup!C98,\"\")","v":""},{"$f":"IF(Vstup!C98<>\"\",Vstup!D98,\"\")","v":""},{"$f":"VLOOKUP($B102,'Vysledky-doplneni'!$C$7:$L$126,3,0)","v":0},{"$f":"VLOOKUP($B102,'Vysledky-doplneni'!$C$7:$L$126,4,0)","v":0},{"$f":"VLOOKUP($B102,'Vysledky-doplneni'!$C$7:$L$126,5,0)","v":0},{"$f":"VLOOKUP($B102,'Vysledky-doplneni'!$C$7:$L$126,6,0)","v":0},{"$f":"VLOOKUP($B102,'Vysledky-doplneni'!$C$7:$L$126,7,0)","v":0},{"$f":"VLOOKUP($B102,'Vysledky-doplneni'!$C$7:$L$126,8,0)","v":0},{"$f":"VLOOKUP($B102,'Vysledky-doplneni'!$C$7:$L$126,9,0)","v":0},{"$f":"VLOOKUP($B102,'Vysledky-doplneni'!$C$7:$L$126,10,0)","v":0},null,0,{"$error":"#DIV/0!"},0]
[{"$f":"IF(Vstup!C99<>\"\",Vstup!B99,\"\")","v":""},{"$f":"IF(Vstup!C99<>\"\",Vstup!C99,\"\")","v":""},{"$f":"IF(Vstup!C99<>\"\",Vstup!D99,\"\")","v":""},{"$f":"VLOOKUP($B103,'Vysledky-doplneni'!$C$7:$L$126,3,0)","v":0},{"$f":"VLOOKUP($B103,'Vysledky-doplneni'!$C$7:$L$126,4,0)","v":0},{"$f":"VLOOKUP($B103,'Vysledky-doplneni'!$C$7:$L$126,5,0)","v":0},{"$f":"VLOOKUP($B103,'Vysledky-doplneni'!$C$7:$L$126,6,0)","v":0},{"$f":"VLOOKUP($B103,'Vysledky-doplneni'!$C$7:$L$126,7,0)","v":0},{"$f":"VLOOKUP($B103,'Vysledky-doplneni'!$C$7:$L$126,8,0)","v":0},{"$f":"VLOOKUP($B103,'Vysledky-doplneni'!$C$7:$L$126,9,0)","v":0},{"$f":"VLOOKUP($B103,'Vysledky-doplneni'!$C$7:$L$126,10,0)","v":0},null,0,{"$error":"#DIV/0!"},0]
[{"$f":"IF(Vstup!C100<>\"\",Vstup!B100,\"\")","v":""},{"$f":"IF(Vstup!C100<>\"\",Vstup!C100,\"\")","v":""},{"$f":"IF(Vstup!C100<>\"\",Vstup!D100,\"\")","v":""},{"$f":"VLOOKUP($B104,'Vysledky-doplneni'!$C$7:$L$126,3,0)","v":0},{"$f":"VLOOKUP($B104,'Vysledky-doplneni'!$C$7:$L$126,4,0)","v":0},{"$f":"VLOOKUP($B104,'Vysledky-doplneni'!$C$7:$L$126,5,0)","v":0},{"$f":"VLOOKUP($B104,'Vysledky-doplneni'!$C$7:$L$126,6,0)","v":0},{"$f":"VLOOKUP($B104,'Vysledky-doplneni'!$C$7:$L$126,7,0)","v":0},{"$f":"VLOOKUP($B104,'Vysledky-doplneni'!$C$7:$L$126,8,0)","v":0},{"$f":"VLOOKUP($B104,'Vysledky-doplneni'!$C$7:$L$126,9,0)","v":0},{"$f":"VLOOKUP($B104,'Vysledky-doplneni'!$C$7:$L$126,10,0)","v":0},null,0,{"$error":"#DIV/0!"},0]
[{"$f":"IF(Vstup!C101<>\"\",Vstup!B101,\"\")","v":""},{"$f":"IF(Vstup!C101<>\"\",Vstup!C101,\"\")","v":""},{"$f":"IF(Vstup!C101<>\"\",Vstup!D101,\"\")","v":""},{"$f":"VLOOKUP($B105,'Vysledky-doplneni'!$C$7:$L$126,3,0)","v":0},{"$f":"VLOOKUP($B105,'Vysledky-doplneni'!$C$7:$L$126,4,0)","v":0},{"$f":"VLOOKUP($B105,'Vysledky-doplneni'!$C$7:$L$126,5,0)","v":0},{"$f":"VLOOKUP($B105,'Vysledky-doplneni'!$C$7:$L$126,6,0)","v":0},{"$f":"VLOOKUP($B105,'Vysledky-doplneni'!$C$7:$L$126,7,0)","v":0},{"$f":"VLOOKUP($B105,'Vysledky-doplneni'!$C$7:$L$126,8,0)","v":0},{"$f":"VLOOKUP($B105,'Vysledky-doplneni'!$C$7:$L$126,9,0)","v":0},{"$f":"VLOOKUP($B105,'Vysledky-doplneni'!$C$7:$L$126,10,0)","v":0},null,0,{"$error":"#DIV/0!"},0]
[{"$f":"IF(Vstup!C102<>\"\",Vstup!B102,\"\")","v":""},{"$f":"IF(Vstup!C102<>\"\",Vstup!C102,\"\")","v":""},{"$f":"IF(Vstup!C102<>\"\",Vstup!D102,\"\")","v":""},{"$f":"VLOOKUP($B106,'Vysledky-doplneni'!$C$7:$L$126,3,0)","v":0},{"$f":"VLOOKUP($B106,'Vysledky-doplneni'!$C$7:$L$126,4,0)","v":0},{"$f":"VLOOKUP($B106,'Vysledky-doplneni'!$C$7:$L$126,5,0)","v":0},{"$f":"VLOOKUP($B106,'Vysledky-doplneni'!$C$7:$L$126,6,0)","v":0},{"$f":"VLOOKUP($B106,'Vysledky-doplneni'!$C$7:$L$126,7,0)","v":0},{"$f":"VLOOKUP($B106,'Vysledky-doplneni'!$C$7:$L$126,8,0)","v":0},{"$f":"VLOOKUP($B106,'Vysledky-doplneni'!$C$7:$L$126,9,0)","v":0},{"$f":"VLOOKUP($B106,'Vysledky-doplneni'!$C$7:$L$126,10,0)","v":0},null,0,{"$error":"#DIV/0!"},0]
[{"$f":"IF(Vstup!C103<>\"\",Vstup!B103,\"\")","v":""},{"$f":"IF(Vstup!C103<>\"\",Vstup!C103,\"\")","v":""},{"$f":"IF(Vstup!C103<>\"\",Vstup!D103,\"\")","v":""},{"$f":"VLOOKUP($B107,'Vysledky-doplneni'!$C$7:$L$126,3,0)","v":0},{"$f":"VLOOKUP($B107,'Vysledky-doplneni'!$C$7:$L$126,4,0)","v":0},{"$f":"VLOOKUP($B107,'Vysledky-doplneni'!$C$7:$L$126,5,0)","v":0},{"$f":"VLOOKUP($B107,'Vysledky-doplneni'!$C$7:$L$126,6,0)","v":0},{"$f":"VLOOKUP($B107,'Vysledky-doplneni'!$C$7:$L$126,7,0)","v":0},{"$f":"VLOOKUP($B107,'Vysledky-doplneni'!$C$7:$L$126,8,0)","v":0},{"$f":"VLOOKUP($B107,'Vysledky-doplneni'!$C$7:$L$126,9,0)","v":0},{"$f":"VLOOKUP($B107,'Vysledky-doplneni'!$C$7:$L$126,10,0)","v":0},null,0,{"$error":"#DIV/0!"},0]
[{"$f":"IF(Vstup!C104<>\"\",Vstup!B104,\"\")","v":""},{"$f":"IF(Vstup!C104<>\"\",Vstup!C104,\"\")","v":""},{"$f":"IF(Vstup!C104<>\"\",Vstup!D104,\"\")","v":""},{"$f":"VLOOKUP($B108,'Vysledky-doplneni'!$C$7:$L$126,3,0)","v":0},{"$f":"VLOOKUP($B108,'Vysledky-doplneni'!$C$7:$L$126,4,0)","v":0},{"$f":"VLOOKUP($B108,'Vysledky-doplneni'!$C$7:$L$126,5,0)","v":0},{"$f":"VLOOKUP($B108,'Vysledky-doplneni'!$C$7:$L$126,6,0)","v":0},{"$f":"VLOOKUP($B108,'Vysledky-doplneni'!$C$7:$L$126,7,0)","v":0},{"$f":"VLOOKUP($B108,'Vysledky-doplneni'!$C$7:$L$126,8,0)","v":0},{"$f":"VLOOKUP($B108,'Vysledky-doplneni'!$C$7:$L$126,9,0)","v":0},{"$f":"VLOOKUP($B108,'Vysledky-doplneni'!$C$7:$L$126,10,0)","v":0},null,0,{"$error":"#DIV/0!"},0]
[{"$f":"IF(Vstup!C105<>\"\",Vstup!B105,\"\")","v":""},{"$f":"IF(Vstup!C105<>\"\",Vstup!C105,\"\")","v":""},{"$f":"IF(Vstup!C105<>\"\",Vstup!D105,\"\")","v":""},{"$f":"VLOOKUP($B109,'Vysledky-doplneni'!$C$7:$L$126,3,0)","v":0},{"$f":"VLOOKUP($B109,'Vysledky-doplneni'!$C$7:$L$126,4,0)","v":0},{"$f":"VLOOKUP($B109,'Vysledky-doplneni'!$C$7:$L$126,5,0)","v":0},{"$f":"VLOOKUP($B109,'Vysledky-doplneni'!$C$7:$L$126,6,0)","v":0},{"$f":"VLOOKUP($B109,'Vysledky-doplneni'!$C$7:$L$126,7,0)","v":0},{"$f":"VLOOKUP($B109,'Vysledky-doplneni'!$C$7:$L$126,8,0)","v":0},{"$f":"VLOOKUP($B109,'Vysledky-doplneni'!$C$7:$L$126,9,0)","v":0},{"$f":"VLOOKUP($B109,'Vysledky-doplneni'!$C$7:$L$126,10,0)","v":0},null,0,{"$error":"#DIV/0!"},0]
[{"$f":"IF(Vstup!C106<>\"\",Vstup!B106,\"\")","v":""},{"$f":"IF(Vstup!C106<>\"\",Vstup!C106,\"\")","v":""},{"$f":"IF(Vstup!C106<>\"\",Vstup!D106,\"\")","v":""},{"$f":"VLOOKUP($B110,'Vysledky-doplneni'!$C$7:$L$126,3,0)","v":0},{"$f":"VLOOKUP($B110,'Vysledky-doplneni'!$C$7:$L$126,4,0)","v":0},{"$f":"VLOOKUP($B110,'Vysledky-doplneni'!$C$7:$L$126,5,0)","v":0},{"$f":"VLOOKUP($B110,'Vysledky-doplneni'!$C$7:$L$126,6,0)","v":0},{"$f":"VLOOKUP($B110,'Vysledky-doplneni'!$C$7:$L$126,7,0)","v":0},{"$f":"VLOOKUP($B110,'Vysledky-doplneni'!$C$7:$L$126,8,0)","v":0},{"$f":"VLOOKUP($B110,'Vysledky-doplneni'!$C$7:$L$126,9,0)","v":0},{"$f":"VLOOKUP($B110,'Vysledky-doplneni'!$C$7:$L$126,10,0)","v":0},null,0,{"$error":"#DIV/0!"},0]
[{"$f":"IF(Vstup!C107<>\"\",Vstup!B107,\"\")","v":""},{"$f":"IF(Vstup!C107<>\"\",Vstup!C107,\"\")","v":""},{"$f":"IF(Vstup!C107<>\"\",Vstup!D107,\"\")","v":""},{"$f":"VLOOKUP($B111,'Vysledky-doplneni'!$C$7:$L$126,3,0)","v":0},{"$f":"VLOOKUP($B111,'Vysledky-doplneni'!$C$7:$L$126,4,0)","v":0},{"$f":"VLOOKUP($B111,'Vysledky-doplneni'!$C$7:$L$126,5,0)","v":0},{"$f":"VLOOKUP($B111,'Vysledky-doplneni'!$C$7:$L$126,6,0)","v":0},{"$f":"VLOOKUP($B111,'Vysledky-doplneni'!$C$7:$L$126,7,0)","v":0},{"$f":"VLOOKUP($B111,'Vysledky-doplneni'!$C$7:$L$126,8,0)","v":0},{"$f":"VLOOKUP($B111,'Vysledky-doplneni'!$C$7:$L$126,9,0)","v":0},{"$f":"VLOOKUP($B111,'Vysledky-doplneni'!$C$7:$L$126,10,0)","v":0},null,0,{"$error":"#DIV/0!"},0]
[{"$f":"IF(Vstup!C108<>\"\",Vstup!B108,\"\")","v":""},{"$f":"IF(Vstup!C108<>\"\",Vstup!C108,\"\")","v":""},{"$f":"IF(Vstup!C108<>\"\",Vstup!D108,\"\")","v":""},{"$f":"VLOOKUP($B112,'Vysledky-doplneni'!$C$7:$L$126,3,0)","v":0},{"$f":"VLOOKUP($B112,'Vysledky-doplneni'!$C$7:$L$126,4,0)","v":0},{"$f":"VLOOKUP($B112,'Vysledky-doplneni'!$C$7:$L$126,5,0)","v":0},{"$f":"VLOOKUP($B112,'Vysledky-doplneni'!$C$7:$L$126,6,0)","v":0},{"$f":"VLOOKUP($B112,'Vysledky-doplneni'!$C$7:$L$126,7,0)","v":0},{"$f":"VLOOKUP($B112,'Vysledky-doplneni'!$C$7:$L$126,8,0)","v":0},{"$f":"VLOOKUP($B112,'Vysledky-doplneni'!$C$7:$L$126,9,0)","v":0},{"$f":"VLOOKUP($B112,'Vysledky-doplneni'!$C$7:$L$126,10,0)","v":0},null,0,{"$error":"#DIV/0!"},0]
[{"$f":"IF(Vstup!C109<>\"\",Vstup!B109,\"\")","v":""},{"$f":"IF(Vstup!C109<>\"\",Vstup!C109,\"\")","v":""},{"$f":"IF(Vstup!C109<>\"\",Vstup!D109,\"\")","v":""},{"$f":"VLOOKUP($B113,'Vysledky-doplneni'!$C$7:$L$126,3,0)","v":0},{"$f":"VLOOKUP($B113,'Vysledky-doplneni'!$C$7:$L$126,4,0)","v":0},{"$f":"VLOOKUP($B113,'Vysledky-doplneni'!$C$7:$L$126,5,0)","v":0},{"$f":"VLOOKUP($B113,'Vysledky-doplneni'!$C$7:$L$126,6,0)","v":0},{"$f":"VLOOKUP($B113,'Vysledky-doplneni'!$C$7:$L$126,7,0)","v":0},{"$f":"VLOOKUP($B113,'Vysledky-doplneni'!$C$7:$L$126,8,0)","v":0},{"$f":"VLOOKUP($B113,'Vysledky-doplneni'!$C$7:$L$126,9,0)","v":0},{"$f":"VLOOKUP($B113,'Vysledky-doplneni'!$C$7:$L$126,10,0)","v":0},null,0,{"$error":"#DIV/0!"},0]
[{"$f":"IF(Vstup!C110<>\"\",Vstup!B110,\"\")","v":""},{"$f":"IF(Vstup!C110<>\"\",Vstup!C110,\"\")","v":""},{"$f":"IF(Vstup!C110<>\"\",Vstup!D110,\"\")","v":""},{"$f":"VLOOKUP($B114,'Vysledky-doplneni'!$C$7:$L$126,3,0)","v":0},{"$f":"VLOOKUP($B114,'Vysledky-doplneni'!$C$7:$L$126,4,0)","v":0},{"$f":"VLOOKUP($B114,'Vysledky-doplneni'!$C$7:$L$126,5,0)","v":0},{"$f":"VLOOKUP($B114,'Vysledky-doplneni'!$C$7:$L$126,6,0)","v":0},{"$f":"VLOOKUP($B114,'Vysledky-doplneni'!$C$7:$L$126,7,0)","v":0},{"$f":"VLOOKUP($B114,'Vysledky-doplneni'!$C$7:$L$126,8,0)","v":0},{"$f":"VLOOKUP($B114,'Vysledky-doplneni'!$C$7:$L$126,9,0)","v":0},{"$f":"VLOOKUP($B114,'Vysledky-doplneni'!$C$7:$L$126,10,0)","v":0},null,0,{"$error":"#DIV/0!"},0]
[{"$f":"IF(Vstup!C111<>\"\",Vstup!B111,\"\")","v":""},{"$f":"IF(Vstup!C111<>\"\",Vstup!C111,\"\")","v":""},{"$f":"IF(Vstup!C111<>\"\",Vstup!D111,\"\")","v":""},{"$f":"VLOOKUP($B115,'Vysledky-doplneni'!$C$7:$L$126,3,0)","v":0},{"$f":"VLOOKUP($B115,'Vysledky-doplneni'!$C$7:$L$126,4,0)","v":0},{"$f":"VLOOKUP($B115,'Vysledky-doplneni'!$C$7:$L$126,5,0)","v":0},{"$f":"VLOOKUP($B115,'Vysledky-doplneni'!$C$7:$L$126,6,0)","v":0},{"$f":"VLOOKUP($B115,'Vysledky-doplneni'!$C$7:$L$126,7,0)","v":0},{"$f":"VLOOKUP($B115,'Vysledky-doplneni'!$C$7:$L$126,8,0)","v":0},{"$f":"VLOOKUP($B115,'Vysledky-doplneni'!$C$7:$L$126,9,0)","v":0},{"$f":"VLOOKUP($B115,'Vysledky-doplneni'!$C$7:$L$126,10,0)","v":0},null,0,{"$error":"#DIV/0!"},0]
[{"$f":"IF(Vstup!C112<>\"\",Vstup!B112,\"\")","v":""},{"$f":"IF(Vstup!C112<>\"\",Vstup!C112,\"\")","v":""},{"$f":"IF(Vstup!C112<>\"\",Vstup!D112,\"\")","v":""},{"$f":"VLOOKUP($B116,'Vysledky-doplneni'!$C$7:$L$126,3,0)","v":0},{"$f":"VLOOKUP($B116,'Vysledky-doplneni'!$C$7:$L$126,4,0)","v":0},{"$f":"VLOOKUP($B116,'Vysledky-doplneni'!$C$7:$L$126,5,0)","v":0},{"$f":"VLOOKUP($B116,'Vysledky-doplneni'!$C$7:$L$126,6,0)","v":0},{"$f":"VLOOKUP($B116,'Vysledky-doplneni'!$C$7:$L$126,7,0)","v":0},{"$f":"VLOOKUP($B116,'Vysledky-doplneni'!$C$7:$L$126,8,0)","v":0},{"$f":"VLOOKUP($B116,'Vysledky-doplneni'!$C$7:$L$126,9,0)","v":0},{"$f":"VLOOKUP($B116,'Vysledky-doplneni'!$C$7:$L$126,10,0)","v":0},null,0,{"$error":"#DIV/0!"},0]
[{"$f":"IF(Vstup!C113<>\"\",Vstup!B113,\"\")","v":""},{"$f":"IF(Vstup!C113<>\"\",Vstup!C113,\"\")","v":""},{"$f":"IF(Vstup!C113<>\"\",Vstup!D113,\"\")","v":""},{"$f":"VLOOKUP($B117,'Vysledky-doplneni'!$C$7:$L$126,3,0)","v":0},{"$f":"VLOOKUP($B117,'Vysledky-doplneni'!$C$7:$L$126,4,0)","v":0},{"$f":"VLOOKUP($B117,'Vysledky-doplneni'!$C$7:$L$126,5,0)","v":0},{"$f":"VLOOKUP($B117,'Vysledky-doplneni'!$C$7:$L$126,6,0)","v":0},{"$f":"VLOOKUP($B117,'Vysledky-doplneni'!$C$7:$L$126,7,0)","v":0},{"$f":"VLOOKUP($B117,'Vysledky-doplneni'!$C$7:$L$126,8,0)","v":0},{"$f":"VLOOKUP($B117,'Vysledky-doplneni'!$C$7:$L$126,9,0)","v":0},{"$f":"VLOOKUP($B117,'Vysledky-doplneni'!$C$7:$L$126,10,0)","v":0},null,0,{"$error":"#DIV/0!"},0]
[{"$f":"IF(Vstup!C114<>\"\",Vstup!B114,\"\")","v":""},{"$f":"IF(Vstup!C114<>\"\",Vstup!C114,\"\")","v":""},{"$f":"IF(Vstup!C114<>\"\",Vstup!D114,\"\")","v":""},{"$f":"VLOOKUP($B118,'Vysledky-doplneni'!$C$7:$L$126,3,0)","v":0},{"$f":"VLOOKUP($B118,'Vysledky-doplneni'!$C$7:$L$126,4,0)","v":0},{"$f":"VLOOKUP($B118,'Vysledky-doplneni'!$C$7:$L$126,5,0)","v":0},{"$f":"VLOOKUP($B118,'Vysledky-doplneni'!$C$7:$L$126,6,0)","v":0},{"$f":"VLOOKUP($B118,'Vysledky-doplneni'!$C$7:$L$126,7,0)","v":0},{"$f":"VLOOKUP($B118,'Vysledky-doplneni'!$C$7:$L$126,8,0)","v":0},{"$f":"VLOOKUP($B118,'Vysledky-doplneni'!$C$7:$L$126,9,0)","v":0},{"$f":"VLOOKUP($B118,'Vysledky-doplneni'!$C$7:$L$126,10,0)","v":0},null,0,{"$error":"#DIV/0!"},0]
[{"$f":"IF(Vstup!C115<>\"\",Vstup!B115,\"\")","v":""},{"$f":"IF(Vstup!C115<>\"\",Vstup!C115,\"\")","v":""},{"$f":"IF(Vstup!C115<>\"\",Vstup!D115,\"\")","v":""},{"$f":"VLOOKUP($B119,'Vysledky-doplneni'!$C$7:$L$126,3,0)","v":0},{"$f":"VLOOKUP($B119,'Vysledky-doplneni'!$C$7:$L$126,4,0)","v":0},{"$f":"VLOOKUP($B119,'Vysledky-doplneni'!$C$7:$L$126,5,0)","v":0},{"$f":"VLOOKUP($B119,'Vysledky-doplneni'!$C$7:$L$126,6,0)","v":0},{"$f":"VLOOKUP($B119,'Vysledky-doplneni'!$C$7:$L$126,7,0)","v":0},{"$f":"VLOOKUP($B119,'Vysledky-doplneni'!$C$7:$L$126,8,0)","v":0},{"$f":"VLOOKUP($B119,'Vysledky-doplneni'!$C$7:$L$126,9,0)","v":0},{"$f":"VLOOKUP($B119,'Vysledky-doplneni'!$C$7:$L$126,10,0)","v":0},null,0,{"$error":"#DIV/0!"},0]
[{"$f":"IF(Vstup!C116<>\"\",Vstup!B116,\"\")","v":""},{"$f":"IF(Vstup!C116<>\"\",Vstup!C116,\"\")","v":""},{"$f":"IF(Vstup!C116<>\"\",Vstup!D116,\"\")","v":""},{"$f":"VLOOKUP($B120,'Vysledky-doplneni'!$C$7:$L$126,3,0)","v":0},{"$f":"VLOOKUP($B120,'Vysledky-doplneni'!$C$7:$L$126,4,0)","v":0},{"$f":"VLOOKUP($B120,'Vysledky-doplneni'!$C$7:$L$126,5,0)","v":0},{"$f":"VLOOKUP($B120,'Vysledky-doplneni'!$C$7:$L$126,6,0)","v":0},{"$f":"VLOOKUP($B120,'Vysledky-doplneni'!$C$7:$L$126,7,0)","v":0},{"$f":"VLOOKUP($B120,'Vysledky-doplneni'!$C$7:$L$126,8,0)","v":0},{"$f":"VLOOKUP($B120,'Vysledky-doplneni'!$C$7:$L$126,9,0)","v":0},{"$f":"VLOOKUP($B120,'Vysledky-doplneni'!$C$7:$L$126,10,0)","v":0},null,0,{"$error":"#DIV/0!"},0]
[{"$f":"IF(Vstup!C117<>\"\",Vstup!B117,\"\")","v":""},{"$f":"IF(Vstup!C117<>\"\",Vstup!C117,\"\")","v":""},{"$f":"IF(Vstup!C117<>\"\",Vstup!D117,\"\")","v":""},{"$f":"VLOOKUP($B121,'Vysledky-doplneni'!$C$7:$L$126,3,0)","v":0},{"$f":"VLOOKUP($B121,'Vysledky-doplneni'!$C$7:$L$126,4,0)","v":0},{"$f":"VLOOKUP($B121,'Vysledky-doplneni'!$C$7:$L$126,5,0)","v":0},{"$f":"VLOOKUP($B121,'Vysledky-doplneni'!$C$7:$L$126,6,0)","v":0},{"$f":"VLOOKUP($B121,'Vysledky-doplneni'!$C$7:$L$126,7,0)","v":0},{"$f":"VLOOKUP($B121,'Vysledky-doplneni'!$C$7:$L$126,8,0)","v":0},{"$f":"VLOOKUP($B121,'Vysledky-doplneni'!$C$7:$L$126,9,0)","v":0},{"$f":"VLOOKUP($B121,'Vysledky-doplneni'!$C$7:$L$126,10,0)","v":0},null,0,{"$error":"#DIV/0!"},0]
[{"$f":"IF(Vstup!C118<>\"\",Vstup!B118,\"\")","v":""},{"$f":"IF(Vstup!C118<>\"\",Vstup!C118,\"\")","v":""},{"$f":"IF(Vstup!C118<>\"\",Vstup!D118,\"\")","v":""},{"$f":"VLOOKUP($B122,'Vysledky-doplneni'!$C$7:$L$126,3,0)","v":0},{"$f":"VLOOKUP($B122,'Vysledky-doplneni'!$C$7:$L$126,4,0)","v":0},{"$f":"VLOOKUP($B122,'Vysledky-doplneni'!$C$7:$L$126,5,0)","v":0},{"$f":"VLOOKUP($B122,'Vysledky-doplneni'!$C$7:$L$126,6,0)","v":0},{"$f":"VLOOKUP($B122,'Vysledky-doplneni'!$C$7:$L$126,7,0)","v":0},{"$f":"VLOOKUP($B122,'Vysledky-doplneni'!$C$7:$L$126,8,0)","v":0},{"$f":"VLOOKUP($B122,'Vysledky-doplneni'!$C$7:$L$126,9,0)","v":0},{"$f":"VLOOKUP($B122,'Vysledky-doplneni'!$C$7:$L$126,10,0)","v":0},null,0,{"$error":"#DIV/0!"},0]
[{"$f":"IF(Vstup!C119<>\"\",Vstup!B119,\"\")","v":""},{"$f":"IF(Vstup!C119<>\"\",Vstup!C119,\"\")","v":""},{"$f":"IF(Vstup!C119<>\"\",Vstup!D119,\"\")","v":""},{"$f":"VLOOKUP($B123,'Vysledky-doplneni'!$C$7:$L$126,3,0)","v":0},{"$f":"VLOOKUP($B123,'Vysledky-doplneni'!$C$7:$L$126,4,0)","v":0},{"$f":"VLOOKUP($B123,'Vysledky-doplneni'!$C$7:$L$126,5,0)","v":0},{"$f":"VLOOKUP($B123,'Vysledky-doplneni'!$C$7:$L$126,6,0)","v":0},{"$f":"VLOOKUP($B123,'Vysledky-doplneni'!$C$7:$L$126,7,0)","v":0},{"$f":"VLOOKUP($B123,'Vysledky-doplneni'!$C$7:$L$126,8,0)","v":0},{"$f":"VLOOKUP($B123,'Vysledky-doplneni'!$C$7:$L$126,9,0)","v":0},{"$f":"VLOOKUP($B123,'Vysledky-doplneni'!$C$7:$L$126,10,0)","v":0},null,0,{"$error":"#DIV/0!"},0]
[{"$f":"IF(Vstup!C120<>\"\",Vstup!B120,\"\")","v":""},{"$f":"IF(Vstup!C120<>\"\",Vstup!C120,\"\")","v":""},{"$f":"IF(Vstup!C120<>\"\",Vstup!D120,\"\")","v":""},{"$f":"VLOOKUP($B124,'Vysledky-doplneni'!$C$7:$L$126,3,0)","v":0},{"$f":"VLOOKUP($B124,'Vysledky-doplneni'!$C$7:$L$126,4,0)","v":0},{"$f":"VLOOKUP($B124,'Vysledky-doplneni'!$C$7:$L$126,5,0)","v":0},{"$f":"VLOOKUP($B124,'Vysledky-doplneni'!$C$7:$L$126,6,0)","v":0},{"$f":"VLOOKUP($B124,'Vysledky-doplneni'!$C$7:$L$126,7,0)","v":0},{"$f":"VLOOKUP($B124,'Vysledky-doplneni'!$C$7:$L$126,8,0)","v":0},{"$f":"VLOOKUP($B124,'Vysledky-doplneni'!$C$7:$L$126,9,0)","v":0},{"$f":"VLOOKUP($B124,'Vysledky-doplneni'!$C$7:$L$126,10,0)","v":0},null,0,{"$error":"#DIV/0!"},0]
[{"$f":"IF(Vstup!C121<>\"\",Vstup!B121,\"\")","v":""},{"$f":"IF(Vstup!C121<>\"\",Vstup!C121,\"\")","v":""},{"$f":"IF(Vstup!C121<>\"\",Vstup!D121,\"\")","v":""},{"$f":"VLOOKUP($B125,'Vysledky-doplneni'!$C$7:$L$126,3,0)","v":0},{"$f":"VLOOKUP($B125,'Vysledky-doplneni'!$C$7:$L$126,4,0)","v":0},{"$f":"VLOOKUP($B125,'Vysledky-doplneni'!$C$7:$L$126,5,0)","v":0},{"$f":"VLOOKUP($B125,'Vysledky-doplneni'!$C$7:$L$126,6,0)","v":0},{"$f":"VLOOKUP($B125,'Vysledky-doplneni'!$C$7:$L$126,7,0)","v":0},{"$f":"VLOOKUP($B125,'Vysledky-doplneni'!$C$7:$L$126,8,0)","v":0},{"$f":"VLOOKUP($B125,'Vysledky-doplneni'!$C$7:$L$126,9,0)","v":0},{"$f":"VLOOKUP($B125,'Vysledky-doplneni'!$C$7:$L$126,10,0)","v":0},null,0,{"$error":"#DIV/0!"},0]
[{"$f":"IF(Vstup!C122<>\"\",Vstup!B122,\"\")","v":""},{"$f":"IF(Vstup!C122<>\"\",Vstup!C122,\"\")","v":""},{"$f":"IF(Vstup!C122<>\"\",Vstup!D122,\"\")","v":""},{"$f":"VLOOKUP($B126,'Vysledky-doplneni'!$C$7:$L$126,3,0)","v":0},{"$f":"VLOOKUP($B126,'Vysledky-doplneni'!$C$7:$L$126,4,0)","v":0},{"$f":"VLOOKUP($B126,'Vysledky-doplneni'!$C$7:$L$126,5,0)","v":0},{"$f":"VLOOKUP($B126,'Vysledky-doplneni'!$C$7:$L$126,6,0)","v":0},{"$f":"VLOOKUP($B126,'Vysledky-doplneni'!$C$7:$L$126,7,0)","v":0},{"$f":"VLOOKUP($B126,'Vysledky-doplneni'!$C$7:$L$126,8,0)","v":0},{"$f":"VLOOKUP($B126,'Vysledky-doplneni'!$C$7:$L$126,9,0)","v":0},{"$f":"VLOOKUP($B126,'Vysledky-doplneni'!$C$7:$L$126,10,0)","v":0},null,0,{"$error":"#DIV/0!"},0]
[{"$f":"IF(Vstup!C123<>\"\",Vstup!B123,\"\")","v":""},{"$f":"IF(Vstup!C123<>\"\",Vstup!C123,\"\")","v":""},{"$f":"IF(Vstup!C123<>\"\",Vstup!D123,\"\")","v":""},{"$f":"VLOOKUP($B127,'Vysledky-doplneni'!$C$7:$L$126,3,0)","v":0},{"$f":"VLOOKUP($B127,'Vysledky-doplneni'!$C$7:$L$126,4,0)","v":0},{"$f":"VLOOKUP($B127,'Vysledky-doplneni'!$C$7:$L$126,5,0)","v":0},{"$f":"VLOOKUP($B127,'Vysledky-doplneni'!$C$7:$L$126,6,0)","v":0},{"$f":"VLOOKUP($B127,'Vysledky-doplneni'!$C$7:$L$126,7,0)","v":0},{"$f":"VLOOKUP($B127,'Vysledky-doplneni'!$C$7:$L$126,8,0)","v":0},{"$f":"VLOOKUP($B127,'Vysledky-doplneni'!$C$7:$L$126,9,0)","v":0},{"$f":"VLOOKUP($B127,'Vysledky-doplneni'!$C$7:$L$126,10,0)","v":0},null,0,{"$error":"#DIV/0!"},0]
[{"$f":"IF(Vstup!C124<>\"\",Vstup!B124,\"\")","v":""},{"$f":"IF(Vstup!C124<>\"\",Vstup!C124,\"\")","v":""},{"$f":"IF(Vstup!C124<>\"\",Vstup!D124,\"\")","v":""},{"$f":"VLOOKUP($B128,'Vysledky-doplneni'!$C$7:$L$126,3,0)","v":0},{"$f":"VLOOKUP($B128,'Vysledky-doplneni'!$C$7:$L$126,4,0)","v":0},{"$f":"VLOOKUP($B128,'Vysledky-doplneni'!$C$7:$L$126,5,0)","v":0},{"$f":"VLOOKUP($B128,'Vysledky-doplneni'!$C$7:$L$126,6,0)","v":0},{"$f":"VLOOKUP($B128,'Vysledky-doplneni'!$C$7:$L$126,7,0)","v":0},{"$f":"VLOOKUP($B128,'Vysledky-doplneni'!$C$7:$L$126,8,0)","v":0},{"$f":"VLOOKUP($B128,'Vysledky-doplneni'!$C$7:$L$126,9,0)","v":0},{"$f":"VLOOKUP($B128,'Vysledky-doplneni'!$C$7:$L$126,10,0)","v":0},null,0,{"$error":"#DIV/0!"},0]
[{"$f":"IF(Vstup!C125<>\"\",Vstup!B125,\"\")","v":""},{"$f":"IF(Vstup!C125<>\"\",Vstup!C125,\"\")","v":""},{"$f":"IF(Vstup!C125<>\"\",Vstup!D125,\"\")","v":""},{"$f":"VLOOKUP($B129,'Vysledky-doplneni'!$C$7:$L$126,3,0)","v":0},{"$f":"VLOOKUP($B129,'Vysledky-doplneni'!$C$7:$L$126,4,0)","v":0},{"$f":"VLOOKUP($B129,'Vysledky-doplneni'!$C$7:$L$126,5,0)","v":0},{"$f":"VLOOKUP($B129,'Vysledky-doplneni'!$C$7:$L$126,6,0)","v":0},{"$f":"VLOOKUP($B129,'Vysledky-doplneni'!$C$7:$L$126,7,0)","v":0},{"$f":"VLOOKUP($B129,'Vysledky-doplneni'!$C$7:$L$126,8,0)","v":0},{"$f":"VLOOKUP($B129,'Vysledky-doplneni'!$C$7:$L$126,9,0)","v":0},{"$f":"VLOOKUP($B129,'Vysledky-doplneni'!$C$7:$L$126,10,0)","v":0},null,0,{"$error":"#DIV/0!"},0]
[{"$f":"IF(Vstup!C126<>\"\",Vstup!B126,\"\")","v":""},{"$f":"IF(Vstup!C126<>\"\",Vstup!C126,\"\")","v":""},{"$f":"IF(Vstup!C126<>\"\",Vstup!D126,\"\")","v":""},{"$f":"VLOOKUP($B130,'Vysledky-doplneni'!$C$7:$L$126,3,0)","v":0},{"$f":"VLOOKUP($B130,'Vysledky-doplneni'!$C$7:$L$126,4,0)","v":0},{"$f":"VLOOKUP($B130,'Vysledky-doplneni'!$C$7:$L$126,5,0)","v":0},{"$f":"VLOOKUP($B130,'Vysledky-doplneni'!$C$7:$L$126,6,0)","v":0},{"$f":"VLOOKUP($B130,'Vysledky-doplneni'!$C$7:$L$126,7,0)","v":0},{"$f":"VLOOKUP($B130,'Vysledky-doplneni'!$C$7:$L$126,8,0)","v":0},{"$f":"VLOOKUP($B130,'Vysledky-doplneni'!$C$7:$L$126,9,0)","v":0},{"$f":"VLOOKUP($B130,'Vysledky-doplneni'!$C$7:$L$126,10,0)","v":0},null,0,{"$error":"#DIV/0!"},0]
[{"$f":"IF(Vstup!C127<>\"\",Vstup!B127,\"\")","v":""},{"$f":"IF(Vstup!C127<>\"\",Vstup!C127,\"\")","v":""},{"$f":"IF(Vstup!C127<>\"\",Vstup!D127,\"\")","v":""},{"$f":"VLOOKUP($B131,'Vysledky-doplneni'!$C$7:$L$126,3,0)","v":0},{"$f":"VLOOKUP($B131,'Vysledky-doplneni'!$C$7:$L$126,4,0)","v":0},{"$f":"VLOOKUP($B131,'Vysledky-doplneni'!$C$7:$L$126,5,0)","v":0},{"$f":"VLOOKUP($B131,'Vysledky-doplneni'!$C$7:$L$126,6,0)","v":0},{"$f":"VLOOKUP($B131,'Vysledky-doplneni'!$C$7:$L$126,7,0)","v":0},{"$f":"VLOOKUP($B131,'Vysledky-doplneni'!$C$7:$L$126,8,0)","v":0},{"$f":"VLOOKUP($B131,'Vysledky-doplneni'!$C$7:$L$126,9,0)","v":0},{"$f":"VLOOKUP($B131,'Vysledky-doplneni'!$C$7:$L$126,10,0)","v":0},null,0,{"$error":"#DIV/0!"},0]
[{"$f":"IF(Vstup!C128<>\"\",Vstup!B128,\"\")","v":""},{"$f":"IF(Vstup!C128<>\"\",Vstup!C128,\"\")","v":""},{"$f":"IF(Vstup!C128<>\"\",Vstup!D128,\"\")","v":""},{"$f":"VLOOKUP($B132,'Vysledky-doplneni'!$C$7:$L$126,3,0)","v":0},{"$f":"VLOOKUP($B132,'Vysledky-doplneni'!$C$7:$L$126,4,0)","v":0},{"$f":"VLOOKUP($B132,'Vysledky-doplneni'!$C$7:$L$126,5,0)","v":0},{"$f":"VLOOKUP($B132,'Vysledky-doplneni'!$C$7:$L$126,6,0)","v":0},{"$f":"VLOOKUP($B132,'Vysledky-doplneni'!$C$7:$L$126,7,0)","v":0},{"$f":"VLOOKUP($B132,'Vysledky-doplneni'!$C$7:$L$126,8,0)","v":0},{"$f":"VLOOKUP($B132,'Vysledky-doplneni'!$C$7:$L$126,9,0)","v":0},{"$f":"VLOOKUP($B132,'Vysledky-doplneni'!$C$7:$L$126,10,0)","v":0},null,0,{"$error":"#DIV/0!"},0]
[{"$nulls":3},{"$f":"SUM(D8:D132)/(Data!$C$14*20)","v":{"v":0.7526315789473684,"d":"75.3%"}},{"$f":"SUM(E8:E132)/(Data!$C$14*20)","v":{"v":0.575,"d":"57.5%"}},{"$f":"SUM(F8:F132)/(Data!$C$14*20)","v":{"v":0.7171052631578947,"d":"71.7%"}},{"$f":"SUM(G8:G132)/(Data!$C$14*20)","v":{"v":0.6973684210526315,"d":"69.7%"}},{"$f":"SUM(H8:H132)/(Data!$C$14*20)","v":{"v":0.6552631578947369,"d":"65.5%"}},{"$f":"SUM(I8:I132)/(Data!$C$14*20)","v":{"v":0.45657894736842103,"d":"45.7%"}},{"$f":"SUM(J8:J132)/(Data!$C$14*20)","v":{"v":0.6394736842105263,"d":"63.9%"}},{"$f":"SUM(K8:K132)/(Data!$C$14*20)","v":{"v":0.6631578947368421,"d":"66.3%"}}]

{"sheet":"ASAT","index":24,"n_rows":340,"n_cols":32,"rows_kept":340,"merged":[[0,3,0,31],[1,2,2,2],[1,3,2,3],[1,4,2,4],[1,6,2,6],[1,28,2,28],[1,29,2,29],[1,30,2,30]]}
[{"$nulls":3},"R O Z D Ě L E N Í    D O    K A T E G O R I Í   P R O    R O K    2 0 1 2"]
[null,null,"ID","Přijmeni","Jméno",null,"Titul","Kat","Datum","26.3.","9.4.","17.4.","30.4.","12.6.","14.5.","21.5.","4.6.","5.6.","18.6.","25.6.","5.7.","9.7.","30.7.","6.8.","13.8.","4.9.","10.9.","8.10.","Terčů","Zásahů","Průměr","Kategorie"]
[{"$nulls":8},"narození",200,200,100,200,100,160,120,200,160,200,150,200,150,200,200,200,160,160,100]
[{"$f":"D4&\" \"&E4&F4","v":"Jankovský Jakub"},{"$f":"AF4","v":"J"},20637,"Jankovský","Jakub",null,null,"J","1992-02-02",173,163,86,165,91,null,null,164,null,null,132,160,null,142,151,155,126,123,74,{"$f":" IF(J4,$J$3) +IF(K4,$K$3) +IF(L4,$L$3) +IF(M4,$M$3) +IF(N4,$N$3) +IF(O4,$O$3) +IF(P4,$P$3) +IF(Q4,$Q$3) +IF(R4,$R$3) +IF(S4,$S$3) +IF(T4,$T$3) +IF(U4,$U$3) +IF(V4,$V$3) +IF(W4,$W$3) +IF(X4,$X$3) +IF(Y4,$Y$3) +IF(Z4,$Z$3) +IF(AA4,$AA$3) +IF(AB4,$AB$3)","v":2370},{"$f":"J4+K4+L4+M4+N4+O4+P4+Q4+R4+S4+T4+U4+V4+W4+X4+Y4+Z4+AA4+AB4","v":1905},{"$f":"IF(AC4=0,0,AD4/AC4)","v":{"v":0.8037974683544303,"d":"80.38%"}},"J"]
[{"$f":"D5&\" \"&E5&F5","v":"Kopáček Radim"},{"$f":"AF5","v":"J"},null,"Kopáček","Radim",null,null,"J",{"$nulls":19},73,100,73,{"v":0.73,"d":"73.00%"},"J"]
["Hřebec Jan ml.","J",null,"Hřebec","Jan"," ml.","ml.","J",null,141,137,69,131,71,104,88,null,86,null,120,127,100,118,144,null,108,107,73,2560,1724,{"v":0.6734375,"d":"67.34%"},"J"]
["Vaněk Matěj","J",null,"Vaněk","Matěj",null,null,"J",{"$nulls":3},63,123,69,null,77,115,{"$nulls":3},114,null,108,121,113,103,105,null,1840,1111,{"v":0.6038043478260869,"d":"60.38%"},"J"]
["Linhart Filip","J",null,"Linhart","Filip",null,null,"J",{"$nulls":10},118,{"$nulls":9},200,118,{"v":0.59,"d":"59.00%"},"J"]
["Čech Petr","J",20217,"Čech","Petr",null,null,"J",{"$nulls":19},58,100,58,{"v":0.58,"d":"58.00%"},"J"]
["Divíšek Martin ml.","J",236,"Divíšek","Martin"," ml.","ml.","J",{"$nulls":3},59,null,57,57,70,102,74,null,null,101,81,null,114,null,80,57,null,1710,852,{"v":0.4982456140350877,"d":"49.82%"},"J"]
["Mikula Petr","J",null,"Mikula","Petr",null,null,"J",{"$nulls":14},67,{"$nulls":5},200,67,{"v":0.335,"d":"33.50%"},"J"]
["Ferkl Jan ml.","J",130,"Ferkl","Jan"," ml.","ml.","J","1994-11-22",{"$nulls":19},0,0,{"v":0,"d":"0.00%"},"J"]
["Tomeček Jakub","J",460,"Tomeček","Jakub",null,null,"J","1991-05-23",{"$nulls":19},0,0,{"v":0,"d":"0.00%"},"J"]
["Štenglová Michaela","Ž",null,"Štenglová","Michaela",null,null,"Ž",{"$nulls":3},71,null,62,71,null,118,{"$nulls":8},90,75,58,980,545,{"v":0.5561224489795918,"d":"55.61%"},"Ž"]
["Krejzová Vlasta","Ž",null,"Krejzová","Vlasta",null,null,"Ž","1959-06-27",{"$nulls":18},54,100,54,{"v":0.54,"d":"54.00%"},"Ž"]
["Víchová Anna","Ž",null,"Víchová","Anna",null,"ing.","Ž",{"$nulls":15},91,null,null,49,31,460,171,{"v":0.3717391304347826,"d":"37.17%"},"Ž"]
["Zázvorka Pavel","A",234,"Zázvorka","Pavel",null,null,"S","1962-10-05",181,174,91,172,89,null,107,179,141,174,null,173,null,155,185,160,137,null,83,2540,2201,{"v":0.8665354330708661,"d":"86.65%"},"A"]
["Činčera Přemysl","A",553,"Činčera","Přemysl",null,null,"S","1963-10-02",169,165,84,160,93,null,111,177,{"$nulls":3},168,null,160,175,167,null,128,86,2180,1843,{"v":0.8454128440366973,"d":"84.54%"},"A"]
["Můčka Igor","A",2236,"Můčka","Igor",null,null,"S","1967-12-11",null,163,89,null,92,131,null,176,133,{"$nulls":3},121,147,176,{"$nulls":3},92,1570,1320,{"v":0.8407643312101911,"d":"84.08%"},"A"]
["Špaček Pavel","A",3769,"Špaček","Pavel",null,null,"S",null,null,158,86,null,null,131,null,161,124,null,146,null,122,null,177,null,129,null,88,1580,1322,{"v":0.8367088607594937,"d":"83.67%"},"A"]
["Rybín Milan","A",418,"Rybín","Milan",null,null,"S","1967-09-11",175,166,null,172,86,null,110,175,null,159,null,168,null,null,161,165,null,114,null,1980,1651,{"v":0.8338383838383838,"d":"83.38%"},"A"]
["Zvolánek Petr","A",549,"Zvolánek","Petr",null,null,"S","1969-12-16",176,166,{"$nulls":4},107,163,127,{"$nulls":7},127,null,null,1040,866,{"v":0.8326923076923077,"d":"83.27%"},"A"]
["Halouzka Benedikt","A",125,"Halouzka","Benedikt",null,null,"S","1964-04-08",{"$nulls":6},99,{"$nulls":7},165,{"$nulls":3},85,420,349,{"v":0.830952380952381,"d":"83.10%"},"A"]
["Hondl František","A",2572,"Hondl","František",null,null,"S","1979-07-09",171,165,91,161,92,142,109,165,110,null,null,169,null,157,160,null,129,134,89,2460,2044,{"v":0.8308943089430895,"d":"83.09%"},"A"]
["Borák Ondřej","A",318,"Borák","Ondřej",null,null,"S","1982-09-17",{"$nulls":4},77,{"$nulls":5},130,{"$nulls":8},250,207,{"v":0.828,"d":"82.80%"},"A"]
["Němeček Josef","A",432,"Němeček","Josef",null,null,"S","1971-01-30",{"$nulls":5},128,{"$nulls":4},128,null,129,null,161,{"$nulls":4},660,546,{"v":0.8272727272727273,"d":"82.73%"},"A"]
["Pluczinski Marcin","A",433,"Pluczinski","Marcin",null,null,"S",{"$nulls":3},79,{"$nulls":7},125,{"$nulls":3},178,{"$nulls":3},72,550,454,{"v":0.8254545454545454,"d":"82.55%"},"A"]
["Halouzka Lukáš","A",2831,"Halouzka","Lukáš",null,null,"S",{"$nulls":13},123,{"$nulls":6},150,123,{"v":0.82,"d":"82.00%"},"A"]
["Jarolím Zdeněk","A",132,"Jarolím","Zdeněk",null,null,"S",{"$nulls":13},122,{"$nulls":6},150,122,{"v":0.8133333333333334,"d":"81.33%"},"A"]
["Divíšek Martin","A",537,"Divíšek","Martin",null,"ing.","S","1968-08-27",166,168,87,167,88,113,98,155,133,162,119,166,127,139,157,164,136,132,88,3160,2565,{"v":0.8117088607594937,"d":"81.17%"},"A"]
["Rykr Eduard","A",2966,"Rykr","Eduard",null,null,"S","1962-01-28",null,null,78,161,88,{"$nulls":13},78,500,405,{"v":0.81,"d":"81.00%"},"A"]
["Kaprálek Michal","A",2052,"Kaprálek","Michal",null,null,"S","1974-05-20",null,null,81,{"$nulls":16},100,81,{"v":0.81,"d":"81.00%"},"A"]
["Kroupa Roman","A",3961,"Kroupa","Roman",null,null,"S",null,166,154,null,162,null,null,101,{"$nulls":12},720,583,{"v":0.8097222222222222,"d":"80.97%"},"A"]
["Michálek Lubomír","A",4184,"Michálek","Lubomír",null,null,"S","1967-03-10",162,155,null,154,null,141,null,159,124,null,126,167,125,146,178,null,null,124,null,2180,1761,{"v":0.8077981651376147,"d":"80.78%"},"A"]
["Mácha Karel","A",null,"Mácha","Karel",null,null,"S","1968-10-25",null,null,78,null,78,null,101,{"$nulls":12},320,257,{"v":0.803125,"d":"80.31%"},"A"]
["Hlaváček Václav","A",359,"Hlaváček","Václav",null,null,"S","1975-07-21",{"$nulls":4},80,{"$nulls":14},100,80,{"v":0.8,"d":"80.00%"},"A"]
["Hřebec Jan","A",1755,"Hřebec","Jan",null,null,"S",null,156,149,81,157,84,128,110,null,119,null,132,164,125,147,170,152,134,119,80,2760,2207,{"v":0.7996376811594202,"d":"79.96%"},"A"]
["Jankovský Miroslav","A",3198,"Jankovský","Miroslav",null,"Ing.","S","1963-11-22",null,167,91,150,86,118,101,158,null,null,110,162,null,145,164,163,130,123,86,2450,1954,{"v":0.7975510204081633,"d":"79.76%"},"A"]
["Podsedník Ladislav","A",822,"Podsedník","Ladislav",null,null,"S",{"$nulls":15},158,{"$nulls":4},200,158,{"v":0.79,"d":"79.00%"},"A"]
["Škanta Marek","A",2977,"Škanta","Marek",null,null,"S","1973-01-31",null,152,null,158,89,null,null,144,{"$nulls":3},160,null,null,160,165,null,null,76,1400,1104,{"v":0.7885714285714286,"d":"78.86%"},"A"]
["Kobes Jan","A",381,"Kobes","Jan",null,null,"S","1973-07-17",{"$nulls":3},157,{"$nulls":15},200,157,{"v":0.785,"d":"78.50%"},"A"]
["Kadlec Miroslav","A",213,"Kadlec","Miroslav",null,"Ing.","S","1983-10-06",null,null,78,null,78,{"$nulls":14},200,156,{"v":0.78,"d":"78.00%"},"A"]
["Kopáček Pavel","A",2967,"Kopáček","Pavel",null,null,"S",{"$nulls":5},78,{"$nulls":14},100,78,{"v":0.78,"d":"78.00%"},"A"]
["Novák Libor","A",1024,"Novák","Libor",null,null,"S","1975-05-23",159,153,null,157,null,null,109,157,117,null,null,157,null,139,null,null,123,128,80,1900,1479,{"v":0.7784210526315789,"d":"77.84%"},"A"]
["Čechura Martin","A",551,"Čechura","Martin",null,null,"S","1966-08-05",168,150,null,155,null,null,81,{"$nulls":4},161,{"$nulls":7},920,715,{"v":0.7771739130434783,"d":"77.72%"},"A"]
["Pápeš Milan","A",1051,"Pápeš","Milan",null,null,"S","1970-03-13",null,null,77,{"$nulls":16},100,77,{"v":0.77,"d":"77.00%"},"A"]
["Černošek Milan","A",655,"Černošek","Milan",null,"Ing.","S","1964-05-13",null,null,79,135,81,120,null,null,120,151,120,154,124,141,162,{"$nulls":3},85,1920,1472,{"v":0.7666666666666667,"d":"76.67%"},"A"]
["Vranka Petr","A",null,"Vranka","Petr",null,null,"S",{"$nulls":3},82,{"$nulls":6},150,{"$nulls":4},149,{"$nulls":3},79,600,460,{"v":0.7666666666666667,"d":"76.67%"},"A"]
["Kotrc Karel","A",3639,"Kotrc","Karel",null,null,"S","1960-12-10",163,{"$nulls":7},112,{"$nulls":10},360,275,{"v":0.7638888888888888,"d":"76.39%"},"A"]
["Stanislav Tomáš","A",826,"Stanislav","Tomáš",null,null,"S","1971-02-26",151,150,84,154,89,null,null,148,108,{"$nulls":3},114,null,153,{"$nulls":3},78,1610,1229,{"v":0.7633540372670807,"d":"76.34%"},"A"]
["Vrbas Josef","A",20526,"Vrbas","Josef",null,null,"S","1962-09-16",{"$nulls":18},76,100,76,{"v":0.76,"d":"76.00%"},"A"]
["Vrzáň Josef ml.","A",20219,"Vrzáň","Josef"," ml.","ml.","S","1978-06-23",158,{"$nulls":15},115,null,null,360,273,{"v":0.7583333333333333,"d":"75.83%"},"A"]
["Salaj Josef","A",131,"Salaj","Josef",null,null,"S","1962-07-05",null,152,79,null,null,122,null,158,106,{"$nulls":3},115,null,149,{"$nulls":3},81,1270,962,{"v":0.75748031496063,"d":"75.75%"},"A"]
["Štengl Jiří","A",820,"Štengl","Jiří",null,null,"S","1969-08-31",152,163,85,154,88,112,95,168,114,null,null,159,null,116,139,140,134,119,76,2660,2014,{"v":0.7571428571428571,"d":"75.71%"},"A"]
["Zigo Martin","A",20514,"Zigo","Martin",null,null,"S","1971-12-29",167,137,74,null,83,110,null,null,115,null,123,null,114,{"$nulls":5},76,1320,999,{"v":0.7568181818181818,"d":"75.68%"},"A"]
["Mrhálek Karel","A",817,"Mrhálek","Karel",null,null,"S","1960-06-27",{"$nulls":5},112,{"$nulls":4},121,{"$nulls":8},310,233,{"v":0.7516129032258064,"d":"75.16%"},"A"]
["Vaňáč Václav","A",3614,"Vaňáč","Václav",null,null,"S","1961-01-18",null,159,null,149,{"$nulls":4},124,{"$nulls":4},139,{"$nulls":5},760,571,{"v":0.7513157894736842,"d":"75.13%"},"A"]
["Musil Zdeněk","A",null,"Musil","Zdeněk",null,null,"S","1972-08-23",null,null,73,null,82,null,87,{"$nulls":5},117,null,147,{"$nulls":3},72,770,578,{"v":0.7506493506493507,"d":"75.06%"},"A"]
["Kyliánek Petr","A",null,"Kyliánek","Petr",null,null,"S","1971-05-11",{"$nulls":19},0,0,{"v":0,"d":"0.00%"},"A"]
["Staněk Josef","A",709,"Staněk","Josef",null,null,"S","1970-03-13",{"$nulls":19},0,0,{"v":0,"d":"0.00%"},"A"]
["Vaněk Roman","B",427,"Vaněk","Roman",null,null,"S","1972-02-24",158,null,79,150,65,null,91,141,{"$nulls":3},157,null,133,176,134,{"$nulls":3},1720,1284,{"v":0.7465116279069768,"d":"74.65%"},"B"]
["Molnár Anton","B",3317,"Molnár","Anton",null,"Ing.","S",null,null,143,73,145,{"$nulls":5},154,120,null,111,{"$nulls":6},1000,746,{"v":0.746,"d":"74.60%"},"B"]
["Kamiňski Marcin","B",null,"Kamiňski","Marcin",null,null,"S",{"$nulls":3},73,{"$nulls":7},109,{"$nulls":7},79,350,261,{"v":0.7457142857142857,"d":"74.57%"},"B"]
["Vlček Martin","B",200,"Vlček","Martin",null,null,"s",{"$nulls":5},76,null,91,{"$nulls":11},71,320,238,{"v":0.74375,"d":"74.38%"},"B"]
["Hrouda Josef","B",20056,"Hrouda","Josef",null,null,"S","1970-03-14",{"$nulls":5},119,{"$nulls":13},160,119,{"v":0.74375,"d":"74.38%"},"B"]
["Někoranec Igor","B",2787,"Někoranec","Igor",null,null,"S",{"$nulls":3},77,{"$nulls":6},145,116,{"$nulls":7},71,550,409,{"v":0.7436363636363637,"d":"74.36%"},"B"]
["Husar Vladimir","B",null,"Husar","Vladimir",null,null,"S","1973-03-13",152,158,75,147,69,112,95,143,115,125,138,null,null,145,154,151,115,118,76,2810,2088,{"v":0.7430604982206406,"d":"74.31%"},"B"]
["Buda Dušan","B",2186,"Buda","Dušan",null,"Ing.","S",{"$nulls":11},123,{"$nulls":7},62,{"$f":" IF(J68,$J$3) +IF(K68,$K$3) +IF(L68,$L$3) +IF(M68,$M$3) +IF(N68,$N$3) +IF(O68,$O$3) +IF(P68,$P$3) +IF(Q68,$Q$3) +IF(R68,$R$3) +IF(S68,$S$3) +IF(T68,$T$3) +IF(U68,$U$3) +IF(V68,$V$3) +IF(W68,$W$3) +IF(X68,$X$3) +IF(Y68,$Y$3) +IF(Z68,$Z$3) +IF(AA68,$AA$3) +IF(AB68,$AB$3)","v":250},{"$f":"J68+K68+L68+M68+N68+O68+P68+Q68+R68+S68+T68+U68+V68+W68+X68+Y68+Z68+AA68+AB68","v":185},{"$f":"IF(AC68=0,0,AD68/AC68)","v":{"v":0.74,"d":"74.00%"}},"B"]
[{"$f":"D69&\" \"&E69&F69","v":"Minář Jaroslav"},{"$f":"AF69","v":"B"},1017,"Minář","Jaroslav",null,null,"S",{"$nulls":15},148,{"$nulls":4},200,148,{"v":0.74,"d":"74.00%"},"B"]
["Staněk Karel","B",2247,"Staněk","Karel",null,null,"S","1981-04-13",{"$nulls":4},74,{"$nulls":14},100,74,{"v":0.74,"d":"74.00%"},"B"]
["Koloc Martin","B",20599,"Koloc","Martin",null,"Ing.","S","1961-07-10",null,null,75,null,81,null,95,149,{"$nulls":3},137,{"$nulls":4},114,112,79,1140,842,{"v":0.7385964912280701,"d":"73.86%"},"B"]
["Komárek Josef","B",336,"Komárek","Josef",null,null,"S","1972-04-02",159,147,76,138,78,104,null,null,113,141,null,141,116,null,163,{"$nulls":4},1870,1376,{"v":0.7358288770053476,"d":"73.58%"},"B"]
["Pandula  Ivan","B",null,"Pandula ","Ivan",null,"Ing.","S",{"$nulls":6},105,{"$nulls":3},142,118,null,116,{"$nulls":5},78,760,559,{"v":0.7355263157894737,"d":"73.55%"},"B"]
["Škrna Jiří","B",20635,"Škrna","Jiří",null,null,"S",null,147,{"$nulls":18},200,147,{"v":0.735,"d":"73.50%"},"B"]
["Honz Petr","B",4044,"Honz","Petr",null,"Ing.","S","1965-08-25",159,150,80,152,80,97,92,137,98,{"$nulls":6},161,null,112,78,1900,1396,{"v":0.7347368421052631,"d":"73.47%"},"B"]
["Štícha Lubomír","B",2661,"Štícha","Lubomír",null,null,"S",null,146,156,85,150,81,114,79,146,115,131,null,null,119,130,null,null,115,116,84,2410,1767,{"v":0.7331950207468879,"d":"73.32%"},"B"]
["Bejček Václav ml.","B",3113,"Bejček","Václav ml.",null,null,"S",{"$nulls":17},117,null,null,160,117,{"v":0.73125,"d":"73.13%"},"B"]
["Fojt Martin","B",2178,"Fojt","Martin",null,"Ing.","S","1979-09-10",null,null,77,{"$nulls":3},87,{"$nulls":11},69,320,233,{"v":0.728125,"d":"72.81%"},"B"]
["Divíšek Tomáš","B",3102,"Divíšek","Tomáš",null,null,"S","1973-02-26",null,null,76,null,76,104,100,{"$nulls":4},145,110,null,151,null,112,106,null,1350,980,{"v":0.725925925925926,"d":"72.59%"},"B"]
["Hruška Pavel","B",2777,"Hruška","Pavel",null,null,"S","1961-04-23",{"$nulls":4},75,102,{"$nulls":3},133,{"$nulls":4},169,{"$nulls":4},660,479,{"v":0.7257575757575757,"d":"72.58%"},"B"]
["Kytlica Vilém","B",3719,"Kytlica","Vilém",null,null,"S",null,145,{"$nulls":18},200,145,{"v":0.725,"d":"72.50%"},"B"]
["Lengyel Jan","B",20388,"Lengyel","Jan",null,null,"S","1988-07-24",{"$nulls":6},91,null,121,156,null,152,null,126,{"$nulls":4},64,980,710,{"v":0.7244897959183674,"d":"72.45%"},"B"]
["Potůček Jaroslav","B",3826,"Potůček","Jaroslav",null,null,"S","1974-10-18",null,null,88,null,79,null,null,139,{"$nulls":9},101,69,660,476,{"v":0.7212121212121212,"d":"72.12%"},"B"]
["Babický Jiří","B",20337,"Babický","Jiří",null,null,"S","1966-04-10",{"$nulls":4},72,{"$nulls":14},100,72,{"v":0.72,"d":"72.00%"},"B"]
["Hertl Igor","B",null,"Hertl","Igor",null,null,"S",{"$nulls":6},105,{"$nulls":3},135,117,null,117,{"$nulls":3},116,null,null,820,590,{"v":0.7195121951219512,"d":"71.95%"},"B"]
["Lengyel Ivan","B",3810,"Lengyel","Ivan",null,"Ing.","S","1961-10-24",{"$nulls":6},95,null,112,148,{"$nulls":3},134,{"$nulls":5},680,489,{"v":0.7191176470588235,"d":"71.91%"},"B"]
["Ornst Milan","B",20572,"Ornst","Milan",null,"Ing.","S","1960-07-02",{"$nulls":6},86,{"$nulls":12},120,86,{"v":0.7166666666666667,"d":"71.67%"},"B"]
["Beneš Jan","B",1966,"Beneš","Jan",null,null,"S","1968-12-05",163,141,null,147,null,96,{"$nulls":4},110,null,106,{"$nulls":5},67,1160,830,{"v":0.7155172413793104,"d":"71.55%"},"B"]
["Neuvirt Martin","B",3194,"Neuvirt","Martin",null,null,"S","1978-08-08",127,134,71,158,null,null,90,149,88,153,null,147,null,126,null,151,116,115,81,2400,1706,{"v":0.7108333333333333,"d":"71.08%"},"B"]
["Pučálka Karel","B",20364,"Pučálka","Karel",null,null,"S","1975-09-14",null,null,81,{"$nulls":15},61,200,142,{"v":0.71,"d":"71.00%"},"B"]
["Chrudimský Petr","B",20576,"Chrudimský","Petr",null,null,"S","1970-08-05",{"$nulls":4},71,{"$nulls":14},100,71,{"v":0.71,"d":"71.00%"},"B"]
["Pospíšil Stanislav","B",2143,"Pospíšil","Stanislav",null,null,"S",{"$nulls":10},142,{"$nulls":9},200,142,{"v":0.71,"d":"71.00%"},"B"]
["Vranka David","B",371,"Vranka","David",null,null,"S",{"$nulls":3},76,null,82,{"$nulls":4},134,null,null,101,{"$nulls":5},68,650,461,{"v":0.7092307692307692,"d":"70.92%"},"B"]
["Mládek Jan","B",3780,"Mládek","Jan",null,null,"S",{"$nulls":7},85,{"$nulls":12},120,85,{"v":0.7083333333333334,"d":"70.83%"},"B"]
["Zíta Ladislav","B",2806,"Zíta","Ladislav",null,null,"S",{"$nulls":7},85,{"$nulls":12},120,85,{"v":0.7083333333333334,"d":"70.83%"},"B"]
["Sokola Bronislav","B",20102,"Sokola","Bronislav",null,"ing.","S","1966-06-19",null,145,null,137,{"$nulls":3},161,112,146,{"$nulls":3},124,null,138,null,null,70,1460,1033,{"v":0.7075342465753425,"d":"70.75%"},"B"]
["Bělík Michal","B",648,"Bělík","Michal",null,null,"S","1977-08-16",null,null,74,null,65,{"$nulls":13},73,300,212,{"v":0.7066666666666667,"d":"70.67%"},"B"]
["Stránský Lukáš","B",1809,"Stránský","Lukáš",null,null,"S",{"$nulls":4},141,{"$nulls":15},200,141,{"v":0.705,"d":"70.50%"},"B"]
["Lengyel Jiří","B",3499,"Lengyel","Jiří",null,"Ing.","S","1961-10-24",{"$nulls":6},91,null,106,139,null,null,101,128,null,null,119,null,80,1090,764,{"v":0.7009174311926606,"d":"70.09%"},"B"]
["Klement Petr","B",1015,"Klement","Petr",null,null,"S",{"$nulls":19},70,100,70,{"v":0.7,"d":"70.00%"},"B"]
["Hertl Rastislav","B",null,"Hertl","Rastislav",null,null,"S",{"$nulls":6},106,{"$nulls":3},135,110,null,113,null,154,null,95,null,null,1020,713,{"v":0.6990196078431372,"d":"69.90%"},"B"]
["Lebloch Vladimír","B",null,"Lebloch","Vladimír",null,null,"S",{"$nulls":10},137,null,null,111,131,145,{"$nulls":4},750,524,{"v":0.6986666666666667,"d":"69.87%"},"B"]
["Kořínek Jindřich","B",2116,"Kořínek","Jindřich",null,"Ing.","S","1960-04-05",{"$nulls":5},99,{"$nulls":4},117,{"$nulls":8},310,216,{"v":0.6967741935483871,"d":"69.68%"},"B"]
["Staněk Tomáš","B",20443,"Staněk","Tomáš",null,null,"S","1976-05-29",{"$nulls":4},79,null,74,{"$nulls":12},220,153,{"v":0.6954545454545454,"d":"69.55%"},"B"]
["Racek Petr","B",null,"Racek","Petr",null,null,"S",{"$nulls":4},138,{"$nulls":3},139,{"$nulls":3},140,{"$nulls":7},600,417,{"v":0.695,"d":"69.50%"},"B"]
["Hnízdil Milan","B",1899,"Hnízdil","Milan",null,"Ing.","S","1957-03-04",{"$nulls":9},135,{"$nulls":8},73,300,208,{"v":0.6933333333333334,"d":"69.33%"},"B"]
["Kašpar Jiří","B",2829,"Kašpar","Jiří",null,"Ing.","S","1965-06-16",{"$nulls":6},89,{"$nulls":6},126,null,null,114,null,71,580,400,{"v":0.6896551724137931,"d":"68.97%"},"B"]
["Mocek Michal","B",1200,"Mocek","Michal",null,null,"S","1977-06-21",{"$nulls":4},77,{"$nulls":6},140,{"$nulls":4},100,null,null,460,317,{"v":0.6891304347826087,"d":"68.91%"},"B"]
["Vícha Jakub","B",null,"Vícha","Jakub",null,null,"S",{"$nulls":15},150,null,null,97,null,360,247,{"v":0.6861111111111111,"d":"68.61%"},"B"]
["Mach Jan","B",20571,"Mach","Jan",null,null,"S",{"$nulls":4},137,{"$nulls":15},200,137,{"v":0.685,"d":"68.50%"},"B"]
["Šlechta Martin","B",2811,"Šlechta","Martin",null,"Ing.","S","1978-02-09",{"$nulls":4},69,{"$nulls":5},102,{"$nulls":8},250,171,{"v":0.684,"d":"68.40%"},"B"]
["Pacal Antonín","B",20442,"Pacal","Antonín",null,null,"S","1972-01-10",null,null,71,null,45,null,99,{"$nulls":11},72,420,287,{"v":0.6833333333333333,"d":"68.33%"},"B"]
["Vostárek Jindřich","B",20386,"Vostárek","Jindřich",null,null,"S",{"$nulls":4},135,{"$nulls":7},148,null,124,{"$nulls":5},600,407,{"v":0.6783333333333333,"d":"67.83%"},"B"]
["Svoboda Vít","B",1053,"Svoboda","Vít",null,null,"S",{"$nulls":6},96,{"$nulls":4},106,null,110,{"$nulls":6},460,312,{"v":0.6782608695652174,"d":"67.83%"},"B"]
["Spanilý Ivo","B",3406,"Spanilý","Ivo",null,"Ing.","S","1969-04-27",null,null,71,{"$nulls":15},63,200,134,{"v":0.67,"d":"67.00%"},"B"]
["Pulicar jaroslav","B",20072,"Pulicar","jaroslav",null,null,"S",{"$nulls":5},67,{"$nulls":14},100,67,{"v":0.67,"d":"67.00%"},"B"]
["Kaiser Vladimír","B",4062,"Kaiser","Vladimír",null,null,"S",null,136,{"$nulls":5},78,{"$nulls":12},320,214,{"v":0.66875,"d":"66.88%"},"B"]
["Hýna Roman","B",375,"Hýna","Roman",null,null,"S",{"$nulls":18},107,null,160,107,{"v":0.66875,"d":"66.88%"},"B"]
["Nesiba Josef","B",739,"Nesiba","Josef",null,null,"S","1967-03-05",{"$nulls":6},80,{"$nulls":12},120,80,{"v":0.6666666666666666,"d":"66.67%"},"B"]
["Rykr Eduard ml.","B",4173,"Rykr","Eduard ml.",null,null,"S","1989-10-09",null,null,70,133,73,{"$nulls":13},57,500,333,{"v":0.666,"d":"66.60%"},"B"]
["Zborník Karel","B",3212,"Zborník","Karel",null,null,"S","1969-03-05",138,null,71,null,70,null,89,null,97,{"$nulls":3},107,{"$nulls":3},110,85,62,1250,829,{"v":0.6632,"d":"66.32%"},"B"]
["Liška Vladislav","B",3501,"Liška","Vladislav",null,null,"S",{"$nulls":17},106,null,null,160,106,{"v":0.6625,"d":"66.25%"},"B"]
["Žofka Josef","B",309,"Žofka","Josef",null,null,"S",{"$nulls":3},72,null,73,{"$nulls":3},111,{"$nulls":4},124,null,null,95,104,68,980,647,{"v":0.6602040816326531,"d":"66.02%"},"B"]
["Málek Vlastimil","B",20573,"Málek","Vlastimil",null,null,"S",{"$nulls":3},64,null,70,{"$nulls":13},64,300,198,{"v":0.66,"d":"66.00%"},"B"]
["Čech Antonín","B",383,"Čech","Antonín",null,null,"S",{"$nulls":5},66,{"$nulls":14},100,66,{"v":0.66,"d":"66.00%"},"B"]
["Červenka Zbyněk","B",2431,"Červenka","Zbyněk",null,null,"S","1988-04-28",{"$nulls":19},0,0,{"v":0,"d":"0.00%"},"B"]
["Čuda Milan","B",145,"Čuda","Milan",null,null,"S","1974-01-23",{"$nulls":19},0,0,{"v":0,"d":"0.00%"},"B"]
["Hanuš Jan","B",2551,"Hanuš","Jan",null,null,"S","1970-03-13",{"$nulls":19},0,0,{"v":0,"d":"0.00%"},"B"]
["Kodeš Václav","B",20381,"Kodeš","Václav",null,null,"S","1962-06-11",{"$nulls":19},0,0,{"v":0,"d":"0.00%"},"B"]
["Krejza Jan","B",4032,"Krejza","Jan",null,null,"S","1985-08-14",{"$nulls":19},0,0,{"v":0,"d":"0.00%"},"B"]
["Maruška Jaromír","B",20389,"Maruška","Jaromír",null,null,"S","1976-08-12",{"$nulls":19},0,0,{"v":0,"d":"0.00%"},"B"]
["Neuman Miloslav","B",2255,"Neuman","Miloslav",null,null,"S","1982-03-16",{"$nulls":19},{"$f":" IF(J132,$J$3) +IF(K132,$K$3) +IF(L132,$L$3) +IF(M132,$M$3) +IF(N132,$N$3) +IF(O132,$O$3) +IF(P132,$P$3) +IF(Q132,$Q$3) +IF(R132,$R$3) +IF(S132,$S$3) +IF(T132,$T$3) +IF(U132,$U$3) +IF(V132,$V$3) +IF(W132,$W$3) +IF(X132,$X$3) +IF(Y132,$Y$3) +IF(Z132,$Z$3) +IF(AA132,$AA$3) +IF(AB132,$AB$3)","v":0},{"$f":"J132+K132+L132+M132+N132+O132+P132+Q132+R132+S132+T132+U132+V132+W132+X132+Y132+Z132+AA132+AB132","v":0},{"$f":"IF(AC132=0,0,AD132/AC132)","v":{"v":0,"d":"0.00%"}},"B"]
[{"$f":"D133&\" \"&E133&F133","v":"Steiner Jan"},{"$f":"AF133","v":"B"},20525,"Steiner","Jan",null,null,"S","1971-03-11",{"$nulls":19},0,0,{"v":0,"d":"0.00%"},"B"]
["Straka Ladislav","B",1054,"Straka","Ladislav",null,null,"S","1981-04-17",{"$nulls":19},0,0,{"v":0,"d":"0.00%"},"B"]
["Sysel Tomáš","B",2227,"Sysel","Tomáš",null,null,"S",{"$nulls":20},0,0,{"v":0,"d":"0.00%"},"B"]
["Šílený Josef","B",20384,"Šílený","Josef",null,null,"S",{"$nulls":20},0,0,{"v":0,"d":"0.00%"},"B"]
["Šindelář Milan","B",20574,"Šindelář","Milan",null,null,"S","1962-10-17",{"$nulls":19},0,0,{"v":0,"d":"0.00%"},"B"]
["Tomeček Karel","B",19967,"Tomeček","Karel",null,null,"S","1965-07-09",{"$nulls":19},0,0,{"v":0,"d":"0.00%"},"B"]
["Tůma Martin","B",20351,"Tůma","Martin",null,null,"S",{"$nulls":20},0,0,{"v":0,"d":"0.00%"},"B"]
["Valapka Peter","B",3000,"Valapka","Peter",null,"Ing.","S","1961-11-14",{"$nulls":19},0,0,{"v":0,"d":"0.00%"},"B"]
["Žák Josef","B",3596,"Žák","Josef",null,null,"S",{"$nulls":20},0,0,{"v":0,"d":"0.00%"},"B"]
["Trepka Jiří","C",20506,"Trepka","Jiří",null,null,"S",{"$nulls":17},105,null,null,160,105,{"v":0.65625,"d":"65.63%"},"C"]
["Jiráček Zdeněk","C",3767,"Jiráček","Zdeněk",null,"Ing.","S","1958-01-07",146,null,63,null,70,107,85,133,99,129,null,null,94,107,null,null,105,null,73,1850,1211,{"v":0.6545945945945946,"d":"65.46%"},"C"]
["Pražák Petr","C",3503,"Pražák","Petr",null,null,"S","1983-05-15",{"$nulls":4},70,{"$nulls":6},131,{"$nulls":4},99,null,null,460,300,{"v":0.6521739130434783,"d":"65.22%"},"C"]
["Mikulka Peter","C",20449,"Mikulka","Peter",null,null,"S",null,156,137,75,136,null,98,130,null,102,13,106,145,107,116,140,119,107,null,73,2700,1760,{"v":0.6518518518518519,"d":"65.19%"},"C"]
["Brabec Václav","C",3428,"Brabec","Václav",null,null,"S","1960-07-06",129,null,null,133,null,null,88,{"$nulls":9},93,null,null,680,443,{"v":0.6514705882352941,"d":"65.15%"},"C"]
["Volf  Jan","C",20107,"Volf ","Jan",null,null,"S",{"$nulls":6},90,92,null,null,130,{"$nulls":9},480,312,{"v":0.65,"d":"65.00%"},"C"]
["Vavrečka Michal","C",4074,"Vavrečka","Michal",null,null,"S",null,143,127,null,122,70,91,null,128,null,null,106,{"$nulls":7},58,1310,845,{"v":0.6450381679389313,"d":"64.50%"},"C"]
["Sedláček Jiří","C",4043,"Sedláček","Jiří",null,null,"S",{"$nulls":17},103,null,null,160,103,{"v":0.64375,"d":"64.38%"},"C"]
["Staněk  Tomáš","C",4156,"Staněk ","Tomáš",null,null,"S","1979-08-23",null,null,59,null,69,{"$nulls":14},200,128,{"v":0.64,"d":"64.00%"},"C"]
["Vrzáň Josef","C",351,"Vrzáň","Josef",null,null,"S",null,119,{"$nulls":7},109,{"$nulls":10},360,228,{"v":0.6333333333333333,"d":"63.33%"},"C"]
["Miler Vlastimil","C",20597,"Miler","Vlastimil",null,null,"S",null,122,{"$nulls":8},131,{"$nulls":9},400,253,{"v":0.6325,"d":"63.25%"},"C"]
["Bláha Milan","C",411,"Bláha","Milan",null,null,"S",{"$nulls":17},101,null,null,160,101,{"v":0.63125,"d":"63.13%"},"C"]
["Tarek Martin","C",20019,"Tarek","Martin",null,null,"S",{"$nulls":6},90,{"$nulls":3},117,103,null,106,{"$nulls":6},660,416,{"v":0.6303030303030303,"d":"63.03%"},"C"]
["Gregor Aleš","C",20601,"Gregor","Aleš",null,null,"S","1964-07-29",125,null,65,null,60,87,{"$nulls":4},99,null,105,null,130,{"$nulls":3},65,{"$f":" IF(J155,$J$3) +IF(K155,$K$3) +IF(L153,$L$3) +IF(M155,$M$3) +IF(N155,$N$3) +IF(O155,$O$3) +IF(P155,$P$3) +IF(Q155,$Q$3) +IF(R155,$R$3) +IF(S155,$S$3) +IF(T155,$T$3) +IF(U155,$U$3) +IF(V155,$V$3) +IF(W155,$W$3) +IF(X155,$X$3) +IF(Y155,$Y$3) +IF(Z155,$Z$3) +IF(AA155,$AA$3) +IF(AB155,$AB$3)","v":1060},{"$f":"J155+K155+L153+M155+N155+O155+P155+Q155+R155+S155+T155+U155+V155+W155+X155+Y155+Z155+AA155+AB155","v":671},{"v":0.6330188679245283,"d":"63.30%"},"C"]
["Hildprandt Jan","C",20034,"Hildprandt","Jan",null,null,"S",{"$nulls":3},71,{"$nulls":3},78,{"$nulls":3},84,121,{"$nulls":6},67,{"$f":" IF(J156,$J$3) +IF(K156,$K$3) +IF(L156,$L$3) +IF(M156,$M$3) +IF(N156,$N$3) +IF(O156,$O$3) +IF(P156,$P$3) +IF(Q156,$Q$3) +IF(R156,$R$3) +IF(S156,$S$3) +IF(T156,$T$3) +IF(U156,$U$3) +IF(V156,$V$3) +IF(W156,$W$3) +IF(X156,$X$3) +IF(Y156,$Y$3) +IF(Z156,$Z$3) +IF(AA156,$AA$3) +IF(AB156,$AB$3)","v":670},{"$f":"J156+K156+L156+M156+N156+O156+P156+Q156+R156+S156+T156+U156+V156+W156+X156+Y156+Z156+AA156+AB156","v":421},{"v":0.6283582089552239,"d":"62.84%"},"C"]
["Bělohlavý Tomáš","C",20636,"Bělohlavý","Tomáš",null,null,"S",{"$nulls":17},100,null,null,160,100,{"v":0.625,"d":"62.50%"},"C"]
["Černý Bohuslav","C",3595,"Černý","Bohuslav",null,null,"S","1966-08-22",{"$nulls":16},100,null,null,160,100,{"v":0.625,"d":"62.50%"},"C"]
["Slovák Zdeněk","C",20111,"Slovák","Zdeněk",null,null,"S",null,125,{"$nulls":18},200,125,{"v":0.625,"d":"62.50%"},"C"]
["Horák František","C",770,"Horák","František",null,null,"S",{"$nulls":13},93,{"$nulls":6},150,93,{"v":0.62,"d":"62.00%"},"C"]
["Kupka Přemysl","C",20350,"Kupka","Přemysl",null,null,"S","1979-07-16",{"$nulls":4},62,{"$nulls":14},100,62,{"v":0.62,"d":"62.00%"},"C"]
["Sahula Vlastimil","C",20365,"Sahula","Vlastimil",null,"Ing.","S","1967-02-15",null,117,75,null,60,{"$nulls":12},86,70,660,408,{"v":0.6181818181818182,"d":"61.82%"},"C"]
["Novotný Václav","C",null,"Novotný","Václav",null,null,"S","1967-12-13",{"$nulls":6},74,{"$nulls":12},120,74,{"v":0.6166666666666667,"d":"61.67%"},"C"]
["Schmied Jaroslav","C",20557,"Schmied","Jaroslav",null,null,"S","1960-10-08",{"$nulls":12},92,{"$nulls":6},150,92,{"v":0.6133333333333333,"d":"61.33%"},"C"]
["Krška Jan","C",4160,"Krška","Jan",null,null,"S","1972-05-07",136,124,null,122,null,98,null,123,93,null,103,null,108,98,{"$nulls":3},83,null,1780,1088,{"v":0.6112359550561798,"d":"61.12%"},"C"]
["Gerger Jan","C",20533,"Gerger","Jan",null,null,"S",{"$nulls":13},91,{"$nulls":6},150,91,{"v":0.6066666666666667,"d":"60.67%"},"C"]
["Kirchner Milan","C",3713,"Kirchner","Milan",null,null,"S","1966-11-11",{"$nulls":16},97,null,null,160,97,{"v":0.60625,"d":"60.63%"},"C"]
["Filippi Marcel","C",null,"Filippi","Marcel",null,null,"S","1972-11-12",null,null,62,null,66,null,87,null,null,112,{"$nulls":3},101,{"$nulls":4},69,820,497,{"v":0.6060975609756097,"d":"60.61%"},"C"]
["Dolanský Jan","C",20370,"Dolanský","Jan",null,null,"S","1968-04-04",132,122,64,null,63,null,75,110,{"$nulls":9},83,61,1180,710,{"v":0.6016949152542372,"d":"60.17%"},"C"]
["Pospíšil Lubomír","C",4058,"Pospíšil","Lubomír",null,null,"S",{"$nulls":11},89,null,98,null,113,{"$nulls":4},500,300,{"v":0.6,"d":"60.00%"},"C"]
["Steklý Zdeněk","C",3731,"Steklý","Zdeněk",null,null,"S",{"$nulls":5},64,{"$nulls":11},92,null,null,260,156,{"v":0.6,"d":"60.00%"},"C"]
["Frnoch Milan","C",20630,"Frnoch","Milan",null,"Ing.","S","1958-01-14",{"$nulls":8},94,{"$nulls":7},97,null,null,320,191,{"v":0.596875,"d":"59.69%"},"C"]
["Weiss Josef","C",20314,"Weiss","Josef",null,"DiS.","S","1962-08-19",119,118,63,{"$nulls":15},57,600,357,{"v":0.595,"d":"59.50%"},"C"]
["Provázek Rudolf","C",4159,"Provázek","Rudolf",null,"Ing","S","1960-10-05",113,{"$nulls":5},77,{"$nulls":12},320,190,{"v":0.59375,"d":"59.38%"},"C"]
["Němec Tomáš","C",20591,"Němec","Tomáš",null,null,"S",null,138,null,null,116,{"$nulls":7},138,null,82,{"$nulls":5},800,474,{"v":0.5925,"d":"59.25%"},"C"]
["Matoušek Václav","C",2226,"Matoušek","Václav",null,"Ing","S","1959-08-12",null,null,65,null,60,{"$nulls":11},88,null,null,360,213,{"v":0.5916666666666667,"d":"59.17%"},"C"]
["Hoštička Eduard","C",20429,"Hoštička","Eduard",null,null,"S","1974-03-29",142,131,63,117,null,null,71,{"$nulls":4},135,null,88,106,125,null,74,null,1780,1052,{"v":0.5910112359550562,"d":"59.10%"},"C"]
["Vala Jiří","C",20595,"Vala","Jiří",null,null,"S",{"$nulls":3},61,null,57,{"$nulls":13},59,300,177,{"v":0.59,"d":"59.00%"},"C"]
["Prokop Jiří","C",20385,"Prokop","Jiří",null,null,"S",{"$nulls":3},57,{"$nulls":15},61,200,118,{"v":0.59,"d":"59.00%"},"C"]
["Kureš Jan","C",20472,"Kureš","Jan",null,null,"S",{"$nulls":3},52,null,59,{"$nulls":13},65,300,176,{"v":0.5866666666666667,"d":"58.67%"},"C"]
["Kaiser Vladimír","C",20441,"Kaiser","Vladimír",null,"ml.","S",{"$nulls":7},70,{"$nulls":12},120,70,{"v":0.5833333333333334,"d":"58.33%"},"C"]
["Korál Petr","C",20123,"Korál","Petr",null,null,"S","1974-01-16",119,93,null,139,{"$nulls":5},123,null,115,96,97,null,106,107,90,64,1970,1149,{"v":0.583248730964467,"d":"58.32%"},"C"]
["Pražák Jan","C",1935,"Pražák","Jan",null,null,"S","1981-09-13",{"$nulls":4},58,{"$nulls":14},100,58,{"v":0.58,"d":"58.00%"},"C"]
["Valchař Petr","C",20639,"Valchař","Petr",null,null,"S",{"$nulls":5},58,{"$nulls":14},100,58,{"v":0.58,"d":"58.00%"},"C"]
["Strnad Josef","C",20631,"Strnad","Josef",null,"ing.","S",{"$nulls":18},92,null,160,92,{"v":0.575,"d":"57.50%"},"C"]
["Duchoň Jakub","C",20382,"Duchoň","Jakub",null,null,"S","1981-05-14",115,null,57,{"$nulls":16},300,172,{"v":0.5733333333333334,"d":"57.33%"},"C"]
["Knaizl Tomáš","C",20594,"Knaizl","Tomáš",null,null,"S",{"$nulls":19},57,100,57,{"v":0.57,"d":"57.00%"},"C"]
["Pavlíček Martin","C",null,"Pavlíček","Martin",null,"ing.","S",{"$nulls":19},57,100,57,{"v":0.57,"d":"57.00%"},"C"]
["Petrůj Zdeněk","C",751,"Petrůj","Zdeněk",null,null,"S",{"$nulls":5},57,{"$nulls":14},100,57,{"v":0.57,"d":"57.00%"},"C"]
["Vranák Martin","C",20467,"Vranák","Martin",null,null,"S",null,113,100,null,116,66,null,null,114,{"$nulls":7},100,null,97,null,1260,706,{"v":0.5603174603174603,"d":"56.03%"},"C"]
["Pešek Josef","C",20358,"Pešek","Josef",null,null,"S","1958-03-23",null,null,56,{"$nulls":16},100,56,{"v":0.56,"d":"56.00%"},"C"]
["Petera Adam","C",20640,"Petera","Adam",null,null,"S",{"$nulls":19},56,100,56,{"v":0.56,"d":"56.00%"},"C"]
["Sobotka Jiří","C",20523,"Sobotka","Jiří",null,null,"S",{"$nulls":19},56,100,56,{"v":0.56,"d":"56.00%"},"C"]
["Švára Ondřej","C",20589,"Švára","Ondřej",null,null,"S","1958-01-24",141,{"$nulls":4},84,{"$nulls":7},87,{"$nulls":5},560,312,{"v":0.5571428571428572,"d":"55.71%"},"C"]
["Švec Miloslav","C",20519,"Švec","Miloslav",null,null,"S",{"$nulls":9},89,{"$nulls":10},160,89,{"v":0.55625,"d":"55.63%"},"C"]
["Němec Vít","C",20392,"Němec","Vít",null,null,"S",{"$nulls":3},55,null,57,null,71,null,78,{"$nulls":10},480,261,{"$f":"IF(AC196=0,0,AD196/AC196)","v":{"v":0.54375,"d":"54.38%"}},"C"]
[{"$f":"D197&\" \"&E197&F197","v":"Sabin Milan"},{"$f":"AF197","v":"C"},null,"Sabin","Milan",null,null,"S",{"$nulls":6},69,{"$nulls":3},115,null,null,90,{"$nulls":6},510,274,{"v":0.5372549019607843,"d":"53.73%"},"C"]
["Šimánek Jaroslav","C",20520,"Šimánek","Jaroslav",null,null,"S","1958-05-08",{"$nulls":5},80,{"$nulls":3},112,{"$nulls":9},360,192,{"v":0.5333333333333333,"d":"53.33%"},"C"]
["Drahokoupil Jiří","C",118,"Drahokoupil","Jiří",null,null,"S",{"$nulls":17},84,null,null,160,84,{"v":0.525,"d":"52.50%"},"C"]
["Hedvik jaromír","C",20536,"Hedvik","jaromír",null,null,"s",{"$nulls":5},50,89,55,{"$nulls":3},80,null,73,{"$nulls":5},52,780,399,{"v":0.5115384615384615,"d":"51.15%"},"C"]
["Minich Tomáš","C",475,"Minich","Tomáš",null,null,"S",{"$nulls":12},102,{"$nulls":7},200,102,{"v":0.51,"d":"51.00%"},"C"]
["Sobotka Libor","C",3132,"Sobotka","Libor",null,"Ing.","S",{"$nulls":5},51,{"$nulls":14},100,51,{"v":0.51,"d":"51.00%"},"C"]
["Čumpl zdeněk","C",355,"Čumpl","zdeněk",null,null,"S",{"$nulls":19},50,100,50,{"v":0.5,"d":"50.00%"},"C"]
["Hanus Marcel","C",529,"Hanus","Marcel",null,null,"S",{"$nulls":6},81,{"$nulls":4},72,{"$nulls":8},310,153,{"v":0.4935483870967742,"d":"49.35%"},"C"]
["Jeníček Jiří","C",3502,"Jeníček","Jiří",null,null,"S",null,null,98,{"$nulls":17},200,98,{"v":0.49,"d":"49.00%"},"C"]
["Gežo Josef","C",4042,"Gežo","Josef",null,null,"S",{"$nulls":6},58,{"$nulls":4},83,null,78,{"$nulls":5},52,560,271,{"v":0.48392857142857143,"d":"48.39%"},"C"]
["Hájek David","C",null,"Hájek","David",null,null,"S",{"$nulls":5},51,null,52,{"$nulls":6},85,{"$nulls":3},82,55,680,325,{"v":0.47794117647058826,"d":"47.79%"},"C"]
["Žáček Jiří","C",3099,"Žáček","Jiří",null,"MUDr.","S",{"$nulls":19},47,100,47,{"v":0.47,"d":"47.00%"},"C"]
["Žid Milan","C",602,"Žid","Milan",null,null,"S",{"$nulls":17},75,null,null,160,75,{"v":0.46875,"d":"46.88%"},"C"]
["Stejskal Martin","C",1905,"Stejskal","Martin",null,null,"S",{"$nulls":5},46,{"$nulls":14},100,46,{"v":0.46,"d":"46.00%"},"C"]
["Backa Lukáš","C",2062,"Backa","Lukáš",null,null,"S",{"$nulls":19},44,100,44,{"v":0.44,"d":"44.00%"},"C"]
["Bártl Lukáš","C",3958,"Bártl","Lukáš",null,null,"S",{"$nulls":5},43,{"$nulls":14},100,43,{"v":0.43,"d":"43.00%"},"C"]
["Kiriakovský alexej","C",338,"Kiriakovský","alexej",null,null,"S",{"$nulls":19},42,100,42,{"v":0.42,"d":"42.00%"},"C"]
["Soukup Pavel","C",3500,"Soukup","Pavel",null,null,"S",{"$nulls":19},42,100,42,{"v":0.42,"d":"42.00%"},"C"]
["Hrouda Miroslav","C",405,"Hrouda","Miroslav",null,null,"S",{"$nulls":6},66,{"$nulls":13},160,66,{"v":0.4125,"d":"41.25%"},"C"]
["Kopečný Josef","C",545,"Kopečný","Josef",null,"Ing.","S","1968-01-10",null,null,41,{"$nulls":16},100,41,{"v":0.41,"d":"41.00%"},"C"]
["Uher Petr","C",20634,"Uher","Petr",null,null,"S",{"$nulls":8},95,{"$nulls":5},65,{"$nulls":5},400,160,{"v":0.4,"d":"40.00%"},"C"]
["Maxa Milan","C",20380,"Maxa","Milan",null,null,"S",{"$nulls":9},64,{"$nulls":10},160,64,{"v":0.4,"d":"40.00%"},"C"]
["Střítecký Martin","C",436,"Střítecký","Martin",null,null,"S",{"$nulls":3},34,{"$nulls":16},100,34,{"v":0.34,"d":"34.00%"},"C"]
["Blicha jozef","C",507,"Blicha","jozef",null,"ing.","S",{"$nulls":3},34,{"$nulls":15},33,{"$f":" IF(J220,$J$3) +IF(K220,$K$3) +IF(L220,$L$3) +IF(M220,$M$3) +IF(N220,$N$3) +IF(O220,$O$3) +IF(P220,$P$3) +IF(Q220,$Q$3) +IF(R220,$R$3) +IF(S220,$S$3) +IF(T220,$T$3) +IF(U220,$U$3) +IF(V220,$V$3) +IF(W220,$W$3) +IF(X220,$X$3) +IF(Y220,$Y$3) +IF(Z220,$Z$3) +IF(AA220,$AA$3) +IF(AB220,$AB$3)","v":200},{"$f":"J220+K220+L220+M220+N220+O220+P220+Q220+R220+S220+T220+U220+V220+W220+X220+Y220+Z220+AA220+AB220","v":67},{"v":0.335,"d":"33.50%"},"C"]
["Novák Zdeněk","C",598,"Novák","Zdeněk",null,null,"S",{"$nulls":3},31,{"$nulls":16},100,31,{"v":0.31,"d":"31.00%"},"C"]
["Smejkal milan","C",2795,"Smejkal","milan",null,"ing.","S",{"$nulls":19},31,100,31,{"v":0.31,"d":"31.00%"},"C"]
["Svoboda Petr","C",20509,"Svoboda","Petr",null,"ing.","S",{"$nulls":19},31,100,31,{"v":0.31,"d":"31.00%"},"C"]
["Breicha Luděk","C",20511,"Breicha","Luděk",null,null,"S",{"$nulls":20},0,0,{"v":0,"d":"0.00%"},"C"]
["Burda Zdeněk","C",null,"Burda","Zdeněk",null,null,"S",{"$nulls":20},0,0,{"v":0,"d":"0.00%"},"C"]
["Čech Pavel","C",20444,"Čech","Pavel",null,null,"S","1976-02-24",{"$nulls":19},0,0,{"v":0,"d":"0.00%"},"C"]
["Dohnal Andrej","C",null,"Dohnal","Andrej",null,null,"S",{"$nulls":20},0,0,{"v":0,"d":"0.00%"},"C"]
["Dostál Jaroslav","C",4056,"Dostál","Jaroslav",null,null,"S",{"$nulls":20},0,0,{"v":0,"d":"0.00%"},"C"]
["Dostál Michal","C",575,"Dostál","Michal",null,null,"S","1961-06-06",{"$nulls":19},0,0,{"v":0,"d":"0.00%"},"C"]
["Dřímal Jaromír","C",717,"Dřímal","Jaromír",null,"Ing.","S","1966-04-10",{"$nulls":19},0,0,{"v":0,"d":"0.00%"},"C"]
["Dušánek Vladimír","C",1915,"Dušánek","Vladimír",null,null,"S","1961-09-26",{"$nulls":19},0,0,{"v":0,"d":"0.00%"},"C"]
["Ferkl Jan","C",null,"Ferkl","Jan",null,"Ing.","S","1964-01-13",{"$nulls":19},0,0,{"v":0,"d":"0.00%"},"C"]
["Fiala Jan","C",null,"Fiala","Jan",null,null,"S",{"$nulls":20},0,0,{"v":0,"d":"0.00%"},"C"]
["Greš Marek","C",null,"Greš","Marek",null,null,"S","1974-11-06",{"$nulls":19},0,0,{"v":0,"d":"0.00%"},"C"]
["Hejnyš Miroslav","C",2232,"Hejnyš","Miroslav",null,null,"S",{"$nulls":20},0,0,{"v":0,"d":"0.00%"},"C"]
["Henzelín Václav","C",1052,"Henzelín","Václav",null,"Ing.","S","1971-06-17",{"$nulls":19},0,0,{"v":0,"d":"0.00%"},"C"]
["Hodek Oskar","C",20493,"Hodek","Oskar",null,null,"S",{"$nulls":20},0,0,{"v":0,"d":"0.00%"},"C"]
["Joska František","C",20524,"Joska","František",null,null,"S",{"$nulls":20},0,0,{"v":0,"d":"0.00%"},"C"]
["Jurek Martin","C",20167,"Jurek","Martin",null,"Ing.","S",{"$nulls":20},0,0,{"v":0,"d":"0.00%"},"C"]
["Kodeš Ondřej","C",null,"Kodeš","Ondřej",null,null,"S",{"$nulls":20},0,0,{"v":0,"d":"0.00%"},"C"]
["Korman Petr","C",null,"Korman","Petr",null,null,"S",{"$nulls":20},0,0,{"v":0,"d":"0.00%"},"C"]
["Koťátko Jaroslav","C",null,"Koťátko","Jaroslav",null,null,"S","1970-03-13",{"$nulls":19},0,0,{"v":0,"d":"0.00%"},"C"]
["Kratochvíl Vladimír","C",null,"Kratochvíl","Vladimír",null,null,"S","1961-07-10",{"$nulls":19},0,0,{"v":0,"d":"0.00%"},"C"]
["Láska Robert","C",null,"Láska","Robert",null,null,"S",{"$nulls":20},0,0,{"v":0,"d":"0.00%"},"C"]
["Lokvenc Ilja","C",null,"Lokvenc","Ilja",null,null,"S","1962-07-01",{"$nulls":19},0,0,{"v":0,"d":"0.00%"},"C"]
["Luňáček Libor","C",null,"Luňáček","Libor",null,"Ing.","S",{"$nulls":20},0,0,{"v":0,"d":"0.00%"},"C"]
["Musel Jan","C",null,"Musel","Jan",null,null,"S","1970-03-13",{"$nulls":19},0,0,{"v":0,"d":"0.00%"},"C"]
["Nosek Tomáš","C",null,"Nosek","Tomáš",null,null,"S","1981-07-20",{"$nulls":19},0,0,{"v":0,"d":"0.00%"},"C"]
["Nosek Ivo","C",null,"Nosek","Ivo",null,null,"S","1960-10-06",{"$nulls":19},0,0,{"v":0,"d":"0.00%"},"C"]
["Novák Radek","C",null,"Novák","Radek",null,null,"S","1976-04-05",{"$nulls":19},0,0,{"v":0,"d":"0.00%"},"C"]
["Otáhal František","C",null,"Otáhal","František",null,null,"S","1970-03-13",{"$nulls":19},0,0,{"v":0,"d":"0.00%"},"C"]
["Oubram Zdeněk","C",null,"Oubram","Zdeněk",null,null,"S",{"$nulls":20},0,0,{"v":0,"d":"0.00%"},"C"]
["Peluha Antonín","C",null,"Peluha","Antonín",null,null,"S","1964-07-17",{"$nulls":19},0,0,{"v":0,"d":"0.00%"},"C"]
["Peroutka Karel","C",null,"Peroutka","Karel",null,"Ing.","S","1960-03-02",{"$nulls":19},0,0,{"v":0,"d":"0.00%"},"C"]
["Petr Roman","C",null,"Petr","Roman",null,null,"S","1973-06-30",{"$nulls":19},0,0,{"v":0,"d":"0.00%"},"C"]
["Polcar Vojtěch","C",1173,"Polcar","Vojtěch",null,null,"S","1970-03-13",{"$nulls":19},0,0,{"v":0,"d":"0.00%"},"C"]
["Rampas Václav","C",20360,"Rampas","Václav",null,null,"S",{"$nulls":20},0,0,{"v":0,"d":"0.00%"},"C"]
["Rampula Pavel","C",null,"Rampula","Pavel",null,null,"S","1970-03-13",{"$nulls":19},0,0,{"v":0,"d":"0.00%"},"C"]
["Říha Josef","C",null,"Říha","Josef",null,null,"S",{"$nulls":20},0,0,{"v":0,"d":"0.00%"},"C"]
["Sedlák Martin","C",null,"Sedlák","Martin",null,null,"S",{"$nulls":20},0,0,{"$f":"IF(AC260=0,0,AD260/AC260)","v":{"v":0,"d":"0.00%"}},"C"]
[{"$f":"D261&\" \"&E261&F261","v":"Sehnal Martin"},{"$f":"AF261","v":"C"},null,"Sehnal","Martin",null,null,"S","1978-05-04",{"$nulls":19},0,0,{"v":0,"d":"0.00%"},"C"]
["Smolka Přemysl","C",null,"Smolka","Přemysl",null,null,"S","1988-07-03",{"$nulls":19},0,0,{"v":0,"d":"0.00%"},"C"]
["Sobotka Libor","C",null,"Sobotka","Libor",null,"Bc.","S",{"$nulls":20},0,0,{"v":0,"d":"0.00%"},"C"]
["Sochor Jiří","C",null,"Sochor","Jiří",null,"Ing.","S","1965-09-19",{"$nulls":19},0,0,{"v":0,"d":"0.00%"},"C"]
["Suchý Petr","C",null,"Suchý","Petr",null,null,"S",{"$nulls":20},0,0,{"v":0,"d":"0.00%"},"C"]
["Světlík Karel","C",null,"Světlík","Karel",null,null,"S","1975-10-25",{"$nulls":19},0,0,{"v":0,"d":"0.00%"},"C"]
["Škarvada Zdeněk","C",null,"Škarvada","Zdeněk",null,null,"S",{"$nulls":20},0,0,{"v":0,"d":"0.00%"},"C"]
["Šťastný Stanislav","C",null,"Šťastný","Stanislav",null,null,"S",{"$nulls":20},0,0,{"v":0,"d":"0.00%"},"C"]
["Trefný Jan","C",null,"Trefný","Jan",null,null,"S","1981-06-03",{"$nulls":19},0,0,{"v":0,"d":"0.00%"},"C"]
["Ušatý Miroslav","C",null,"Ušatý","Miroslav",null,null,"S","1970-03-13",{"$nulls":19},0,0,{"v":0,"d":"0.00%"},"C"]
["Vágner Lukáš","C",null,"Vágner","Lukáš",null,null,"S","1987-04-10",{"$nulls":19},0,0,{"v":0,"d":"0.00%"},"C"]
["Vejmalka Milan","C",null,"Vejmalka","Milan",null,null,"S",{"$nulls":20},0,0,{"v":0,"d":"0.00%"},"C"]
["Vent Lubomír","C",null,"Vent","Lubomír",null,null,"S",{"$nulls":20},0,0,{"v":0,"d":"0.00%"},"C"]
["Veselý František","C",null,"Veselý","František",null,null,"S",{"$nulls":20},0,0,{"v":0,"d":"0.00%"},"C"]
["Vítek Jiří","C",null,"Vítek","Jiří",null,null,"S",{"$nulls":20},0,0,{"v":0,"d":"0.00%"},"C"]
["Vlk Vladimír","C",null,"Vlk","Vladimír",null,null,"S",{"$nulls":20},0,0,{"v":0,"d":"0.00%"},"C"]
["Vokál Jan","C",null,"Vokál","Jan",null,null,"S","1968-01-25",{"$nulls":19},0,0,{"v":0,"d":"0.00%"},"C"]
["Vrátník Václav","C",null,"Vrátník","Václav",null,null,"S","1963-01-20",{"$nulls":19},0,0,{"v":0,"d":"0.00%"},"C"]
["Zamazal Radek","C",null,"Zamazal","Radek",null,null,"S",{"$nulls":20},0,0,{"v":0,"d":"0.00%"},"C"]
["Uher Jaromír","V",null,"Uher","Jaromír",null,null,"V","1956-09-20",151,170,82,165,null,117,null,174,117,155,null,157,{"$nulls":3},144,null,128,null,1980,1560,{"v":0.7878787878787878,"d":"78.79%"},"V"]
["Otáhal Milan","V",null,"Otáhal","Milan",null,null,"V","1948-03-01",{"$nulls":10},120,{"$nulls":5},117,null,null,310,237,{"v":0.7645161290322581,"d":"76.45%"},"V"]
["Ďurík Jaroslav","V",null,"Ďurík","Jaroslav",null,"Ing.","V",{"$nulls":11},113,{"$nulls":8},150,113,{"v":0.7533333333333333,"d":"75.33%"},"V"]
["Buksa Jan","V",null,"Buksa","Jan",null,null,"V","1955-02-01",{"$nulls":13},133,null,161,{"$nulls":3},400,294,{"v":0.735,"d":"73.50%"},"V"]
["Hnilička Milan","V",null,"Hnilička","Milan",null,null,"V","1950-03-20",{"$nulls":10},122,144,{"$nulls":4},106,null,null,{"$f":" IF(J284,$J$3) +IF(K284,$K$3) +IF(L284,$L$3) +IF(M284,$M$3) +IF(N284,$N$3) +IF(O284,$O$3) +IF(P284,$P$3) +IF(Q284,$Q$3) +IF(R284,$R$3) +IF(S284,$S$3) +IF(T284,$T$3) +IF(U284,$U$3) +IF(V284,$V$3) +IF(W284,$W$3) +IF(X284,$X$3) +IF(Y284,$Y$3) +IF(Z284,$Z$3) +IF(AA284,$AA$3) +IF(AB284,$AB$3)","v":510},{"$f":"J284+K284+L284+M284+N284+O284+P284+Q284+R284+S284+T284+U284+V284+W284+X284+Y284+Z284+AA284+AB284","v":372},{"v":0.7294117647058823,"d":"72.94%"},"V"]
["Streit Vlastislav","V",null,"Streit","Vlastislav",null,null,"V","1950-04-15",{"$nulls":9},151,103,{"$nulls":8},350,254,{"v":0.7257142857142858,"d":"72.57%"},"V"]
["Pražák František","V",null,"Pražák","František",null,null,"V","1953-01-16",{"$nulls":16},115,null,null,160,115,{"v":0.71875,"d":"71.88%"},"V"]
["Vágner Josef","V",null,"Vágner","Josef",null,"Ing.","V","1954-10-25",{"$nulls":9},118,126,{"$nulls":8},350,244,{"v":0.6971428571428572,"d":"69.71%"},"V"]
["Kubík Jindřich","V",null,"Kubík","Jindřich",null,"JUDr.","V","1947-03-07",{"$nulls":16},111,null,null,160,111,{"v":0.69375,"d":"69.38%"},"V"]
["Říha Milan","V",null,"Říha","Milan",null,"Ing","V","1955-10-17",{"$nulls":8},109,{"$nulls":7},111,null,null,320,220,{"v":0.6875,"d":"68.75%"},"V"]
["Návrátil Bedřich","V",null,"Návrátil","Bedřich",null,"Ing.","V",{"$nulls":12},144,null,107,null,145,119,112,null,920,627,{"v":0.6815217391304348,"d":"68.15%"},"V"]
["Vadlejch Josef","V",null,"Vadlejch","Josef",null,null,"V","1955-04-20",{"$nulls":7},147,{"$nulls":3},145,null,110,null,140,102,112,null,1120,756,{"v":0.675,"d":"67.50%"},"V"]
["Brouček Ladislav","V",null,"Brouček","Ladislav",null,"Ing.","V","1948-11-06",{"$nulls":9},136,null,134,{"$nulls":4},106,null,null,560,376,{"v":0.6714285714285714,"d":"67.14%"},"V"]
["Hůda Jan","V",null,"Hůda","Jan",null,"Ing. Ph.D.","V","1952-05-11",{"$nulls":8},130,{"$nulls":4},112,null,null,104,null,null,520,346,{"v":0.6653846153846154,"d":"66.54%"},"V"]
["Tóth Ladislav","V",null,"Tóth","Ladislav",null,"MUDr.","V","1949-03-10",{"$nulls":9},127,97,132,null,118,null,130,106,null,null,1110,710,{"v":0.6396396396396397,"d":"63.96%"},"V"]
["Paur Milan","V",null,"Paur","Milan",null,null,"V","1955-11-01",{"$nulls":15},130,97,null,null,360,227,{"v":0.6305555555555555,"d":"63.06%"},"V"]
["Bašta Václav","V",null,"Bašta","Václav",null,null,"V","1956-10-18",{"$nulls":4},63,{"$nulls":14},100,63,{"v":0.63,"d":"63.00%"},"V"]
["Mandl Friedrich","V",null,"Mandl","Friedrich",null,null,"V",{"$nulls":12},124,{"$nulls":7},200,124,{"v":0.62,"d":"62.00%"},"V"]
["Jelínek Jiří","V",null,"Jelínek","Jiří",null,null,"V","1952-09-23",{"$nulls":10},109,118,{"$nulls":4},88,null,null,510,315,{"v":0.6176470588235294,"d":"61.76%"},"V"]
["Hrouda Jaroslav","V",null,"Hrouda","Jaroslav",null,null,"V","1948-02-07",{"$nulls":13},123,null,124,{"$nulls":3},400,247,{"v":0.6175,"d":"61.75%"},"V"]
["Kubíček Karel","V",null,"Kubíček","Karel",null,null,"V","1951-02-24",{"$nulls":6},82,null,null,128,{"$nulls":3},106,{"$nulls":5},520,316,{"v":0.6076923076923076,"d":"60.77%"},"V"]
["Bastl Václav","V",null,"Bastl","Václav",null,null,"V",{"$nulls":11},90,{"$nulls":8},150,90,{"v":0.6,"d":"60.00%"},"V"]
["Neuvirt Václav","V",null,"Neuvirt","Václav",null,"Ing.","V","1944-07-28",{"$nulls":7},113,null,115,null,123,null,95,null,134,99,99,null,1320,778,{"v":0.5893939393939394,"d":"58.94%"},"V"]
["Rozumek Josef","V",null,"Rozumek","Josef",null,null,"V","1955-01-28",{"$nulls":7},120,null,113,87,{"$nulls":8},550,320,{"v":0.5818181818181818,"d":"58.18%"},"V"]
["Janda Jiří","V",null,"Janda","Jiří",null,"Ing","V","1950-01-13",{"$nulls":13},107,null,118,97,86,null,720,408,{"v":0.5666666666666667,"d":"56.67%"},"V"]
["Semanský Jaromír","V",null,"Semanský","Jaromír",null,null,"V",{"$nulls":6},78,{"$nulls":4},96,null,null,106,null,null,99,null,null,670,379,{"v":0.5656716417910448,"d":"56.57%"},"V"]
["Ryšavý Miroslav","V",null,"Ryšavý","Miroslav",null,null,"V","1953-09-24",{"$nulls":9},113,{"$nulls":3},107,null,118,{"$nulls":3},600,338,{"v":0.5633333333333334,"d":"56.33%"},"V"]
["Řezníček Vilém","V",null,"Řezníček","Vilém",null,"Mgr.","V",{"$nulls":8},105,{"$nulls":3},103,{"$nulls":3},105,null,75,null,760,388,{"v":0.5105263157894737,"d":"51.05%"},"V"]
["Petr František","V",null,"Petr","František",null,"Ing","V","1944-12-19",{"$nulls":9},100,{"$nulls":9},200,100,{"v":0.5,"d":"50.00%"},"V"]
["Sivčák Miroslav","V",null,"Sivčák","Miroslav",null,null,"V",{"$nulls":11},75,{"$nulls":8},150,75,{"v":0.5,"d":"50.00%"},"V"]
["Bejček Václav","V",null,"Bejček","Václav",null,null,"V",{"$nulls":17},79,null,null,160,79,{"v":0.49375,"d":"49.38%"},"V"]
["Lokaj Zdeněk","V",null,"Lokaj","Zdeněk",null,null,"V","1956-07-21",{"$nulls":4},44,{"$nulls":14},100,44,{"v":0.44,"d":"44.00%"},"V"]
["Bicera Štěpán","V",null,"Bicera","Štěpán",null,"Ing.","V","1946-09-17",{"$nulls":19},0,0,{"v":0,"d":"0.00%"},"V"]
["Elšlégr Josef","V",null,"Elšlégr","Josef",null,null,"V","1938-01-29",{"$nulls":19},0,0,{"v":0,"d":"0.00%"},"V"]
["Goll Jan","V",null,"Goll","Jan",null,null,"V","1943-05-07",{"$nulls":19},0,0,{"v":0,"d":"0.00%"},"V"]
["Hanzlík Václav","V",null,"Hanzlík","Václav",null,null,"V","1952-04-30",{"$nulls":19},0,0,{"v":0,"d":"0.00%"},"V"]
["Hauk Pavel","V",null,"Hauk","Pavel",null,null,"V","1950-01-14",{"$nulls":19},0,0,{"v":0,"d":"0.00%"},"V"]
["Havel František","V",null,"Havel","František",null,null,"V","1948-08-09",{"$nulls":19},0,0,{"v":0,"d":"0.00%"},"V"]
["Horvath  Josef","V",null,"Horvath ","Josef",null,null,"V",{"$nulls":20},0,0,{"v":0,"d":"0.00%"},"V"]
["Jánošík Fedor","V",null,"Jánošík","Fedor",null,null,"V","1944-01-01",{"$nulls":19},0,0,{"v":0,"d":"0.00%"},"V"]
["Jirotka Jiří","V",null,"Jirotka","Jiří",null,null,"V",{"$nulls":20},0,0,{"v":0,"d":"0.00%"},"V"]
["Krejza Jan","V",null,"Krejza","Jan",null,"Ing.","V","1955-11-10",{"$nulls":19},0,0,{"v":0,"d":"0.00%"},"V"]
["Kučera Václav","V",null,"Kučera","Václav",null,null,"V","1945-08-04",{"$nulls":19},0,0,{"v":0,"d":"0.00%"},"V"]
["Kučera Josef","V",null,"Kučera","Josef",null,"Ing.","V","1953-12-03",{"$nulls":19},0,0,{"v":0,"d":"0.00%"},"V"]
["Kupka Ondřej","V",null,"Kupka","Ondřej",null,null,"V","1944-09-10",{"$nulls":19},0,0,{"$f":"IF(AC324=0,0,AD324/AC324)","v":{"v":0,"d":"0.00%"}},"V"]
[{"$f":"D325&\" \"&E325&F325","v":"Moravec Jaroslav"},{"$f":"AF325","v":"V"},null,"Moravec","Jaroslav",null,null,"V",{"$nulls":20},0,0,{"v":0,"d":"0.00%"},"V"]
["Mostecký Jiří","V",null,"Mostecký","Jiří",null,"Ing.","V","1956-05-06",{"$nulls":19},0,0,{"v":0,"d":"0.00%"},"V"]
["Mraček Jan","V",null,"Mraček","Jan",null,null,"V","1954-12-19",{"$nulls":19},0,0,{"v":0,"d":"0.00%"},"V"]
["Petr Jan","V",null,"Petr","Jan",null,null,"V",{"$nulls":20},0,0,{"v":0,"d":"0.00%"},"V"]
["Prachař Jan","V",null,"Prachař","Jan",null,null,"V","1952-02-05",{"$nulls":19},0,0,{"v":0,"d":"0.00%"},"V"]
["Průšek Miroslav","V",null,"Průšek","Miroslav",null,null,"V","1955-09-22",{"$nulls":19},0,0,{"v":0,"d":"0.00%"},"V"]
["Půža  Václav","V",null,"Půža ","Václav",null,"Ing.","V",{"$nulls":20},0,0,{"v":0,"d":"0.00%"},"V"]
["Rychnovský Petr","V",null,"Rychnovský","Petr",null,null,"V",{"$nulls":20},0,0,{"v":0,"d":"0.00%"},"V"]
["Staněk Jan","V",null,"Staněk","Jan",null,"Ing","V","1955-11-08",{"$nulls":19},0,0,{"v":0,"d":"0.00%"},"V"]
["Stavinoha Čestmír","V",null,"Stavinoha","Čestmír",null,null,"V",{"$nulls":20},0,0,{"v":0,"d":"0.00%"},"V"]
["Straka Ladislav","V",null,"Straka","Ladislav",null,null,"V","1950-01-08",{"$nulls":19},0,0,{"v":0,"d":"0.00%"},"V"]
["Svozil Stanislav","V",null,"Svozil","Stanislav",null,null,"V","1952-11-22",{"$nulls":19},0,0,{"v":0,"d":"0.00%"},"V"]
["Šimáček  Pavel","V",null,"Šimáček ","Pavel",null,null,"V",{"$nulls":20},0,0,{"v":0,"d":"0.00%"},"V"]
["Šimčík Bohumil","V",null,"Šimčík","Bohumil",null,null,"V","1955-11-03",{"$nulls":19},0,0,{"v":0,"d":"0.00%"},"V"]
["Šprinc Jindřich","V",null,"Šprinc","Jindřich",null,null,"V",{"$nulls":20},0,0,{"v":0,"d":"0.00%"},"V"]
["Vymětal Josef","V",null,"Vymětal","Josef",null,null,"V","1950-05-23",{"$nulls":19},0,0,{"v":0,"d":"0.00%"},"V"]

{"sheet":"Data","index":25,"n_rows":14,"n_cols":6,"rows_kept":14,"merged":[[0,4,0,5]]}
["Druhy závodů :","Počet dnů závodu :",1,null,"Názvy linií / střelišť"]
["SPORTING","1. den :",8,"střelišť","Linie / střeliště č. 1 :","SKEET I"]
["COMPAK SPORTING","2. den :",0,"střelišť","Linie / střeliště č. 2 :","SKEET II"]
["TRAP","3. den :",0,"střelišť","Linie / střeliště č. 3 :","TRAP I"]
["SKEET","4. den :",0,"střelišť","Linie / střeliště č. 4 :","TRAP II"]
[null,"5. den :",0,"střelišť","Linie / střeliště č. 5 :","SKEET I/2"]
[null,"6. den :",0,"střelišť","Linie / střeliště č. 6 :","SKEET II/2"]
[null,"Počet střelišť celkem :",8,null,"Linie / střeliště č. 7 :","TRAP I/2"]
[{"$nulls":4},"Linie / střeliště č. 8 :","TRAP II/2"]
[{"$nulls":4},"Linie / střeliště č. 9 :"]
[{"$nulls":4},"Linie / střeliště č. 10 :"]
[]
[]
[null,"Počet střelců :",{"$f":"120-COUNTIF(Vstup!C9:C128,\"\")","v":38}]