{"text_format":"3","workbook":"xlsx","n_sheets":31,"sheets":["Vstup","List2","StartList","VysledkyDoplneni","List3","ASAT2","VysledkovaListina","Sk1","Sk2","Sk3","Sk4","Sk5","Sk6","Sk7","Sk8","Sk9","Sk10","Sk11","Sk12","Sk13","Sk14","Sk15","Sk16","Sk17","Sk18","Sk19","Sk20","ASAT","Data","PolList","List1"],"not_rendered":{"macros":1,"defined_names":3},"read":"whole","date_system":"1900"}

{"sheet":"Vstup","index":0,"n_rows":128,"n_cols":6,"rows_kept":128,"merged":[[0,0,0,4],[1,0,2,1],[1,2,1,5],[2,2,2,5],[3,0,3,1],[3,2,3,5],[4,0,4,1],[4,2,4,5],[6,0,7,0],[6,1,7,1],[6,2,7,2],[6,3,6,4],[6,5,7,8],[8,0,13,0],[14,0,19,0],[20,0,25,0],[26,0,31,0],[32,0,37,0],[38,0,43,0],[44,0,49,0],[50,0,55,0],[56,0,61,0],[62,0,67,0],[68,0,73,0],[74,0,79,0],[80,0,85,0],[86,0,91,0],[92,0,97,0],[98,0,103,0],[104,0,109,0],[110,0,115,0],[116,0,121,0],[122,0,127,0]]}
["STARTOVNÍ LISTINA"]
["Název závodu :",null,{"$f":"IF(Data!B16<>\"\",Data!B16,\"\")","v":"Josefovský brokový trojboj"}]
[null,null,{"$f":"IF(Data!B17<>\"\",Data!B17&\" TERČŮ\",\"\")","v":"60 TERČŮ"}]
["Druh závodu :",null,{"$f":"IF(Data!B19<>\"\",Data!B19,\"\")","v":"SPORTING"}]
["Datum konání :",null,{"$f":"IF(Data!B20<>\"\",Data!B20,\"\")","v":"20.03.2022"}]
[null,null,"Informace ASAT kategorie:","http://www.asat.cz/zarazeni-kategorii.html"]
["Skupina číslo","Start. číslo","Příjmení, jméno","Kategorie",null,{"$f":"\"Počet  střelců :   \"&Data!B14","v":"Počet  střelců :   48"}]
[{"$nulls":3},"ASAT","Ručně"]
[1,1,"Štenglová Michaela",{"$f":"IF(E9<>\"\",E9,VLOOKUP(C9,ASAT2!$A$2:$G$1000,7,0))","v":"S"},"S"]
[null,2,"Vaněk Matěj",{"$f":"IF(E10<>\"\",E10,VLOOKUP(C10,ASAT2!$A$2:$G$1000,7,0))","v":"S"},"S"]
[null,3,"Veltruský Jiří",{"$f":"IF(E11<>\"\",E11,VLOOKUP(C11,ASAT2!$A$2:$G$1000,7,0))","v":"S"},"S"]
[null,4,"Černý Bohuslav",{"$f":"IF(E12<>\"\",E12,VLOOKUP(C12,ASAT2!$A$2:$G$1000,7,0))","v":"S"},"S"]
[null,5,"Šindelář Jiří st.",{"$f":"IF(E13<>\"\",E13,VLOOKUP(C13,ASAT2!$A$2:$G$1000,7,0))","v":"S"},"S"]
[null,6,"Mařík Josef",{"$f":"IF(E14<>\"\",E14,VLOOKUP(C14,ASAT2!$A$2:$G$1000,7,0))","v":"S"},"S"]
[2,7,"Lízalová Veronika",{"$f":"IF(E15<>\"\",E15,VLOOKUP(C15,ASAT2!$A$2:$G$1000,7,0))","v":"S"},"S"]
[null,8,"Lízal Miroslav ml.",{"$f":"IF(E16<>\"\",E16,VLOOKUP(C16,ASAT2!$A$2:$G$1000,7,0))","v":"S"},"S"]
[null,9,"Kondr Václav",{"$f":"IF(E17<>\"\",E17,VLOOKUP(C17,ASAT2!$A$2:$G$1000,7,0))","v":"S"},"S"]
[null,10,"Frenkl Jiří",{"$f":"IF(E18<>\"\",E18,VLOOKUP(C18,ASAT2!$A$2:$G$1000,7,0))","v":"S"},"S"]
[null,11,"Adámek Bohuslav",{"$f":"IF(E19<>\"\",E19,VLOOKUP(C19,ASAT2!$A$2:$G$1000,7,0))","v":"S"},"S"]
[null,12,"Urban Josef",{"$f":"IF(E20<>\"\",E20,VLOOKUP(C20,ASAT2!$A$2:$G$1000,7,0))","v":"S"},"S"]
[3,13,"Trepka Jiří",{"$f":"IF(E21<>\"\",E21,VLOOKUP(C21,ASAT2!$A$2:$G$1000,7,0))","v":"S"},"S"]
[null,14,"Dusík Vladimír",{"$f":"IF(E22<>\"\",E22,VLOOKUP(C22,ASAT2!$A$2:$G$1000,7,0))","v":"S"},"S"]
[null,15,"Kotrbáček Václav",{"$f":"IF(E23<>\"\",E23,VLOOKUP(C23,ASAT2!$A$2:$G$1000,7,0))","v":"S"},"S"]
[null,16,"Doležal Jaroslav",{"$f":"IF(E24<>\"\",E24,VLOOKUP(C24,ASAT2!$A$2:$G$1000,7,0))","v":"S"},"S"]
[null,17,"Křepelka Jan",{"$f":"IF(E25<>\"\",E25,VLOOKUP(C25,ASAT2!$A$2:$G$1000,7,0))","v":"S"},"S"]
[null,18,"Bém Josef",{"$f":"IF(E26<>\"\",E26,VLOOKUP(C26,ASAT2!$A$2:$G$1000,7,0))","v":"S"},"S"]
[4,19,"Čechura Petr",{"$f":"IF(E27<>\"\",E27,VLOOKUP(C27,ASAT2!$A$2:$G$1000,7,0))","v":"S"},"S"]
[null,20,"Čechura Pavel",{"$f":"IF(E28<>\"\",E28,VLOOKUP(C28,ASAT2!$A$2:$G$1000,7,0))","v":"S"},"S"]
[null,21,"Sedláček Jiří",{"$f":"IF(E29<>\"\",E29,VLOOKUP(C29,ASAT2!$A$2:$G$1000,7,0))","v":"S"},"S"]
[null,22,"Hájek Petr",{"$f":"IF(E30<>\"\",E30,VLOOKUP(C30,ASAT2!$A$2:$G$1000,7,0))","v":"S"},"S"]
[null,23,"Volf Jiří",{"$f":"IF(E31<>\"\",E31,VLOOKUP(C31,ASAT2!$A$2:$G$1000,7,0))","v":"S"},"S"]
[null,24,"Navara Josef",{"$f":"IF(E32<>\"\",E32,VLOOKUP(C32,ASAT2!$A$2:$G$1000,7,0))","v":"S"},"S"]
[5,25,"Šindelář Jan",{"$f":"IF(E33<>\"\",E33,VLOOKUP(C33,ASAT2!$A$2:$G$1000,7,0))","v":"S"},"S"]
[null,26,"Jira Tomáš",{"$f":"IF(E34<>\"\",E34,VLOOKUP(C34,ASAT2!$A$2:$G$1000,7,0))","v":"S"},"S"]
[null,27,"Gorschenek Martin",{"$f":"IF(E35<>\"\",E35,VLOOKUP(C35,ASAT2!$A$2:$G$1000,7,0))","v":"S"},"S"]
[null,28,"Leihs Gustav",{"$f":"IF(E36<>\"\",E36,VLOOKUP(C36,ASAT2!$A$2:$G$1000,7,0))","v":"S"},"S"]
[null,29,"Škrýba Petr",{"$f":"IF(E37<>\"\",E37,VLOOKUP(C37,ASAT2!$A$2:$G$1000,7,0))","v":"S"},"S"]
[null,30,"Růžek Luboš",{"$f":"IF(E38<>\"\",E38,VLOOKUP(C38,ASAT2!$A$2:$G$1000,7,0))","v":"S"},"S"]
[6,31,"Albl Václav",{"$f":"IF(E39<>\"\",E39,VLOOKUP(C39,ASAT2!$A$2:$G$1000,7,0))","v":"S"},"S"]
[null,32,"Noháček Jaroslav",{"$f":"IF(E40<>\"\",E40,VLOOKUP(C40,ASAT2!$A$2:$G$1000,7,0))","v":"S"},"S"]
[null,33,"Noháček Pavel",{"$f":"IF(E41<>\"\",E41,VLOOKUP(C41,ASAT2!$A$2:$G$1000,7,0))","v":"S"},"S"]
[null,34,"Mach Josef",{"$f":"IF(E42<>\"\",E42,VLOOKUP(C42,ASAT2!$A$2:$G$1000,7,0))","v":"S"},"S"]
[null,35,"Lusk Stanislav",{"$f":"IF(E43<>\"\",E43,VLOOKUP(C43,ASAT2!$A$2:$G$1000,7,0))","v":"S"},"S"]
[null,36,"Mach Jan",{"$f":"IF(E44<>\"\",E44,VLOOKUP(C44,ASAT2!$A$2:$G$1000,7,0))","v":"S"},"S"]
[7,37,"Hromada Jaroslav",{"$f":"IF(E45<>\"\",E45,VLOOKUP(C45,ASAT2!$A$2:$G$1000,7,0))","v":"S"},"S"]
[null,38,"Racek Petr",{"$f":"IF(E46<>\"\",E46,VLOOKUP(C46,ASAT2!$A$2:$G$1000,7,0))","v":"S"},"S"]
[null,39,"Říha Jiří",{"$f":"IF(E47<>\"\",E47,VLOOKUP(C47,ASAT2!$A$2:$G$1000,7,0))","v":"S"},"S"]
[null,40,"Kočí Radek",{"$f":"IF(E48<>\"\",E48,VLOOKUP(C48,ASAT2!$A$2:$G$1000,7,0))","v":"S"},"S"]
[null,41,"Pechan Josef",{"$f":"IF(E49<>\"\",E49,VLOOKUP(C49,ASAT2!$A$2:$G$1000,7,0))","v":"S"},"S"]
[null,42,"Kučera Václav",{"$f":"IF(E50<>\"\",E50,VLOOKUP(C50,ASAT2!$A$2:$G$1000,7,0))","v":"S"},"S"]
[8,43,"Štengl Jiří",{"$f":"IF(E51<>\"\",E51,VLOOKUP(C51,ASAT2!$A$2:$G$1000,7,0))","v":"S"},"S"]
[null,44,"Kubík Jindřich",{"$f":"IF(E52<>\"\",E52,VLOOKUP(C52,ASAT2!$A$2:$G$1000,7,0))","v":"S"},"S"]
[null,45,"Vodička Miroslav",{"$f":"IF(E53<>\"\",E53,VLOOKUP(C53,ASAT2!$A$2:$G$1000,7,0))","v":"S"},"S"]
[null,46,"Šindelář Milan",{"$f":"IF(E54<>\"\",E54,VLOOKUP(C54,ASAT2!$A$2:$G$1000,7,0))","v":"S"},"S"]
[null,47,"Förster Karel",{"$f":"IF(E55<>\"\",E55,VLOOKUP(C55,ASAT2!$A$2:$G$1000,7,0))","v":"S"},"S"]
[null,48,"Ulrych Jiří",{"$f":"IF(E56<>\"\",E56,VLOOKUP(C56,ASAT2!$A$2:$G$1000,7,0))","v":"S"},"S"]
[9,49,null,{"$f":"IF(E57<>\"\",E57,VLOOKUP(C57,ASAT2!$A$2:$G$1000,7,0))","v":"S"},"S"]
[null,50,null,{"$f":"IF(E58<>\"\",E58,VLOOKUP(C58,ASAT2!$A$2:$G$1000,7,0))","v":"S"},"S"]
[null,51,null,{"$f":"IF(E59<>\"\",E59,VLOOKUP(C59,ASAT2!$A$2:$G$1000,7,0))","v":"S"},"S"]
[null,52,null,{"$f":"IF(E60<>\"\",E60,VLOOKUP(C60,ASAT2!$A$2:$G$1000,7,0))","v":"S"},"S"]
[null,53,null,{"$f":"IF(E61<>\"\",E61,VLOOKUP(C61,ASAT2!$A$2:$G$1000,7,0))","v":"S"},"S"]
[null,54,null,{"$f":"IF(E62<>\"\",E62,VLOOKUP(C62,ASAT2!$A$2:$G$1000,7,0))","v":"S"},"S"]
[10,55,null,{"$f":"IF(E63<>\"\",E63,VLOOKUP(C63,ASAT2!$A$2:$G$1000,7,0))","v":"S"},"S"]
[null,56,null,{"$f":"IF(E64<>\"\",E64,VLOOKUP(C64,ASAT2!$A$2:$G$1000,7,0))","v":"S"},"S"]
[null,57,null,{"$f":"IF(E65<>\"\",E65,VLOOKUP(C65,ASAT2!$A$2:$G$1000,7,0))","v":"S"},"S"]
[null,58,null,{"$f":"IF(E66<>\"\",E66,VLOOKUP(C66,ASAT2!$A$2:$G$1000,7,0))","v":"S"},"S"]
[null,59,null,{"$f":"IF(E67<>\"\",E67,VLOOKUP(C67,ASAT2!$A$2:$G$1000,7,0))","v":"S"},"S"]
[null,60,null,{"$f":"IF(E68<>\"\",E68,VLOOKUP(C68,ASAT2!$A$2:$G$1000,7,0))","v":"S"},"S"]
[11,null,null,{"$f":"IF(E69<>\"\",E69,VLOOKUP(C69,ASAT2!$A$2:$G$1000,7,0))","v":"S"},"S"]
[{"$nulls":3},{"$f":"IF(E70<>\"\",E70,VLOOKUP(C70,ASAT2!$A$2:$G$1000,7,0))","v":"S"},"S"]
[{"$nulls":3},{"$f":"IF(E71<>\"\",E71,VLOOKUP(C71,ASAT2!$A$2:$G$1000,7,0))","v":"S"},"S"]
[{"$nulls":3},{"$f":"IF(E72<>\"\",E72,VLOOKUP(C72,ASAT2!$A$2:$G$1000,7,0))","v":"S"},"S"]
[{"$nulls":3},{"$f":"IF(E73<>\"\",E73,VLOOKUP(C73,ASAT2!$A$2:$G$1000,7,0))","v":"S"},"S"]
[{"$nulls":3},{"$f":"IF(E74<>\"\",E74,VLOOKUP(C74,ASAT2!$A$2:$G$1000,7,0))","v":"S"},"S"]
[12,67,null,{"$f":"IF(E75<>\"\",E75,VLOOKUP(C75,ASAT2!$A$2:$G$1000,7,0))","v":{"$error":"#N/A"}}]
[null,68,null,{"$f":"IF(E76<>\"\",E76,VLOOKUP(C76,ASAT2!$A$2:$G$1000,7,0))","v":{"$error":"#N/A"}}]
[null,69,null,{"$f":"IF(E77<>\"\",E77,VLOOKUP(C77,ASAT2!$A$2:$G$1000,7,0))","v":{"$error":"#N/A"}}]
[null,70,null,{"$f":"IF(E78<>\"\",E78,VLOOKUP(C78,ASAT2!$A$2:$G$1000,7,0))","v":{"$error":"#N/A"}}]
[null,71,null,{"$f":"IF(E79<>\"\",E79,VLOOKUP(C79,ASAT2!$A$2:$G$1000,7,0))","v":{"$error":"#N/A"}}]
[null,72,null,{"$f":"IF(E80<>\"\",E80,VLOOKUP(C80,ASAT2!$A$2:$G$1000,7,0))","v":{"$error":"#N/A"}}]
[13,73,null,{"$f":"IF(E81<>\"\",E81,VLOOKUP(C81,ASAT2!$A$2:$G$1000,7,0))","v":{"$error":"#N/A"}}]
[null,74,null,{"$f":"IF(E82<>\"\",E82,VLOOKUP(C82,ASAT2!$A$2:$G$1000,7,0))","v":{"$error":"#N/A"}}]
[null,75,null,{"$f":"IF(E83<>\"\",E83,VLOOKUP(C83,ASAT2!$A$2:$G$1000,7,0))","v":{"$error":"#N/A"}}]
[null,76,null,{"$f":"IF(E84<>\"\",E84,VLOOKUP(C84,ASAT2!$A$2:$G$1000,7,0))","v":{"$error":"#N/A"}}]
[null,77,null,{"$f":"IF(E85<>\"\",E85,VLOOKUP(C85,ASAT2!$A$2:$G$1000,7,0))","v":{"$error":"#N/A"}}]
[null,78,null,{"$f":"IF(E86<>\"\",E86,VLOOKUP(C86,ASAT2!$A$2:$G$1000,7,0))","v":{"$error":"#N/A"}}]
[14,79,null,{"$f":"IF(E87<>\"\",E87,VLOOKUP(C87,ASAT2!$A$2:$G$1000,7,0))","v":{"$error":"#N/A"}}]
[null,80,null,{"$f":"IF(E88<>\"\",E88,VLOOKUP(C88,ASAT2!$A$2:$G$1000,7,0))","v":{"$error":"#N/A"}}]
[null,81,null,{"$f":"IF(E89<>\"\",E89,VLOOKUP(C89,ASAT2!$A$2:$G$1000,7,0))","v":{"$error":"#N/A"}}]
[null,82,null,{"$f":"IF(E90<>\"\",E90,VLOOKUP(C90,ASAT2!$A$2:$G$1000,7,0))","v":{"$error":"#N/A"}}]
[null,83,null,{"$f":"IF(E91<>\"\",E91,VLOOKUP(C91,ASAT2!$A$2:$G$1000,7,0))","v":{"$error":"#N/A"}}]
[null,84,null,{"$f":"IF(E92<>\"\",E92,VLOOKUP(C92,ASAT2!$A$2:$G$1000,7,0))","v":{"$error":"#N/A"}}]
[15,85,null,{"$f":"IF(E93<>\"\",E93,VLOOKUP(C93,ASAT2!$A$2:$G$1000,7,0))","v":{"$error":"#N/A"}}]
[null,86,null,{"$f":"IF(E94<>\"\",E94,VLOOKUP(C94,ASAT2!$A$2:$G$1000,7,0))","v":{"$error":"#N/A"}}]
[null,87,null,{"$f":"IF(E95<>\"\",E95,VLOOKUP(C95,ASAT2!$A$2:$G$1000,7,0))","v":{"$error":"#N/A"}}]
[null,88,null,{"$f":"IF(E96<>\"\",E96,VLOOKUP(C96,ASAT2!$A$2:$G$1000,7,0))","v":{"$error":"#N/A"}}]
[null,89,null,{"$f":"IF(E97<>\"\",E97,VLOOKUP(C97,ASAT2!$A$2:$G$1000,7,0))","v":{"$error":"#N/A"}}]
[null,90,null,{"$f":"IF(E98<>\"\",E98,VLOOKUP(C98,ASAT2!$A$2:$G$1000,7,0))","v":{"$error":"#N/A"}}]
[16,91,null,{"$f":"IF(E99<>\"\",E99,VLOOKUP(C99,ASAT2!$A$2:$G$1000,7,0))","v":{"$error":"#N/A"}}]
[null,92,null,{"$f":"IF(E100<>\"\",E100,VLOOKUP(C100,ASAT2!$A$2:$G$1000,7,0))","v":{"$error":"#N/A"}}]
[null,93,null,{"$f":"IF(E101<>\"\",E101,VLOOKUP(C101,ASAT2!$A$2:$G$1000,7,0))","v":{"$error":"#N/A"}}]
[null,94,null,{"$f":"IF(E102<>\"\",E102,VLOOKUP(C102,ASAT2!$A$2:$G$1000,7,0))","v":{"$error":"#N/A"}}]
[null,95,null,{"$f":"IF(E103<>\"\",E103,VLOOKUP(C103,ASAT2!$A$2:$G$1000,7,0))","v":{"$error":"#N/A"}}]
[null,96,null,{"$f":"IF(E104<>\"\",E104,VLOOKUP(C104,ASAT2!$A$2:$G$1000,7,0))","v":{"$error":"#N/A"}}]
[17,97,null,{"$f":"IF(E105<>\"\",E105,VLOOKUP(C105,ASAT2!$A$2:$G$1000,7,0))","v":{"$error":"#N/A"}}]
[null,98,null,{"$f":"IF(E106<>\"\",E106,VLOOKUP(C106,ASAT2!$A$2:$G$1000,7,0))","v":{"$error":"#N/A"}}]
[null,99,null,{"$f":"IF(E107<>\"\",E107,VLOOKUP(C107,ASAT2!$A$2:$G$1000,7,0))","v":{"$error":"#N/A"}}]
[null,100,null,{"$f":"IF(E108<>\"\",E108,VLOOKUP(C108,ASAT2!$A$2:$G$1000,7,0))","v":{"$error":"#N/A"}}]
[null,101,null,{"$f":"IF(E109<>\"\",E109,VLOOKUP(C109,ASAT2!$A$2:$G$1000,7,0))","v":{"$error":"#N/A"}}]
[null,102,null,{"$f":"IF(E110<>\"\",E110,VLOOKUP(C110,ASAT2!$A$2:$G$1000,7,0))","v":{"$error":"#N/A"}}]
[18,103,null,{"$f":"IF(E111<>\"\",E111,VLOOKUP(C111,ASAT2!$A$2:$G$1000,7,0))","v":{"$error":"#N/A"}}]
[null,104,null,{"$f":"IF(E112<>\"\",E112,VLOOKUP(C112,ASAT2!$A$2:$G$1000,7,0))","v":{"$error":"#N/A"}}]
[null,105,null,{"$f":"IF(E113<>\"\",E113,VLOOKUP(C113,ASAT2!$A$2:$G$1000,7,0))","v":{"$error":"#N/A"}}]
[null,106,null,{"$f":"IF(E114<>\"\",E114,VLOOKUP(C114,ASAT2!$A$2:$G$1000,7,0))","v":{"$error":"#N/A"}}]
[null,107,null,{"$f":"IF(E115<>\"\",E115,VLOOKUP(C115,ASAT2!$A$2:$G$1000,7,0))","v":{"$error":"#N/A"}}]
[null,108,null,{"$f":"IF(E116<>\"\",E116,VLOOKUP(C116,ASAT2!$A$2:$G$1000,7,0))","v":{"$error":"#N/A"}}]
[19,109,null,{"$f":"IF(E117<>\"\",E117,VLOOKUP(C117,ASAT2!$A$2:$G$1000,7,0))","v":{"$error":"#N/A"}}]
[null,110,null,{"$f":"IF(E118<>\"\",E118,VLOOKUP(C118,ASAT2!$A$2:$G$1000,7,0))","v":{"$error":"#N/A"}}]
[null,111,null,{"$f":"IF(E119<>\"\",E119,VLOOKUP(C119,ASAT2!$A$2:$G$1000,7,0))","v":{"$error":"#N/A"}}]
[null,112,null,{"$f":"IF(E120<>\"\",E120,VLOOKUP(C120,ASAT2!$A$2:$G$1000,7,0))","v":{"$error":"#N/A"}}]
[null,113,null,{"$f":"IF(E121<>\"\",E121,VLOOKUP(C121,ASAT2!$A$2:$G$1000,7,0))","v":{"$error":"#N/A"}}]
[null,114,null,{"$f":"IF(E122<>\"\",E122,VLOOKUP(C122,ASAT2!$A$2:$G$1000,7,0))","v":{"$error":"#N/A"}}]
[20,115,null,{"$f":"IF(E123<>\"\",E123,VLOOKUP(C123,ASAT2!$A$2:$G$1000,7,0))","v":{"$error":"#N/A"}}]
[null,116,null,{"$f":"IF(E124<>\"\",E124,VLOOKUP(C124,ASAT2!$A$2:$G$1000,7,0))","v":{"$error":"#N/A"}}]
[null,117,null,{"$f":"IF(E125<>\"\",E125,VLOOKUP(C125,ASAT2!$A$2:$G$1000,7,0))","v":{"$error":"#N/A"}}]
[null,118,null,{"$f":"IF(E126<>\"\",E126,VLOOKUP(C126,ASAT2!$A$2:$G$1000,7,0))","v":{"$error":"#N/A"}}]
[null,119,null,{"$f":"IF(E127<>\"\",E127,VLOOKUP(C127,ASAT2!$A$2:$G$1000,7,0))","v":{"$error":"#N/A"}}]
[null,120,null,{"$f":"IF(E128<>\"\",E128,VLOOKUP(C128,ASAT2!$A$2:$G$1000,7,0))","v":{"$error":"#N/A"}}]

{"sheet":"List2","index":1,"n_rows":0,"n_cols":0,"rows_kept":0,"hidden":true}

{"sheet":"StartList","index":2,"n_rows":65,"n_cols":9,"rows_kept":65,"hidden":true,"merged":[[0,0,0,8],[1,0,1,8],[3,0,4,0],[3,1,4,1],[3,2,4,2],[3,3,4,3],[3,5,4,5],[3,6,4,6],[3,7,4,7],[3,8,4,8],[5,0,10,0],[5,5,10,5],[11,0,16,0],[11,5,16,5],[17,0,22,0],[17,5,22,5],[23,0,28,0],[23,5,28,5],[29,0,34,0],[29,5,34,5],[35,0,40,0],[35,5,40,5],[41,0,46,0],[41,5,46,5],[47,0,52,0],[47,5,52,5],[53,0,58,0],[53,5,58,5],[59,0,64,0],[59,5,64,5]]}
[{"$f":"Vstup!$C$2&IF(Vstup!$C$3<>\"\",\", \"&Vstup!$C$3,\"\")&IF(Vstup!C5<>\"\",\", \"&Vstup!C5,\"\")","v":"Josefovský brokový trojboj, 60 TERČŮ, 20.03.2022"}]
["STARTOVNÍ LISTINA"]
[]
["Skupina číslo","Start. číslo","Příjmení, jméno","Kat.",null,"Skupina číslo","Start. číslo","Příjmení, jméno","Kat."]
[]
[1,1,{"$f":"IF(Vstup!C9<>\"\",Vstup!C9,\"\")","v":"Štenglová Michaela"},{"$f":"IF(Vstup!C9<>\"\",Vstup!D9,\"\")","v":"S"},null,11,61,{"$f":"IF(Vstup!C69<>\"\",Vstup!C69,\"\")","v":""},{"$f":"IF(Vstup!C69<>\"\",Vstup!D69,\"\")","v":""}]
[null,2,{"$f":"IF(Vstup!C10<>\"\",Vstup!C10,\"\")","v":"Vaněk Matěj"},{"$f":"IF(Vstup!C10<>\"\",Vstup!D10,\"\")","v":"S"},null,null,62,{"$f":"IF(Vstup!C70<>\"\",Vstup!C70,\"\")","v":""},{"$f":"IF(Vstup!C70<>\"\",Vstup!D70,\"\")","v":""}]
[null,3,{"$f":"IF(Vstup!C11<>\"\",Vstup!C11,\"\")","v":"Veltruský Jiří"},{"$f":"IF(Vstup!C11<>\"\",Vstup!D11,\"\")","v":"S"},null,null,63,{"$f":"IF(Vstup!C71<>\"\",Vstup!C71,\"\")","v":""},{"$f":"IF(Vstup!C71<>\"\",Vstup!D71,\"\")","v":""}]
[null,4,{"$f":"IF(Vstup!C12<>\"\",Vstup!C12,\"\")","v":"Černý Bohuslav"},{"$f":"IF(Vstup!C12<>\"\",Vstup!D12,\"\")","v":"S"},null,null,64,{"$f":"IF(Vstup!C72<>\"\",Vstup!C72,\"\")","v":""},{"$f":"IF(Vstup!C72<>\"\",Vstup!D72,\"\")","v":""}]
[null,5,{"$f":"IF(Vstup!C13<>\"\",Vstup!C13,\"\")","v":"Šindelář Jiří st."},{"$f":"IF(Vstup!C13<>\"\",Vstup!D13,\"\")","v":"S"},null,null,65,{"$f":"IF(Vstup!C73<>\"\",Vstup!C73,\"\")","v":""},{"$f":"IF(Vstup!C73<>\"\",Vstup!D73,\"\")","v":""}]
[null,6,{"$f":"IF(Vstup!C14<>\"\",Vstup!C14,\"\")","v":"Mařík Josef"},{"$f":"IF(Vstup!C14<>\"\",Vstup!D14,\"\")","v":"S"},null,null,66,{"$f":"IF(Vstup!C74<>\"\",Vstup!C74,\"\")","v":""},{"$f":"IF(Vstup!C74<>\"\",Vstup!D74,\"\")","v":""}]
[2,7,{"$f":"IF(Vstup!C15<>\"\",Vstup!C15,\"\")","v":"Lízalová Veronika"},{"$f":"IF(Vstup!C15<>\"\",Vstup!D15,\"\")","v":"S"},null,12,67,{"$f":"IF(Vstup!C75<>\"\",Vstup!C75,\"\")","v":""},{"$f":"IF(Vstup!C75<>\"\",Vstup!D75,\"\")","v":""}]
[null,8,{"$f":"IF(Vstup!C16<>\"\",Vstup!C16,\"\")","v":"Lízal Miroslav ml."},{"$f":"IF(Vstup!C16<>\"\",Vstup!D16,\"\")","v":"S"},null,null,68,{"$f":"IF(Vstup!C76<>\"\",Vstup!C76,\"\")","v":""},{"$f":"IF(Vstup!C76<>\"\",Vstup!D76,\"\")","v":""}]
[null,9,{"$f":"IF(Vstup!C17<>\"\",Vstup!C17,\"\")","v":"Kondr Václav"},{"$f":"IF(Vstup!C17<>\"\",Vstup!D17,\"\")","v":"S"},null,null,69,{"$f":"IF(Vstup!C77<>\"\",Vstup!C77,\"\")","v":""},{"$f":"IF(Vstup!C77<>\"\",Vstup!D77,\"\")","v":""}]
[null,10,{"$f":"IF(Vstup!C18<>\"\",Vstup!C18,\"\")","v":"Frenkl Jiří"},{"$f":"IF(Vstup!C18<>\"\",Vstup!D18,\"\")","v":"S"},null,null,70,{"$f":"IF(Vstup!C78<>\"\",Vstup!C78,\"\")","v":""},{"$f":"IF(Vstup!C78<>\"\",Vstup!D78,\"\")","v":""}]
[null,11,{"$f":"IF(Vstup!C19<>\"\",Vstup!C19,\"\")","v":"Adámek Bohuslav"},{"$f":"IF(Vstup!C19<>\"\",Vstup!D19,\"\")","v":"S"},null,null,71,{"$f":"IF(Vstup!C79<>\"\",Vstup!C79,\"\")","v":""},{"$f":"IF(Vstup!C79<>\"\",Vstup!D79,\"\")","v":""}]
[null,12,{"$f":"IF(Vstup!C20<>\"\",Vstup!C20,\"\")","v":"Urban Josef"},{"$f":"IF(Vstup!C20<>\"\",Vstup!D20,\"\")","v":"S"},null,null,72,{"$f":"IF(Vstup!C80<>\"\",Vstup!C80,\"\")","v":""},{"$f":"IF(Vstup!C80<>\"\",Vstup!D80,\"\")","v":""}]
[3,13,{"$f":"IF(Vstup!C21<>\"\",Vstup!C21,\"\")","v":"Trepka Jiří"},{"$f":"IF(Vstup!C21<>\"\",Vstup!D21,\"\")","v":"S"},null,13,73,{"$f":"IF(Vstup!C81<>\"\",Vstup!C81,\"\")","v":""},{"$f":"IF(Vstup!C81<>\"\",Vstup!D81,\"\")","v":""}]
[null,14,{"$f":"IF(Vstup!C22<>\"\",Vstup!C22,\"\")","v":"Dusík Vladimír"},{"$f":"IF(Vstup!C22<>\"\",Vstup!D22,\"\")","v":"S"},null,null,74,{"$f":"IF(Vstup!C82<>\"\",Vstup!C82,\"\")","v":""},{"$f":"IF(Vstup!C82<>\"\",Vstup!D82,\"\")","v":""}]
[null,15,{"$f":"IF(Vstup!C23<>\"\",Vstup!C23,\"\")","v":"Kotrbáček Václav"},{"$f":"IF(Vstup!C23<>\"\",Vstup!D23,\"\")","v":"S"},null,null,75,{"$f":"IF(Vstup!C83<>\"\",Vstup!C83,\"\")","v":""},{"$f":"IF(Vstup!C83<>\"\",Vstup!D83,\"\")","v":""}]
[null,16,{"$f":"IF(Vstup!C24<>\"\",Vstup!C24,\"\")","v":"Doležal Jaroslav"},{"$f":"IF(Vstup!C24<>\"\",Vstup!D24,\"\")","v":"S"},null,null,76,{"$f":"IF(Vstup!C84<>\"\",Vstup!C84,\"\")","v":""},{"$f":"IF(Vstup!C84<>\"\",Vstup!D84,\"\")","v":""}]
[null,17,{"$f":"IF(Vstup!C25<>\"\",Vstup!C25,\"\")","v":"Křepelka Jan"},{"$f":"IF(Vstup!C25<>\"\",Vstup!D25,\"\")","v":"S"},null,null,77,{"$f":"IF(Vstup!C85<>\"\",Vstup!C85,\"\")","v":""},{"$f":"IF(Vstup!C85<>\"\",Vstup!D85,\"\")","v":""}]
[null,18,{"$f":"IF(Vstup!C26<>\"\",Vstup!C26,\"\")","v":"Bém Josef"},{"$f":"IF(Vstup!C26<>\"\",Vstup!D26,\"\")","v":"S"},null,null,78,{"$f":"IF(Vstup!C86<>\"\",Vstup!C86,\"\")","v":""},{"$f":"IF(Vstup!C86<>\"\",Vstup!D86,\"\")","v":""}]
[4,19,{"$f":"IF(Vstup!C27<>\"\",Vstup!C27,\"\")","v":"Čechura Petr"},{"$f":"IF(Vstup!C27<>\"\",Vstup!D27,\"\")","v":"S"},null,14,79,{"$f":"IF(Vstup!C87<>\"\",Vstup!C87,\"\")","v":""},{"$f":"IF(Vstup!C87<>\"\",Vstup!D87,\"\")","v":""}]
[null,20,{"$f":"IF(Vstup!C28<>\"\",Vstup!C28,\"\")","v":"Čechura Pavel"},{"$f":"IF(Vstup!C28<>\"\",Vstup!D28,\"\")","v":"S"},null,null,80,{"$f":"IF(Vstup!C88<>\"\",Vstup!C88,\"\")","v":""},{"$f":"IF(Vstup!C88<>\"\",Vstup!D88,\"\")","v":""}]
[null,21,{"$f":"IF(Vstup!C29<>\"\",Vstup!C29,\"\")","v":"Sedláček Jiří"},{"$f":"IF(Vstup!C29<>\"\",Vstup!D29,\"\")","v":"S"},null,null,81,{"$f":"IF(Vstup!C89<>\"\",Vstup!C89,\"\")","v":""},{"$f":"IF(Vstup!C89<>\"\",Vstup!D89,\"\")","v":""}]
[null,22,{"$f":"IF(Vstup!C30<>\"\",Vstup!C30,\"\")","v":"Hájek Petr"},{"$f":"IF(Vstup!C30<>\"\",Vstup!D30,\"\")","v":"S"},null,null,82,{"$f":"IF(Vstup!C90<>\"\",Vstup!C90,\"\")","v":""},{"$f":"IF(Vstup!C90<>\"\",Vstup!D90,\"\")","v":""}]
[null,23,{"$f":"IF(Vstup!C31<>\"\",Vstup!C31,\"\")","v":"Volf Jiří"},{"$f":"IF(Vstup!C31<>\"\",Vstup!D31,\"\")","v":"S"},null,null,83,{"$f":"IF(Vstup!C91<>\"\",Vstup!C91,\"\")","v":""},{"$f":"IF(Vstup!C91<>\"\",Vstup!D91,\"\")","v":""}]
[null,24,{"$f":"IF(Vstup!C32<>\"\",Vstup!C32,\"\")","v":"Navara Josef"},{"$f":"IF(Vstup!C32<>\"\",Vstup!D32,\"\")","v":"S"},null,null,84,{"$f":"IF(Vstup!C92<>\"\",Vstup!C92,\"\")","v":""},{"$f":"IF(Vstup!C92<>\"\",Vstup!D92,\"\")","v":""}]
[5,25,{"$f":"IF(Vstup!C33<>\"\",Vstup!C33,\"\")","v":"Šindelář Jan"},{"$f":"IF(Vstup!C33<>\"\",Vstup!D33,\"\")","v":"S"},null,15,85,{"$f":"IF(Vstup!C93<>\"\",Vstup!C93,\"\")","v":""},{"$f":"IF(Vstup!C93<>\"\",Vstup!D93,\"\")","v":""}]
[null,26,{"$f":"IF(Vstup!C34<>\"\",Vstup!C34,\"\")","v":"Jira Tomáš"},{"$f":"IF(Vstup!C34<>\"\",Vstup!D34,\"\")","v":"S"},null,null,86,{"$f":"IF(Vstup!C94<>\"\",Vstup!C94,\"\")","v":""},{"$f":"IF(Vstup!C94<>\"\",Vstup!D94,\"\")","v":""}]
[null,27,{"$f":"IF(Vstup!C35<>\"\",Vstup!C35,\"\")","v":"Gorschenek Martin"},{"$f":"IF(Vstup!C35<>\"\",Vstup!D35,\"\")","v":"S"},null,null,87,{"$f":"IF(Vstup!C95<>\"\",Vstup!C95,\"\")","v":""},{"$f":"IF(Vstup!C95<>\"\",Vstup!D95,\"\")","v":""}]
[null,28,{"$f":"IF(Vstup!C36<>\"\",Vstup!C36,\"\")","v":"Leihs Gustav"},{"$f":"IF(Vstup!C36<>\"\",Vstup!D36,\"\")","v":"S"},null,null,88,{"$f":"IF(Vstup!C96<>\"\",Vstup!C96,\"\")","v":""},{"$f":"IF(Vstup!C96<>\"\",Vstup!D96,\"\")","v":""}]
[null,29,{"$f":"IF(Vstup!C37<>\"\",Vstup!C37,\"\")","v":"Škrýba Petr"},{"$f":"IF(Vstup!C37<>\"\",Vstup!D37,\"\")","v":"S"},null,null,89,{"$f":"IF(Vstup!C97<>\"\",Vstup!C97,\"\")","v":""},{"$f":"IF(Vstup!C97<>\"\",Vstup!D97,\"\")","v":""}]
[null,30,{"$f":"IF(Vstup!C38<>\"\",Vstup!C38,\"\")","v":"Růžek Luboš"},{"$f":"IF(Vstup!C38<>\"\",Vstup!D38,\"\")","v":"S"},null,null,90,{"$f":"IF(Vstup!C98<>\"\",Vstup!C98,\"\")","v":""},{"$f":"IF(Vstup!C98<>\"\",Vstup!D98,\"\")","v":""}]
[6,31,{"$f":"IF(Vstup!C39<>\"\",Vstup!C39,\"\")","v":"Albl Václav"},{"$f":"IF(Vstup!C39<>\"\",Vstup!D39,\"\")","v":"S"},null,16,91,{"$f":"IF(Vstup!C99<>\"\",Vstup!C99,\"\")","v":""},{"$f":"IF(Vstup!C99<>\"\",Vstup!D99,\"\")","v":""}]
[null,32,{"$f":"IF(Vstup!C40<>\"\",Vstup!C40,\"\")","v":"Noháček Jaroslav"},{"$f":"IF(Vstup!C40<>\"\",Vstup!D40,\"\")","v":"S"},null,null,92,{"$f":"IF(Vstup!C100<>\"\",Vstup!C100,\"\")","v":""},{"$f":"IF(Vstup!C100<>\"\",Vstup!D100,\"\")","v":""}]
[null,33,{"$f":"IF(Vstup!C41<>\"\",Vstup!C41,\"\")","v":"Noháček Pavel"},{"$f":"IF(Vstup!C41<>\"\",Vstup!D41,\"\")","v":"S"},null,null,93,{"$f":"IF(Vstup!C101<>\"\",Vstup!C101,\"\")","v":""},{"$f":"IF(Vstup!C101<>\"\",Vstup!D101,\"\")","v":""}]
[null,34,{"$f":"IF(Vstup!C42<>\"\",Vstup!C42,\"\")","v":"Mach Josef"},{"$f":"IF(Vstup!C42<>\"\",Vstup!D42,\"\")","v":"S"},null,null,94,{"$f":"IF(Vstup!C102<>\"\",Vstup!C102,\"\")","v":""},{"$f":"IF(Vstup!C102<>\"\",Vstup!D102,\"\")","v":""}]
[null,35,{"$f":"IF(Vstup!C43<>\"\",Vstup!C43,\"\")","v":"Lusk Stanislav"},{"$f":"IF(Vstup!C43<>\"\",Vstup!D43,\"\")","v":"S"},null,null,95,{"$f":"IF(Vstup!C103<>\"\",Vstup!C103,\"\")","v":""},{"$f":"IF(Vstup!C103<>\"\",Vstup!D103,\"\")","v":""}]
[null,36,{"$f":"IF(Vstup!C44<>\"\",Vstup!C44,\"\")","v":"Mach Jan"},{"$f":"IF(Vstup!C44<>\"\",Vstup!D44,\"\")","v":"S"},null,null,96,{"$f":"IF(Vstup!C104<>\"\",Vstup!C104,\"\")","v":""},{"$f":"IF(Vstup!C104<>\"\",Vstup!D104,\"\")","v":""}]
[7,37,{"$f":"IF(Vstup!C45<>\"\",Vstup!C45,\"\")","v":"Hromada Jaroslav"},{"$f":"IF(Vstup!C45<>\"\",Vstup!D45,\"\")","v":"S"},null,17,97,{"$f":"IF(Vstup!C105<>\"\",Vstup!C105,\"\")","v":""},{"$f":"IF(Vstup!C105<>\"\",Vstup!D105,\"\")","v":""}]
[null,38,{"$f":"IF(Vstup!C46<>\"\",Vstup!C46,\"\")","v":"Racek Petr"},{"$f":"IF(Vstup!C46<>\"\",Vstup!D46,\"\")","v":"S"},null,null,98,{"$f":"IF(Vstup!C106<>\"\",Vstup!C106,\"\")","v":""},{"$f":"IF(Vstup!C106<>\"\",Vstup!D106,\"\")","v":""}]
[null,39,{"$f":"IF(Vstup!C47<>\"\",Vstup!C47,\"\")","v":"Říha Jiří"},{"$f":"IF(Vstup!C47<>\"\",Vstup!D47,\"\")","v":"S"},null,null,99,{"$f":"IF(Vstup!C107<>\"\",Vstup!C107,\"\")","v":""},{"$f":"IF(Vstup!C107<>\"\",Vstup!D107,\"\")","v":""}]
[null,40,{"$f":"IF(Vstup!C48<>\"\",Vstup!C48,\"\")","v":"Kočí Radek"},{"$f":"IF(Vstup!C48<>\"\",Vstup!D48,\"\")","v":"S"},null,null,100,{"$f":"IF(Vstup!C108<>\"\",Vstup!C108,\"\")","v":""},{"$f":"IF(Vstup!C108<>\"\",Vstup!D108,\"\")","v":""}]
[null,41,{"$f":"IF(Vstup!C49<>\"\",Vstup!C49,\"\")","v":"Pechan Josef"},{"$f":"IF(Vstup!C49<>\"\",Vstup!D49,\"\")","v":"S"},null,null,101,{"$f":"IF(Vstup!C109<>\"\",Vstup!C109,\"\")","v":""},{"$f":"IF(Vstup!C109<>\"\",Vstup!D109,\"\")","v":""}]
[null,42,{"$f":"IF(Vstup!C50<>\"\",Vstup!C50,\"\")","v":"Kučera Václav"},{"$f":"IF(Vstup!C50<>\"\",Vstup!D50,\"\")","v":"S"},null,null,102,{"$f":"IF(Vstup!C110<>\"\",Vstup!C110,\"\")","v":""},{"$f":"IF(Vstup!C110<>\"\",Vstup!D110,\"\")","v":""}]
[8,43,{"$f":"IF(Vstup!C51<>\"\",Vstup!C51,\"\")","v":"Štengl Jiří"},{"$f":"IF(Vstup!C51<>\"\",Vstup!D51,\"\")","v":"S"},null,18,103,{"$f":"IF(Vstup!C111<>\"\",Vstup!C111,\"\")","v":""},{"$f":"IF(Vstup!C111<>\"\",Vstup!D111,\"\")","v":""}]
[null,44,{"$f":"IF(Vstup!C52<>\"\",Vstup!C52,\"\")","v":"Kubík Jindřich"},{"$f":"IF(Vstup!C52<>\"\",Vstup!D52,\"\")","v":"S"},null,null,104,{"$f":"IF(Vstup!C112<>\"\",Vstup!C112,\"\")","v":""},{"$f":"IF(Vstup!C112<>\"\",Vstup!D112,\"\")","v":""}]
[null,45,{"$f":"IF(Vstup!C53<>\"\",Vstup!C53,\"\")","v":"Vodička Miroslav"},{"$f":"IF(Vstup!C53<>\"\",Vstup!D53,\"\")","v":"S"},null,null,105,{"$f":"IF(Vstup!C113<>\"\",Vstup!C113,\"\")","v":""},{"$f":"IF(Vstup!C113<>\"\",Vstup!D113,\"\")","v":""}]
[null,46,{"$f":"IF(Vstup!C54<>\"\",Vstup!C54,\"\")","v":"Šindelář Milan"},{"$f":"IF(Vstup!C54<>\"\",Vstup!D54,\"\")","v":"S"},null,null,106,{"$f":"IF(Vstup!C114<>\"\",Vstup!C114,\"\")","v":""},{"$f":"IF(Vstup!C114<>\"\",Vstup!D114,\"\")","v":""}]
[null,47,{"$f":"IF(Vstup!C55<>\"\",Vstup!C55,\"\")","v":"Förster Karel"},{"$f":"IF(Vstup!C55<>\"\",Vstup!D55,\"\")","v":"S"},null,null,107,{"$f":"IF(Vstup!C115<>\"\",Vstup!C115,\"\")","v":""},{"$f":"IF(Vstup!C115<>\"\",Vstup!D115,\"\")","v":""}]
[null,48,{"$f":"IF(Vstup!C56<>\"\",Vstup!C56,\"\")","v":"Ulrych Jiří"},{"$f":"IF(Vstup!C56<>\"\",Vstup!D56,\"\")","v":"S"},null,null,108,{"$f":"IF(Vstup!C116<>\"\",Vstup!C116,\"\")","v":""},{"$f":"IF(Vstup!C116<>\"\",Vstup!D116,\"\")","v":""}]
[9,49,{"$f":"IF(Vstup!C57<>\"\",Vstup!C57,\"\")","v":""},{"$f":"IF(Vstup!C57<>\"\",Vstup!D57,\"\")","v":""},null,19,109,{"$f":"IF(Vstup!C117<>\"\",Vstup!C117,\"\")","v":""},{"$f":"IF(Vstup!C117<>\"\",Vstup!D117,\"\")","v":""}]
[null,50,{"$f":"IF(Vstup!C58<>\"\",Vstup!C58,\"\")","v":""},{"$f":"IF(Vstup!C58<>\"\",Vstup!D58,\"\")","v":""},null,null,110,{"$f":"IF(Vstup!C118<>\"\",Vstup!C118,\"\")","v":""},{"$f":"IF(Vstup!C118<>\"\",Vstup!D118,\"\")","v":""}]
[null,51,{"$f":"IF(Vstup!C59<>\"\",Vstup!C59,\"\")","v":""},{"$f":"IF(Vstup!C59<>\"\",Vstup!D59,\"\")","v":""},null,null,111,{"$f":"IF(Vstup!C119<>\"\",Vstup!C119,\"\")","v":""},{"$f":"IF(Vstup!C119<>\"\",Vstup!D119,\"\")","v":""}]
[null,52,{"$f":"IF(Vstup!C60<>\"\",Vstup!C60,\"\")","v":""},{"$f":"IF(Vstup!C60<>\"\",Vstup!D60,\"\")","v":""},null,null,112,{"$f":"IF(Vstup!C120<>\"\",Vstup!C120,\"\")","v":""},{"$f":"IF(Vstup!C120<>\"\",Vstup!D120,\"\")","v":""}]
[null,53,{"$f":"IF(Vstup!C61<>\"\",Vstup!C61,\"\")","v":""},{"$f":"IF(Vstup!C61<>\"\",Vstup!D61,\"\")","v":""},null,null,113,{"$f":"IF(Vstup!C121<>\"\",Vstup!C121,\"\")","v":""},{"$f":"IF(Vstup!C121<>\"\",Vstup!D121,\"\")","v":""}]
[null,54,{"$f":"IF(Vstup!C62<>\"\",Vstup!C62,\"\")","v":""},{"$f":"IF(Vstup!C62<>\"\",Vstup!D62,\"\")","v":""},null,null,114,{"$f":"IF(Vstup!C122<>\"\",Vstup!C122,\"\")","v":""},{"$f":"IF(Vstup!C122<>\"\",Vstup!D122,\"\")","v":""}]
[10,55,{"$f":"IF(Vstup!C63<>\"\",Vstup!C63,\"\")","v":""},{"$f":"IF(Vstup!C63<>\"\",Vstup!D63,\"\")","v":""},null,20,115,{"$f":"IF(Vstup!C123<>\"\",Vstup!C123,\"\")","v":""},{"$f":"IF(Vstup!C123<>\"\",Vstup!D123,\"\")","v":""}]
[null,56,{"$f":"IF(Vstup!C64<>\"\",Vstup!C64,\"\")","v":""},{"$f":"IF(Vstup!C64<>\"\",Vstup!D64,\"\")","v":""},null,null,116,{"$f":"IF(Vstup!C124<>\"\",Vstup!C124,\"\")","v":""},{"$f":"IF(Vstup!C124<>\"\",Vstup!D124,\"\")","v":""}]
[null,57,{"$f":"IF(Vstup!C65<>\"\",Vstup!C65,\"\")","v":""},{"$f":"IF(Vstup!C65<>\"\",Vstup!D65,\"\")","v":""},null,null,117,{"$f":"IF(Vstup!C125<>\"\",Vstup!C125,\"\")","v":""},{"$f":"IF(Vstup!C125<>\"\",Vstup!D125,\"\")","v":""}]
[null,58,{"$f":"IF(Vstup!C66<>\"\",Vstup!C66,\"\")","v":""},{"$f":"IF(Vstup!C66<>\"\",Vstup!D66,\"\")","v":""},null,null,118,{"$f":"IF(Vstup!C126<>\"\",Vstup!C126,\"\")","v":""},{"$f":"IF(Vstup!C126<>\"\",Vstup!D126,\"\")","v":""}]
[null,59,{"$f":"IF(Vstup!C67<>\"\",Vstup!C67,\"\")","v":""},{"$f":"IF(Vstup!C67<>\"\",Vstup!D67,\"\")","v":""},null,null,119,{"$f":"IF(Vstup!C127<>\"\",Vstup!C127,\"\")","v":""},{"$f":"IF(Vstup!C127<>\"\",Vstup!D127,\"\")","v":""}]
[null,60,{"$f":"IF(Vstup!C68<>\"\",Vstup!C68,\"\")","v":""},{"$f":"IF(Vstup!C68<>\"\",Vstup!D68,\"\")","v":""},null,null,120,{"$f":"IF(Vstup!C128<>\"\",Vstup!C128,\"\")","v":""},{"$f":"IF(Vstup!C128<>\"\",Vstup!D128,\"\")","v":""}]

{"sheet":"VysledkyDoplneni","index":3,"n_rows":126,"n_cols":20,"rows_kept":126,"merged":[[0,0,1,19],[3,4,3,19],[4,0,5,0],[4,1,5,1],[4,2,5,2],[4,3,5,3],[4,4,5,4],[4,5,5,5],[4,6,5,6],[4,7,5,7],[4,8,5,8],[4,9,5,9],[4,10,5,10],[4,11,5,11],[4,12,5,12],[4,13,5,13],[4,14,5,14],[4,15,5,15],[4,16,5,16],[4,17,5,17],[4,18,5,18],[4,19,5,19],[6,0,11,0],[12,0,17,0],[18,0,23,0],[24,0,29,0],[30,0,35,0],[36,0,41,0],[42,0,47,0],[48,0,53,0],[54,0,59,0],[60,0,65,0],[66,0,71,0],[72,0,77,0],[78,0,83,0],[84,0,89,0],[90,0,95,0],[96,0,101,0],[102,0,107,0],[108,0,113,0],[114,0,119,0],[120,0,125,0]]}
["Sem napsat výsledky"]
[]
[]
[{"$nulls":4},{"$f":"Vstup!C2&IF(Vstup!C3<>\"\",\", \"&Vstup!C3,\"\")","v":"Josefovský brokový trojboj, 60 TERČŮ"}]
["Skupina číslo","Start. číslo","Příjmení, jméno","Kategorie",{"$f":"Data!D3","v":"Vysoká věž"},{"$f":"Data!D4","v":"Trap"},{"$f":"Data!D5","v":"Zajíc"},{"$f":"Data!D6","v":0},{"$f":"Data!D7","v":0},{"$f":"Data!D8","v":0},{"$f":"Data!D9","v":0},{"$f":"Data!D10","v":0},{"$f":"Data!D11","v":0},{"$f":"Data!D12","v":0},{"$f":"Data!D13","v":0},{"$f":"Data!D13","v":0},{"$f":"Data!D15","v":0},{"$f":"Data!D16","v":0},{"$f":"Data!D17","v":0},{"$f":"Data!D18","v":0}]
[]
[1,{"$f":"IF(Vstup!C9<>\"\",Vstup!B9,\"\")","v":1},{"$f":"IF(Vstup!C9<>\"\",Vstup!C9,\"\")","v":"Štenglová Michaela"},{"$f":"IF(Vstup!C9<>\"\",Vstup!D9,\"\")","v":"S"},15,14,13]
[null,{"$f":"IF(Vstup!C10<>\"\",Vstup!B10,\"\")","v":2},{"$f":"IF(Vstup!C10<>\"\",Vstup!C10,\"\")","v":"Vaněk Matěj"},{"$f":"IF(Vstup!C10<>\"\",Vstup!D10,\"\")","v":"S"},16,16,20]
[null,{"$f":"IF(Vstup!C11<>\"\",Vstup!B11,\"\")","v":3},{"$f":"IF(Vstup!C11<>\"\",Vstup!C11,\"\")","v":"Veltruský Jiří"},{"$f":"IF(Vstup!C11<>\"\",Vstup!D11,\"\")","v":"S"},16,9,12]
[null,{"$f":"IF(Vstup!C12<>\"\",Vstup!B12,\"\")","v":4},{"$f":"IF(Vstup!C12<>\"\",Vstup!C12,\"\")","v":"Černý Bohuslav"},{"$f":"IF(Vstup!C12<>\"\",Vstup!D12,\"\")","v":"S"},13,14,11]
[null,{"$f":"IF(Vstup!C13<>\"\",Vstup!B13,\"\")","v":5},{"$f":"IF(Vstup!C13<>\"\",Vstup!C13,\"\")","v":"Šindelář Jiří st."},{"$f":"IF(Vstup!C13<>\"\",Vstup!D13,\"\")","v":"S"},15,11,12]
[null,{"$f":"IF(Vstup!C14<>\"\",Vstup!B14,\"\")","v":6},{"$f":"IF(Vstup!C14<>\"\",Vstup!C14,\"\")","v":"Mařík Josef"},{"$f":"IF(Vstup!C14<>\"\",Vstup!D14,\"\")","v":"S"},13,16,7]
[2,{"$f":"IF(Vstup!C15<>\"\",Vstup!B15,\"\")","v":7},{"$f":"IF(Vstup!C15<>\"\",Vstup!C15,\"\")","v":"Lízalová Veronika"},{"$f":"IF(Vstup!C15<>\"\",Vstup!D15,\"\")","v":"S"},3,5,9]
[null,{"$f":"IF(Vstup!C16<>\"\",Vstup!B16,\"\")","v":8},{"$f":"IF(Vstup!C16<>\"\",Vstup!C16,\"\")","v":"Lízal Miroslav ml."},{"$f":"IF(Vstup!C16<>\"\",Vstup!D16,\"\")","v":"S"},8,16,2]
[null,{"$f":"IF(Vstup!C17<>\"\",Vstup!B17,\"\")","v":9},{"$f":"IF(Vstup!C17<>\"\",Vstup!C17,\"\")","v":"Kondr Václav"},{"$f":"IF(Vstup!C17<>\"\",Vstup!D17,\"\")","v":"S"},8,13,13]
[null,{"$f":"IF(Vstup!C18<>\"\",Vstup!B18,\"\")","v":10},{"$f":"IF(Vstup!C18<>\"\",Vstup!C18,\"\")","v":"Frenkl Jiří"},{"$f":"IF(Vstup!C18<>\"\",Vstup!D18,\"\")","v":"S"},19,19,19]
[null,{"$f":"IF(Vstup!C19<>\"\",Vstup!B19,\"\")","v":11},{"$f":"IF(Vstup!C19<>\"\",Vstup!C19,\"\")","v":"Adámek Bohuslav"},{"$f":"IF(Vstup!C19<>\"\",Vstup!D19,\"\")","v":"S"},15,15,16]
[null,{"$f":"IF(Vstup!C20<>\"\",Vstup!B20,\"\")","v":12},{"$f":"IF(Vstup!C20<>\"\",Vstup!C20,\"\")","v":"Urban Josef"},{"$f":"IF(Vstup!C20<>\"\",Vstup!D20,\"\")","v":"S"},9,13,13]
[3,{"$f":"IF(Vstup!C21<>\"\",Vstup!B21,\"\")","v":13},{"$f":"IF(Vstup!C21<>\"\",Vstup!C21,\"\")","v":"Trepka Jiří"},{"$f":"IF(Vstup!C21<>\"\",Vstup!D21,\"\")","v":"S"},15,17,16]
[null,{"$f":"IF(Vstup!C22<>\"\",Vstup!B22,\"\")","v":14},{"$f":"IF(Vstup!C22<>\"\",Vstup!C22,\"\")","v":"Dusík Vladimír"},{"$f":"IF(Vstup!C22<>\"\",Vstup!D22,\"\")","v":"S"},15,12,13]
[null,{"$f":"IF(Vstup!C23<>\"\",Vstup!B23,\"\")","v":15},{"$f":"IF(Vstup!C23<>\"\",Vstup!C23,\"\")","v":"Kotrbáček Václav"},{"$f":"IF(Vstup!C23<>\"\",Vstup!D23,\"\")","v":"S"},19,16,17]
[null,{"$f":"IF(Vstup!C24<>\"\",Vstup!B24,\"\")","v":16},{"$f":"IF(Vstup!C24<>\"\",Vstup!C24,\"\")","v":"Doležal Jaroslav"},{"$f":"IF(Vstup!C24<>\"\",Vstup!D24,\"\")","v":"S"},7,12,14]
[null,{"$f":"IF(Vstup!C25<>\"\",Vstup!B25,\"\")","v":17},{"$f":"IF(Vstup!C25<>\"\",Vstup!C25,\"\")","v":"Křepelka Jan"},{"$f":"IF(Vstup!C25<>\"\",Vstup!D25,\"\")","v":"S"},10,11,15]
[null,{"$f":"IF(Vstup!C26<>\"\",Vstup!B26,\"\")","v":18},{"$f":"IF(Vstup!C26<>\"\",Vstup!C26,\"\")","v":"Bém Josef"},{"$f":"IF(Vstup!C26<>\"\",Vstup!D26,\"\")","v":"S"},19,15,15]
[4,{"$f":"IF(Vstup!C27<>\"\",Vstup!B27,\"\")","v":19},{"$f":"IF(Vstup!C27<>\"\",Vstup!C27,\"\")","v":"Čechura Petr"},{"$f":"IF(Vstup!C27<>\"\",Vstup!D27,\"\")","v":"S"},14,19,19]
[null,{"$f":"IF(Vstup!C28<>\"\",Vstup!B28,\"\")","v":20},{"$f":"IF(Vstup!C28<>\"\",Vstup!C28,\"\")","v":"Čechura Pavel"},{"$f":"IF(Vstup!C28<>\"\",Vstup!D28,\"\")","v":"S"},13,13,16]
[null,{"$f":"IF(Vstup!C29<>\"\",Vstup!B29,\"\")","v":21},{"$f":"IF(Vstup!C29<>\"\",Vstup!C29,\"\")","v":"Sedláček Jiří"},{"$f":"IF(Vstup!C29<>\"\",Vstup!D29,\"\")","v":"S"},12,14,20]
[null,{"$f":"IF(Vstup!C30<>\"\",Vstup!B30,\"\")","v":22},{"$f":"IF(Vstup!C30<>\"\",Vstup!C30,\"\")","v":"Hájek Petr"},{"$f":"IF(Vstup!C30<>\"\",Vstup!D30,\"\")","v":"S"},11,12,12]
[null,{"$f":"IF(Vstup!C31<>\"\",Vstup!B31,\"\")","v":23},{"$f":"IF(Vstup!C31<>\"\",Vstup!C31,\"\")","v":"Volf Jiří"},{"$f":"IF(Vstup!C31<>\"\",Vstup!D31,\"\")","v":"S"},15,16,20]
[null,{"$f":"IF(Vstup!C32<>\"\",Vstup!B32,\"\")","v":24},{"$f":"IF(Vstup!C32<>\"\",Vstup!C32,\"\")","v":"Navara Josef"},{"$f":"IF(Vstup!C32<>\"\",Vstup!D32,\"\")","v":"S"},10,15,13]
[5,{"$f":"IF(Vstup!C33<>\"\",Vstup!B33,\"\")","v":25},{"$f":"IF(Vstup!C33<>\"\",Vstup!C33,\"\")","v":"Šindelář Jan"},{"$f":"IF(Vstup!C33<>\"\",Vstup!D33,\"\")","v":"S"},8,13,19]
[null,{"$f":"IF(Vstup!C34<>\"\",Vstup!B34,\"\")","v":26},{"$f":"IF(Vstup!C34<>\"\",Vstup!C34,\"\")","v":"Jira Tomáš"},{"$f":"IF(Vstup!C34<>\"\",Vstup!D34,\"\")","v":"S"},3,9,4]
[null,{"$f":"IF(Vstup!C35<>\"\",Vstup!B35,\"\")","v":27},{"$f":"IF(Vstup!C35<>\"\",Vstup!C35,\"\")","v":"Gorschenek Martin"},{"$f":"IF(Vstup!C35<>\"\",Vstup!D35,\"\")","v":"S"},6,3,1]
[null,{"$f":"IF(Vstup!C36<>\"\",Vstup!B36,\"\")","v":28},{"$f":"IF(Vstup!C36<>\"\",Vstup!C36,\"\")","v":"Leihs Gustav"},{"$f":"IF(Vstup!C36<>\"\",Vstup!D36,\"\")","v":"S"},16,15,17]
[null,{"$f":"IF(Vstup!C37<>\"\",Vstup!B37,\"\")","v":29},{"$f":"IF(Vstup!C37<>\"\",Vstup!C37,\"\")","v":"Škrýba Petr"},{"$f":"IF(Vstup!C37<>\"\",Vstup!D37,\"\")","v":"S"},15,12,12]
[null,{"$f":"IF(Vstup!C38<>\"\",Vstup!B38,\"\")","v":30},{"$f":"IF(Vstup!C38<>\"\",Vstup!C38,\"\")","v":"Růžek Luboš"},{"$f":"IF(Vstup!C38<>\"\",Vstup!D38,\"\")","v":"S"},19,11,14]
[6,{"$f":"IF(Vstup!C39<>\"\",Vstup!B39,\"\")","v":31},{"$f":"IF(Vstup!C39<>\"\",Vstup!C39,\"\")","v":"Albl Václav"},{"$f":"IF(Vstup!C39<>\"\",Vstup!D39,\"\")","v":"S"},8,18,7]
[null,{"$f":"IF(Vstup!C40<>\"\",Vstup!B40,\"\")","v":32},{"$f":"IF(Vstup!C40<>\"\",Vstup!C40,\"\")","v":"Noháček Jaroslav"},{"$f":"IF(Vstup!C40<>\"\",Vstup!D40,\"\")","v":"S"},15,14,18]
[null,{"$f":"IF(Vstup!C41<>\"\",Vstup!B41,\"\")","v":33},{"$f":"IF(Vstup!C41<>\"\",Vstup!C41,\"\")","v":"Noháček Pavel"},{"$f":"IF(Vstup!C41<>\"\",Vstup!D41,\"\")","v":"S"},18,15,19]
[null,{"$f":"IF(Vstup!C42<>\"\",Vstup!B42,\"\")","v":34},{"$f":"IF(Vstup!C42<>\"\",Vstup!C42,\"\")","v":"Mach Josef"},{"$f":"IF(Vstup!C42<>\"\",Vstup!D42,\"\")","v":"S"},9,15,13]
[null,{"$f":"IF(Vstup!C43<>\"\",Vstup!B43,\"\")","v":35},{"$f":"IF(Vstup!C43<>\"\",Vstup!C43,\"\")","v":"Lusk Stanislav"},{"$f":"IF(Vstup!C43<>\"\",Vstup!D43,\"\")","v":"S"},17,11,14]
[null,{"$f":"IF(Vstup!C44<>\"\",Vstup!B44,\"\")","v":36},{"$f":"IF(Vstup!C44<>\"\",Vstup!C44,\"\")","v":"Mach Jan"},{"$f":"IF(Vstup!C44<>\"\",Vstup!D44,\"\")","v":"S"},19,9,20]
[7,{"$f":"IF(Vstup!C45<>\"\",Vstup!B45,\"\")","v":37},{"$f":"IF(Vstup!C45<>\"\",Vstup!C45,\"\")","v":"Hromada Jaroslav"},{"$f":"IF(Vstup!C45<>\"\",Vstup!D45,\"\")","v":"S"},18,17,16]
[null,{"$f":"IF(Vstup!C46<>\"\",Vstup!B46,\"\")","v":38},{"$f":"IF(Vstup!C46<>\"\",Vstup!C46,\"\")","v":"Racek Petr"},{"$f":"IF(Vstup!C46<>\"\",Vstup!D46,\"\")","v":"S"},15,15,14]
[null,{"$f":"IF(Vstup!C47<>\"\",Vstup!B47,\"\")","v":39},{"$f":"IF(Vstup!C47<>\"\",Vstup!C47,\"\")","v":"Říha Jiří"},{"$f":"IF(Vstup!C47<>\"\",Vstup!D47,\"\")","v":"S"},6,14,13]
[null,{"$f":"IF(Vstup!C48<>\"\",Vstup!B48,\"\")","v":40},{"$f":"IF(Vstup!C48<>\"\",Vstup!C48,\"\")","v":"Kočí Radek"},{"$f":"IF(Vstup!C48<>\"\",Vstup!D48,\"\")","v":"S"},18,16,19]
[null,{"$f":"IF(Vstup!C49<>\"\",Vstup!B49,\"\")","v":41},{"$f":"IF(Vstup!C49<>\"\",Vstup!C49,\"\")","v":"Pechan Josef"},{"$f":"IF(Vstup!C49<>\"\",Vstup!D49,\"\")","v":"S"},14,15,15]
[null,{"$f":"IF(Vstup!C50<>\"\",Vstup!B50,\"\")","v":42},{"$f":"IF(Vstup!C50<>\"\",Vstup!C50,\"\")","v":"Kučera Václav"},{"$f":"IF(Vstup!C50<>\"\",Vstup!D50,\"\")","v":"S"},16,13,10]
[8,{"$f":"IF(Vstup!C51<>\"\",Vstup!B51,\"\")","v":43},{"$f":"IF(Vstup!C51<>\"\",Vstup!C51,\"\")","v":"Štengl Jiří"},{"$f":"IF(Vstup!C51<>\"\",Vstup!D51,\"\")","v":"S"},13,15,19]
[null,{"$f":"IF(Vstup!C52<>\"\",Vstup!B52,\"\")","v":44},{"$f":"IF(Vstup!C52<>\"\",Vstup!C52,\"\")","v":"Kubík Jindřich"},{"$f":"IF(Vstup!C52<>\"\",Vstup!D52,\"\")","v":"S"},15,18,19]
[null,{"$f":"IF(Vstup!C53<>\"\",Vstup!B53,\"\")","v":45},{"$f":"IF(Vstup!C53<>\"\",Vstup!C53,\"\")","v":"Vodička Miroslav"},{"$f":"IF(Vstup!C53<>\"\",Vstup!D53,\"\")","v":"S"},9,7,11]
[null,{"$f":"IF(Vstup!C54<>\"\",Vstup!B54,\"\")","v":46},{"$f":"IF(Vstup!C54<>\"\",Vstup!C54,\"\")","v":"Šindelář Milan"},{"$f":"IF(Vstup!C54<>\"\",Vstup!D54,\"\")","v":"S"},18,12,19]
[null,{"$f":"IF(Vstup!C55<>\"\",Vstup!B55,\"\")","v":47},{"$f":"IF(Vstup!C55<>\"\",Vstup!C55,\"\")","v":"Förster Karel"},{"$f":"IF(Vstup!C55<>\"\",Vstup!D55,\"\")","v":"S"},13,12,9]
[null,{"$f":"IF(Vstup!C56<>\"\",Vstup!B56,\"\")","v":48},{"$f":"IF(Vstup!C56<>\"\",Vstup!C56,\"\")","v":"Ulrych Jiří"},{"$f":"IF(Vstup!C56<>\"\",Vstup!D56,\"\")","v":"S"},11,11,16]
[9,{"$f":"IF(Vstup!C57<>\"\",Vstup!B57,\"\")","v":""},{"$f":"IF(Vstup!C57<>\"\",Vstup!C57,\"\")","v":""},{"$f":"IF(Vstup!C57<>\"\",Vstup!D57,\"\")","v":""}]
[null,{"$f":"IF(Vstup!C58<>\"\",Vstup!B58,\"\")","v":""},{"$f":"IF(Vstup!C58<>\"\",Vstup!C58,\"\")","v":""},{"$f":"IF(Vstup!C58<>\"\",Vstup!D58,\"\")","v":""}]
[null,{"$f":"IF(Vstup!C59<>\"\",Vstup!B59,\"\")","v":""},{"$f":"IF(Vstup!C59<>\"\",Vstup!C59,\"\")","v":""},{"$f":"IF(Vstup!C59<>\"\",Vstup!D59,\"\")","v":""}]
[null,{"$f":"IF(Vstup!C60<>\"\",Vstup!B60,\"\")","v":""},{"$f":"IF(Vstup!C60<>\"\",Vstup!C60,\"\")","v":""},{"$f":"IF(Vstup!C60<>\"\",Vstup!D60,\"\")","v":""}]
[null,{"$f":"IF(Vstup!C61<>\"\",Vstup!B61,\"\")","v":""},{"$f":"IF(Vstup!C61<>\"\",Vstup!C61,\"\")","v":""},{"$f":"IF(Vstup!C61<>\"\",Vstup!D61,\"\")","v":""}]
[null,{"$f":"IF(Vstup!C62<>\"\",Vstup!B62,\"\")","v":""},{"$f":"IF(Vstup!C62<>\"\",Vstup!C62,\"\")","v":""},{"$f":"IF(Vstup!C62<>\"\",Vstup!D62,\"\")","v":""}]
[10,{"$f":"IF(Vstup!C63<>\"\",Vstup!B63,\"\")","v":""},{"$f":"IF(Vstup!C63<>\"\",Vstup!C63,\"\")","v":""},{"$f":"IF(Vstup!C63<>\"\",Vstup!D63,\"\")","v":""}]
[null,{"$f":"IF(Vstup!C64<>\"\",Vstup!B64,\"\")","v":""},{"$f":"IF(Vstup!C64<>\"\",Vstup!C64,\"\")","v":""},{"$f":"IF(Vstup!C64<>\"\",Vstup!D64,\"\")","v":""}]
[null,{"$f":"IF(Vstup!C65<>\"\",Vstup!B65,\"\")","v":""},{"$f":"IF(Vstup!C65<>\"\",Vstup!C65,\"\")","v":""},{"$f":"IF(Vstup!C65<>\"\",Vstup!D65,\"\")","v":""}]
[null,{"$f":"IF(Vstup!C66<>\"\",Vstup!B66,\"\")","v":""},{"$f":"IF(Vstup!C66<>\"\",Vstup!C66,\"\")","v":""},{"$f":"IF(Vstup!C66<>\"\",Vstup!D66,\"\")","v":""}]
[null,{"$f":"IF(Vstup!C67<>\"\",Vstup!B67,\"\")","v":""},{"$f":"IF(Vstup!C67<>\"\",Vstup!C67,\"\")","v":""},{"$f":"IF(Vstup!C67<>\"\",Vstup!D67,\"\")","v":""}]
[null,{"$f":"IF(Vstup!C68<>\"\",Vstup!B68,\"\")","v":""},{"$f":"IF(Vstup!C68<>\"\",Vstup!C68,\"\")","v":""},{"$f":"IF(Vstup!C68<>\"\",Vstup!D68,\"\")","v":""}]
[11,{"$f":"IF(Vstup!C69<>\"\",Vstup!B69,\"\")","v":""},{"$f":"IF(Vstup!C69<>\"\",Vstup!C69,\"\")","v":""},{"$f":"IF(Vstup!C69<>\"\",Vstup!D69,\"\")","v":""}]
[null,{"$f":"IF(Vstup!C70<>\"\",Vstup!B70,\"\")","v":""},{"$f":"IF(Vstup!C70<>\"\",Vstup!C70,\"\")","v":""},{"$f":"IF(Vstup!C70<>\"\",Vstup!D70,\"\")","v":""}]
[null,{"$f":"IF(Vstup!C71<>\"\",Vstup!B71,\"\")","v":""},{"$f":"IF(Vstup!C71<>\"\",Vstup!C71,\"\")","v":""},{"$f":"IF(Vstup!C71<>\"\",Vstup!D71,\"\")","v":""}]
[null,{"$f":"IF(Vstup!C72<>\"\",Vstup!B72,\"\")","v":""},{"$f":"IF(Vstup!C72<>\"\",Vstup!C72,\"\")","v":""},{"$f":"IF(Vstup!C72<>\"\",Vstup!D72,\"\")","v":""}]
[null,{"$f":"IF(Vstup!C73<>\"\",Vstup!B73,\"\")","v":""},{"$f":"IF(Vstup!C73<>\"\",Vstup!C73,\"\")","v":""},{"$f":"IF(Vstup!C73<>\"\",Vstup!D73,\"\")","v":""}]
[null,{"$f":"IF(Vstup!C74<>\"\",Vstup!B74,\"\")","v":""},{"$f":"IF(Vstup!C74<>\"\",Vstup!C74,\"\")","v":""},{"$f":"IF(Vstup!C74<>\"\",Vstup!D74,\"\")","v":""}]
[12,{"$f":"IF(Vstup!C75<>\"\",Vstup!B75,\"\")","v":""},{"$f":"IF(Vstup!C75<>\"\",Vstup!C75,\"\")","v":""},{"$f":"IF(Vstup!C75<>\"\",Vstup!D75,\"\")","v":""}]
[null,{"$f":"IF(Vstup!C76<>\"\",Vstup!B76,\"\")","v":""},{"$f":"IF(Vstup!C76<>\"\",Vstup!C76,\"\")","v":""},{"$f":"IF(Vstup!C76<>\"\",Vstup!D76,\"\")","v":""}]
[null,{"$f":"IF(Vstup!C77<>\"\",Vstup!B77,\"\")","v":""},{"$f":"IF(Vstup!C77<>\"\",Vstup!C77,\"\")","v":""},{"$f":"IF(Vstup!C77<>\"\",Vstup!D77,\"\")","v":""}]
[null,{"$f":"IF(Vstup!C78<>\"\",Vstup!B78,\"\")","v":""},{"$f":"IF(Vstup!C78<>\"\",Vstup!C78,\"\")","v":""},{"$f":"IF(Vstup!C78<>\"\",Vstup!D78,\"\")","v":""}]
[null,{"$f":"IF(Vstup!C79<>\"\",Vstup!B79,\"\")","v":""},{"$f":"IF(Vstup!C79<>\"\",Vstup!C79,\"\")","v":""},{"$f":"IF(Vstup!C79<>\"\",Vstup!D79,\"\")","v":""}]
[null,{"$f":"IF(Vstup!C80<>\"\",Vstup!B80,\"\")","v":""},{"$f":"IF(Vstup!C80<>\"\",Vstup!C80,\"\")","v":""},{"$f":"IF(Vstup!C80<>\"\",Vstup!D80,\"\")","v":""}]
[13,{"$f":"IF(Vstup!C81<>\"\",Vstup!B81,\"\")","v":""},{"$f":"IF(Vstup!C81<>\"\",Vstup!C81,\"\")","v":""},{"$f":"IF(Vstup!C81<>\"\",Vstup!D81,\"\")","v":""}]
[null,{"$f":"IF(Vstup!C82<>\"\",Vstup!B82,\"\")","v":""},{"$f":"IF(Vstup!C82<>\"\",Vstup!C82,\"\")","v":""},{"$f":"IF(Vstup!C82<>\"\",Vstup!D82,\"\")","v":""}]
[null,{"$f":"IF(Vstup!C83<>\"\",Vstup!B83,\"\")","v":""},{"$f":"IF(Vstup!C83<>\"\",Vstup!C83,\"\")","v":""},{"$f":"IF(Vstup!C83<>\"\",Vstup!D83,\"\")","v":""}]
[null,{"$f":"IF(Vstup!C84<>\"\",Vstup!B84,\"\")","v":""},{"$f":"IF(Vstup!C84<>\"\",Vstup!C84,\"\")","v":""},{"$f":"IF(Vstup!C84<>\"\",Vstup!D84,\"\")","v":""}]
[null,{"$f":"IF(Vstup!C85<>\"\",Vstup!B85,\"\")","v":""},{"$f":"IF(Vstup!C85<>\"\",Vstup!C85,\"\")","v":""},{"$f":"IF(Vstup!C85<>\"\",Vstup!D85,\"\")","v":""}]
[null,{"$f":"IF(Vstup!C86<>\"\",Vstup!B86,\"\")","v":""},{"$f":"IF(Vstup!C86<>\"\",Vstup!C86,\"\")","v":""},{"$f":"IF(Vstup!C86<>\"\",Vstup!D86,\"\")","v":""}]
[14,{"$f":"IF(Vstup!C87<>\"\",Vstup!B87,\"\")","v":""},{"$f":"IF(Vstup!C87<>\"\",Vstup!C87,\"\")","v":""},{"$f":"IF(Vstup!C87<>\"\",Vstup!D87,\"\")","v":""}]
[null,{"$f":"IF(Vstup!C88<>\"\",Vstup!B88,\"\")","v":""},{"$f":"IF(Vstup!C88<>\"\",Vstup!C88,\"\")","v":""},{"$f":"IF(Vstup!C88<>\"\",Vstup!D88,\"\")","v":""}]
[null,{"$f":"IF(Vstup!C89<>\"\",Vstup!B89,\"\")","v":""},{"$f":"IF(Vstup!C89<>\"\",Vstup!C89,\"\")","v":""},{"$f":"IF(Vstup!C89<>\"\",Vstup!D89,\"\")","v":""}]
[null,{"$f":"IF(Vstup!C90<>\"\",Vstup!B90,\"\")","v":""},{"$f":"IF(Vstup!C90<>\"\",Vstup!C90,\"\")","v":""},{"$f":"IF(Vstup!C90<>\"\",Vstup!D90,\"\")","v":""}]
[null,{"$f":"IF(Vstup!C91<>\"\",Vstup!B91,\"\")","v":""},{"$f":"IF(Vstup!C91<>\"\",Vstup!C91,\"\")","v":""},{"$f":"IF(Vstup!C91<>\"\",Vstup!D91,\"\")","v":""}]
[null,{"$f":"IF(Vstup!C92<>\"\",Vstup!B92,\"\")","v":""},{"$f":"IF(Vstup!C92<>\"\",Vstup!C92,\"\")","v":""},{"$f":"IF(Vstup!C92<>\"\",Vstup!D92,\"\")","v":""}]
[15,{"$f":"IF(Vstup!C93<>\"\",Vstup!B93,\"\")","v":""},{"$f":"IF(Vstup!C93<>\"\",Vstup!C93,\"\")","v":""},{"$f":"IF(Vstup!C93<>\"\",Vstup!D93,\"\")","v":""}]
[null,{"$f":"IF(Vstup!C94<>\"\",Vstup!B94,\"\")","v":""},{"$f":"IF(Vstup!C94<>\"\",Vstup!C94,\"\")","v":""},{"$f":"IF(Vstup!C94<>\"\",Vstup!D94,\"\")","v":""}]
[null,{"$f":"IF(Vstup!C95<>\"\",Vstup!B95,\"\")","v":""},{"$f":"IF(Vstup!C95<>\"\",Vstup!C95,\"\")","v":""},{"$f":"IF(Vstup!C95<>\"\",Vstup!D95,\"\")","v":""}]
[null,{"$f":"IF(Vstup!C96<>\"\",Vstup!B96,\"\")","v":""},{"$f":"IF(Vstup!C96<>\"\",Vstup!C96,\"\")","v":""},{"$f":"IF(Vstup!C96<>\"\",Vstup!D96,\"\")","v":""}]
[null,{"$f":"IF(Vstup!C97<>\"\",Vstup!B97,\"\")","v":""},{"$f":"IF(Vstup!C97<>\"\",Vstup!C97,\"\")","v":""},{"$f":"IF(Vstup!C97<>\"\",Vstup!D97,\"\")","v":""}]
[null,{"$f":"IF(Vstup!C98<>\"\",Vstup!B98,\"\")","v":""},{"$f":"IF(Vstup!C98<>\"\",Vstup!C98,\"\")","v":""},{"$f":"IF(Vstup!C98<>\"\",Vstup!D98,\"\")","v":""}]
[16,{"$f":"IF(Vstup!C99<>\"\",Vstup!B99,\"\")","v":""},{"$f":"IF(Vstup!C99<>\"\",Vstup!C99,\"\")","v":""},{"$f":"IF(Vstup!C99<>\"\",Vstup!D99,\"\")","v":""}]
[null,{"$f":"IF(Vstup!C100<>\"\",Vstup!B100,\"\")","v":""},{"$f":"IF(Vstup!C100<>\"\",Vstup!C100,\"\")","v":""},{"$f":"IF(Vstup!C100<>\"\",Vstup!D100,\"\")","v":""}]
[null,{"$f":"IF(Vstup!C101<>\"\",Vstup!B101,\"\")","v":""},{"$f":"IF(Vstup!C101<>\"\",Vstup!C101,\"\")","v":""},{"$f":"IF(Vstup!C101<>\"\",Vstup!D101,\"\")","v":""}]
[null,{"$f":"IF(Vstup!C102<>\"\",Vstup!B102,\"\")","v":""},{"$f":"IF(Vstup!C102<>\"\",Vstup!C102,\"\")","v":""},{"$f":"IF(Vstup!C102<>\"\",Vstup!D102,\"\")","v":""}]
[null,{"$f":"IF(Vstup!C103<>\"\",Vstup!B103,\"\")","v":""},{"$f":"IF(Vstup!C103<>\"\",Vstup!C103,\"\")","v":""},{"$f":"IF(Vstup!C103<>\"\",Vstup!D103,\"\")","v":""}]
[null,{"$f":"IF(Vstup!C104<>\"\",Vstup!B104,\"\")","v":""},{"$f":"IF(Vstup!C104<>\"\",Vstup!C104,\"\")","v":""},{"$f":"IF(Vstup!C104<>\"\",Vstup!D104,\"\")","v":""}]
[17,{"$f":"IF(Vstup!C105<>\"\",Vstup!B105,\"\")","v":""},{"$f":"IF(Vstup!C105<>\"\",Vstup!C105,\"\")","v":""},{"$f":"IF(Vstup!C105<>\"\",Vstup!D105,\"\")","v":""}]
[null,{"$f":"IF(Vstup!C106<>\"\",Vstup!B106,\"\")","v":""},{"$f":"IF(Vstup!C106<>\"\",Vstup!C106,\"\")","v":""},{"$f":"IF(Vstup!C106<>\"\",Vstup!D106,\"\")","v":""}]
[null,{"$f":"IF(Vstup!C107<>\"\",Vstup!B107,\"\")","v":""},{"$f":"IF(Vstup!C107<>\"\",Vstup!C107,\"\")","v":""},{"$f":"IF(Vstup!C107<>\"\",Vstup!D107,\"\")","v":""}]
[null,{"$f":"IF(Vstup!C108<>\"\",Vstup!B108,\"\")","v":""},{"$f":"IF(Vstup!C108<>\"\",Vstup!C108,\"\")","v":""},{"$f":"IF(Vstup!C108<>\"\",Vstup!D108,\"\")","v":""}]
[null,{"$f":"IF(Vstup!C109<>\"\",Vstup!B109,\"\")","v":""},{"$f":"IF(Vstup!C109<>\"\",Vstup!C109,\"\")","v":""},{"$f":"IF(Vstup!C109<>\"\",Vstup!D109,\"\")","v":""}]
[null,{"$f":"IF(Vstup!C110<>\"\",Vstup!B110,\"\")","v":""},{"$f":"IF(Vstup!C110<>\"\",Vstup!C110,\"\")","v":""},{"$f":"IF(Vstup!C110<>\"\",Vstup!D110,\"\")","v":""}]
[18,{"$f":"IF(Vstup!C111<>\"\",Vstup!B111,\"\")","v":""},{"$f":"IF(Vstup!C111<>\"\",Vstup!C111,\"\")","v":""},{"$f":"IF(Vstup!C111<>\"\",Vstup!D111,\"\")","v":""}]
[null,{"$f":"IF(Vstup!C112<>\"\",Vstup!B112,\"\")","v":""},{"$f":"IF(Vstup!C112<>\"\",Vstup!C112,\"\")","v":""},{"$f":"IF(Vstup!C112<>\"\",Vstup!D112,\"\")","v":""}]
[null,{"$f":"IF(Vstup!C113<>\"\",Vstup!B113,\"\")","v":""},{"$f":"IF(Vstup!C113<>\"\",Vstup!C113,\"\")","v":""},{"$f":"IF(Vstup!C113<>\"\",Vstup!D113,\"\")","v":""}]
[null,{"$f":"IF(Vstup!C114<>\"\",Vstup!B114,\"\")","v":""},{"$f":"IF(Vstup!C114<>\"\",Vstup!C114,\"\")","v":""},{"$f":"IF(Vstup!C114<>\"\",Vstup!D114,\"\")","v":""}]
[null,{"$f":"IF(Vstup!C115<>\"\",Vstup!B115,\"\")","v":""},{"$f":"IF(Vstup!C115<>\"\",Vstup!C115,\"\")","v":""},{"$f":"IF(Vstup!C115<>\"\",Vstup!D115,\"\")","v":""}]
[null,{"$f":"IF(Vstup!C116<>\"\",Vstup!B116,\"\")","v":""},{"$f":"IF(Vstup!C116<>\"\",Vstup!C116,\"\")","v":""},{"$f":"IF(Vstup!C116<>\"\",Vstup!D116,\"\")","v":""}]
[19,{"$f":"IF(Vstup!C117<>\"\",Vstup!B117,\"\")","v":""},{"$f":"IF(Vstup!C117<>\"\",Vstup!C117,\"\")","v":""},{"$f":"IF(Vstup!C117<>\"\",Vstup!D117,\"\")","v":""},{"$nulls":3},20]
[null,{"$f":"IF(Vstup!C118<>\"\",Vstup!B118,\"\")","v":""},{"$f":"IF(Vstup!C118<>\"\",Vstup!C118,\"\")","v":""},{"$f":"IF(Vstup!C118<>\"\",Vstup!D118,\"\")","v":""}]
[null,{"$f":"IF(Vstup!C119<>\"\",Vstup!B119,\"\")","v":""},{"$f":"IF(Vstup!C119<>\"\",Vstup!C119,\"\")","v":""},{"$f":"IF(Vstup!C119<>\"\",Vstup!D119,\"\")","v":""}]
[null,{"$f":"IF(Vstup!C120<>\"\",Vstup!B120,\"\")","v":""},{"$f":"IF(Vstup!C120<>\"\",Vstup!C120,\"\")","v":""},{"$f":"IF(Vstup!C120<>\"\",Vstup!D120,\"\")","v":""}]
[null,{"$f":"IF(Vstup!C121<>\"\",Vstup!B121,\"\")","v":""},{"$f":"IF(Vstup!C121<>\"\",Vstup!C121,\"\")","v":""},{"$f":"IF(Vstup!C121<>\"\",Vstup!D121,\"\")","v":""}]
[null,{"$f":"IF(Vstup!C122<>\"\",Vstup!B122,\"\")","v":""},{"$f":"IF(Vstup!C122<>\"\",Vstup!C122,\"\")","v":""},{"$f":"IF(Vstup!C122<>\"\",Vstup!D122,\"\")","v":""}]
[20,{"$f":"IF(Vstup!C123<>\"\",Vstup!B123,\"\")","v":""},{"$f":"IF(Vstup!C123<>\"\",Vstup!C123,\"\")","v":""},{"$f":"IF(Vstup!C123<>\"\",Vstup!D123,\"\")","v":""}]
[null,{"$f":"IF(Vstup!C124<>\"\",Vstup!B124,\"\")","v":""},{"$f":"IF(Vstup!C124<>\"\",Vstup!C124,\"\")","v":""},{"$f":"IF(Vstup!C124<>\"\",Vstup!D124,\"\")","v":""}]
[null,{"$f":"IF(Vstup!C125<>\"\",Vstup!B125,\"\")","v":""},{"$f":"IF(Vstup!C125<>\"\",Vstup!C125,\"\")","v":""},{"$f":"IF(Vstup!C125<>\"\",Vstup!D125,\"\")","v":""}]
[null,{"$f":"IF(Vstup!C126<>\"\",Vstup!B126,\"\")","v":""},{"$f":"IF(Vstup!C126<>\"\",Vstup!C126,\"\")","v":""},{"$f":"IF(Vstup!C126<>\"\",Vstup!D126,\"\")","v":""}]
[null,{"$f":"IF(Vstup!C127<>\"\",Vstup!B127,\"\")","v":""},{"$f":"IF(Vstup!C127<>\"\",Vstup!C127,\"\")","v":""},{"$f":"IF(Vstup!C127<>\"\",Vstup!D127,\"\")","v":""}]
[null,{"$f":"IF(Vstup!C128<>\"\",Vstup!B128,\"\")","v":""},{"$f":"IF(Vstup!C128<>\"\",Vstup!C128,\"\")","v":""},{"$f":"IF(Vstup!C128<>\"\",Vstup!D128,\"\")","v":""}]

{"sheet":"List3","index":4,"n_rows":17,"n_cols":15,"rows_kept":17,"hidden":true}
[{"$nulls":3},{"$f":"COUNTIF(D6:D17,\"A\")","v":3}]
[{"$nulls":13},"A",{"$f":"MATCH(\"A\",D6:D17,0)","v":1}]
[{"$nulls":13},"B",{"$f":"MATCH(\"B\",D6:D17,0)","v":4}]
[{"$nulls":13},"C",{"$f":"MATCH(\"C\",D6:D17,0)","v":7}]
[{"$nulls":13},"J",{"$f":"MATCH(\"J\",D6:D17,0)","v":8}]
[null,null,"Hřebec Jan","A",{"$f":"VLOOKUP(C6,VysledkyDoplneni!$C$7:$H$18,3,0)","v":{"$error":"#N/A"}},{"$f":"VLOOKUP($C6,VysledkyDoplneni!$C$7:$H$18,4,0)","v":{"$error":"#N/A"}},{"$f":"VLOOKUP($C6,VysledkyDoplneni!$C$7:$H$18,5,0)","v":{"$error":"#N/A"}},{"$f":"VLOOKUP($C6,VysledkyDoplneni!$C$7:$H$18,6,0)","v":{"$error":"#N/A"}},{"$f":"VLOOKUP($C6,VysledkyDoplneni!$C$7:$H$18,7,0)","v":{"$error":"#N/A"}},{"$nulls":4},"V",{"$f":"MATCH(\"V\",D6:D17,0)","v":12}]
[null,null,"Štengl Jiří","A",{"$f":"VLOOKUP(C7,VysledkyDoplneni!$C$7:$H$18,3,0)","v":{"$error":"#N/A"}},{"$f":"VLOOKUP($C7,VysledkyDoplneni!$C$7:$H$18,4,0)","v":{"$error":"#N/A"}},{"$f":"VLOOKUP($C7,VysledkyDoplneni!$C$7:$H$18,5,0)","v":{"$error":"#N/A"}},{"$f":"VLOOKUP($C7,VysledkyDoplneni!$C$7:$H$18,6,0)","v":{"$error":"#N/A"}},{"$f":"VLOOKUP($C7,VysledkyDoplneni!$C$7:$H$18,7,0)","v":{"$error":"#N/A"}}]
[null,null,"Zázvorka Pavel","A",{"$f":"VLOOKUP(C8,VysledkyDoplneni!$C$7:$H$18,3,0)","v":{"$error":"#N/A"}},{"$f":"VLOOKUP($C8,VysledkyDoplneni!$C$7:$H$18,4,0)","v":{"$error":"#N/A"}},{"$f":"VLOOKUP($C8,VysledkyDoplneni!$C$7:$H$18,5,0)","v":{"$error":"#N/A"}},{"$f":"VLOOKUP($C8,VysledkyDoplneni!$C$7:$H$18,6,0)","v":{"$error":"#N/A"}},{"$f":"VLOOKUP($C8,VysledkyDoplneni!$C$7:$H$18,7,0)","v":{"$error":"#N/A"}}]
[null,null,"Honz Petr","B",{"$f":"VLOOKUP(C9,VysledkyDoplneni!$C$7:$H$18,3,0)","v":{"$error":"#N/A"}},{"$f":"VLOOKUP($C9,VysledkyDoplneni!$C$7:$H$18,4,0)","v":{"$error":"#N/A"}},{"$f":"VLOOKUP($C9,VysledkyDoplneni!$C$7:$H$18,5,0)","v":{"$error":"#N/A"}},{"$f":"VLOOKUP($C9,VysledkyDoplneni!$C$7:$H$18,6,0)","v":{"$error":"#N/A"}},{"$f":"VLOOKUP($C9,VysledkyDoplneni!$C$7:$H$18,7,0)","v":{"$error":"#N/A"}}]
[null,null,"Kodeš Václav","B",{"$f":"VLOOKUP(C10,VysledkyDoplneni!$C$7:$H$18,3,0)","v":{"$error":"#N/A"}},{"$f":"VLOOKUP($C10,VysledkyDoplneni!$C$7:$H$18,4,0)","v":{"$error":"#N/A"}},{"$f":"VLOOKUP($C10,VysledkyDoplneni!$C$7:$H$18,5,0)","v":{"$error":"#N/A"}},{"$f":"VLOOKUP($C10,VysledkyDoplneni!$C$7:$H$18,6,0)","v":{"$error":"#N/A"}},{"$f":"VLOOKUP($C10,VysledkyDoplneni!$C$7:$H$18,7,0)","v":{"$error":"#N/A"}}]
[null,null,"Pacal Antonín","B",{"$f":"VLOOKUP(C11,VysledkyDoplneni!$C$7:$H$18,3,0)","v":{"$error":"#N/A"}},{"$f":"VLOOKUP($C11,VysledkyDoplneni!$C$7:$H$18,4,0)","v":{"$error":"#N/A"}},{"$f":"VLOOKUP($C11,VysledkyDoplneni!$C$7:$H$18,5,0)","v":{"$error":"#N/A"}},{"$f":"VLOOKUP($C11,VysledkyDoplneni!$C$7:$H$18,6,0)","v":{"$error":"#N/A"}},{"$f":"VLOOKUP($C11,VysledkyDoplneni!$C$7:$H$18,7,0)","v":{"$error":"#N/A"}}]
[null,null,"Není v tabulce ASATu","C",{"$f":"VLOOKUP(C12,VysledkyDoplneni!$C$7:$H$18,3,0)","v":{"$error":"#N/A"}},{"$f":"VLOOKUP($C12,VysledkyDoplneni!$C$7:$H$18,4,0)","v":{"$error":"#N/A"}},{"$f":"VLOOKUP($C12,VysledkyDoplneni!$C$7:$H$18,5,0)","v":{"$error":"#N/A"}},{"$f":"VLOOKUP($C12,VysledkyDoplneni!$C$7:$H$18,6,0)","v":{"$error":"#N/A"}},{"$f":"VLOOKUP($C12,VysledkyDoplneni!$C$7:$H$18,7,0)","v":{"$error":"#N/A"}}]
[null,null,"Divíšek Martin ml.","J",{"$f":"VLOOKUP(C13,VysledkyDoplneni!$C$7:$H$18,3,0)","v":{"$error":"#N/A"}},{"$f":"VLOOKUP($C13,VysledkyDoplneni!$C$7:$H$18,4,0)","v":{"$error":"#N/A"}},{"$f":"VLOOKUP($C13,VysledkyDoplneni!$C$7:$H$18,5,0)","v":{"$error":"#N/A"}},{"$f":"VLOOKUP($C13,VysledkyDoplneni!$C$7:$H$18,6,0)","v":{"$error":"#N/A"}},{"$f":"VLOOKUP($C13,VysledkyDoplneni!$C$7:$H$18,7,0)","v":{"$error":"#N/A"}}]
[null,null,"Hřebec Jan ml.","J",{"$f":"VLOOKUP(C14,VysledkyDoplneni!$C$7:$H$18,3,0)","v":{"$error":"#N/A"}},{"$f":"VLOOKUP($C14,VysledkyDoplneni!$C$7:$H$18,4,0)","v":{"$error":"#N/A"}},{"$f":"VLOOKUP($C14,VysledkyDoplneni!$C$7:$H$18,5,0)","v":{"$error":"#N/A"}},{"$f":"VLOOKUP($C14,VysledkyDoplneni!$C$7:$H$18,6,0)","v":{"$error":"#N/A"}},{"$f":"VLOOKUP($C14,VysledkyDoplneni!$C$7:$H$18,7,0)","v":{"$error":"#N/A"}}]
[null,null,"Jankovský Jakub","J",{"$f":"VLOOKUP(C15,VysledkyDoplneni!$C$7:$H$18,3,0)","v":{"$error":"#N/A"}},{"$f":"VLOOKUP($C15,VysledkyDoplneni!$C$7:$H$18,4,0)","v":{"$error":"#N/A"}},{"$f":"VLOOKUP($C15,VysledkyDoplneni!$C$7:$H$18,5,0)","v":{"$error":"#N/A"}},{"$f":"VLOOKUP($C15,VysledkyDoplneni!$C$7:$H$18,6,0)","v":{"$error":"#N/A"}},{"$f":"VLOOKUP($C15,VysledkyDoplneni!$C$7:$H$18,7,0)","v":{"$error":"#N/A"}}]
[null,null,"Štenglová Michaela","J",{"$f":"VLOOKUP(C16,VysledkyDoplneni!$C$7:$H$18,3,0)","v":15},{"$f":"VLOOKUP($C16,VysledkyDoplneni!$C$7:$H$18,4,0)","v":14},{"$f":"VLOOKUP($C16,VysledkyDoplneni!$C$7:$H$18,5,0)","v":13},{"$f":"VLOOKUP($C16,VysledkyDoplneni!$C$7:$H$18,6,0)","v":0},{"$f":"VLOOKUP($C16,VysledkyDoplneni!$C$7:$H$18,7,0)","v":{"$error":"#REF!"}}]
[null,null,"Neuvirt Václav","V",{"$f":"VLOOKUP(C17,VysledkyDoplneni!$C$7:$H$18,3,0)","v":{"$error":"#N/A"}},{"$f":"VLOOKUP($C17,VysledkyDoplneni!$C$7:$H$18,4,0)","v":{"$error":"#N/A"}},{"$f":"VLOOKUP($C17,VysledkyDoplneni!$C$7:$H$18,5,0)","v":{"$error":"#N/A"}},{"$f":"VLOOKUP($C17,VysledkyDoplneni!$C$7:$H$18,6,0)","v":{"$error":"#N/A"}},{"$f":"VLOOKUP($C17,VysledkyDoplneni!$C$7:$H$18,7,0)","v":{"$error":"#N/A"}}]

{"sheet":"ASAT2","index":5,"n_rows":580,"n_cols":7,"rows_kept":580}
[]
[]
[null,"  Kat.","  Závody","  Terče","  Zásahy","  Průměr","  Kategorie"]
["Čech Petr","  J",1,100,82,{"v":0.82,"d":"82.00%"},"  J"]
["Kopáček Radim","  J",5,770,600,{"v":0.779,"d":"77.90%"},"  J"]
["Hřebec Jan ml.","  J",10,1540,1112,{"v":0.722,"d":"72.20%"},"  J"]
["Divíšek Martin ml.","  J",10,1600,1133,{"v":0.708,"d":"70.80%"},"  J"]
["Kožený Jan","  J",1,100,69,{"v":0.69,"d":"69.00%"},"  J"]
["Vaněk Matěj","  J",1,100,66,{"v":0.66,"d":"66.00%"},"  J"]
["Můčka Michal","  J",6,880,567,{"v":0.644,"d":"64.40%"},"  J"]
["Šindelář Jiří ml.","  J",7,1080,663,{"v":0.614,"d":"61.40%"},"  J"]
["Suk Jan","  J",1,150,87,{"v":0.58,"d":"58.00%"},"  J"]
["Šindelář Martin","  J",4,620,339,{"v":0.547,"d":"54.70%"},"  J"]
["Köberle Michael","  J",1,150,79,{"v":0.527,"d":"52.70%"},"  J"]
["Němec Vladimír","  J",2,400,199,{"v":0.498,"d":"49.80%"},"  J"]
["Konop Svatopluk","  J",1,150,71,{"v":0.473,"d":"47.30%"},"  J"]
["Herel Hubert","  J",1,150,67,{"v":0.447,"d":"44.70%"},"  J"]
["Čechura Miroslav","  J",0,0,0,{"v":0,"d":"0.00%"},"  J"]
["Ferkl Jan ml.","  J",0,0,0,{"v":0,"d":"0.00%"},"  J"]
["Chocholatý Libor","  J",0,0,0,{"v":0,"d":"0.00%"},"  J"]
["Korčák Daniel","  J",0,0,0,{"v":0,"d":"0.00%"},"  J"]
["Linhart Filip","  J",0,0,0,{"v":0,"d":"0.00%"},"  J"]
["Mikula Petr","  J",0,0,0,{"v":0,"d":"0.00%"},"  J"]
[]
[]
[]
[]
[null,"  Kat.","  Závody","  Terče","  Zásahy","  Průměr","  Kategorie"]
["Roth Christiane","  Ž",1,200,155,{"v":0.775,"d":"77.50%"},"  Ž"]
["Kopper Renate","  Ž",1,100,75,{"v":0.75,"d":"75.00%"},"  Ž"]
["Bittner Eva Maria","  Ž",1,100,64,{"v":0.64,"d":"64.00%"},"  Ž"]
["Klausz Brigitte","  Ž",1,100,64,{"v":0.64,"d":"64.00%"},"  Ž"]
["Štenglová Michaela","  Ž",9,1320,764,{"v":0.579,"d":"57.90%"},"  Ž"]
["Staňková Eva","  Ž",2,300,169,{"v":0.563,"d":"56.30%"},"  Ž"]
["Urie Zuzana","  Ž",7,990,548,{"v":0.554,"d":"55.40%"},"  Ž"]
["Laner Andrea","  Ž",1,160,88,{"v":0.55,"d":"55.00%"},"  Ž"]
["Zeilinger Elisabeth","  Ž",2,200,110,{"v":0.55,"d":"55.00%"},"  Ž"]
["Bunikowska Katarzyna","  Ž",1,100,51,{"v":0.51,"d":"51.00%"},"  Ž"]
["Turečková Lucie","  Ž",1,120,50,{"v":0.417,"d":"41.70%"},"  Ž"]
["Pangrácová Barbora","  Ž",4,560,213,{"v":0.38,"d":"38.00%"},"  Ž"]
["Bajtlová Helena","  Ž",0,0,0,{"v":0,"d":"0.00%"},"  Ž"]
["Hýnová Šárka","  Ž",0,0,0,{"v":0,"d":"0.00%"},"  Ž"]
["Krejzová Vlasta","  Ž",0,0,0,{"v":0,"d":"0.00%"},"  Ž"]
["Víchová Anna","  Ž",0,0,0,{"v":0,"d":"0.00%"},"  Ž"]
[]
[]
[]
[]
[null,"  Kat.","  Závody","  Terče","  Zásahy","  Průměr","  Kategorie"]
["Maschke Michael","  S",1,100,89,{"v":0.89,"d":"89.00%"},"  A"]
["Hondl František","  S",6,910,793,{"v":0.871,"d":"87.10%"},"  A"]
["Halouzka Benedikt","  S",1,100,87,{"v":0.87,"d":"87.00%"},"  A"]
["Činčera Přemysl","  S",12,1800,1554,{"v":0.863,"d":"86.30%"},"  A"]
["Zázvorka Pavel","  S",10,1500,1295,{"v":0.863,"d":"86.30%"},"  A"]
["Michálek Lubomír","  S",7,1100,942,{"v":0.856,"d":"85.60%"},"  A"]
["Kaminski Marcin","  S",1,150,126,{"v":0.84,"d":"84.00%"},"  A"]
["Mrhálek Karel","  S",1,100,84,{"v":0.84,"d":"84.00%"},"  A"]
["Rybín Milan","  S",12,1900,1591,{"v":0.837,"d":"83.70%"},"  A"]
["Hřebec Jan","  S",11,1650,1375,{"v":0.833,"d":"83.30%"},"  A"]
["Staněk Tomáš","  S",2,300,249,{"v":0.83,"d":"83.00%"},"  A"]
["Němeček Josef","  S",1,100,83,{"v":0.83,"d":"83.00%"},"  A"]
["Koplzynski Januš","  S",1,150,124,{"v":0.827,"d":"82.70%"},"  A"]
["Divíšek Martin","  S",13,2060,1699,{"v":0.825,"d":"82.50%"},"  A"]
["Salaj Josef","  S",8,1170,961,{"v":0.821,"d":"82.10%"},"  A"]
["Šlechta Martin","  S",1,100,82,{"v":0.82,"d":"82.00%"},"  A"]
["Matějů Filip","  S",1,150,123,{"v":0.82,"d":"82.00%"},"  A"]
["Černošek Milan","  S",4,520,426,{"v":0.819,"d":"81.90%"},"  A"]
["Čechura Martin","  S",1,160,131,{"v":0.819,"d":"81.90%"},"  A"]
["Staněk Karel","  S",4,600,488,{"v":0.813,"d":"81.30%"},"  A"]
["Preyer Leopold","  S",8,1180,957,{"v":0.811,"d":"81.10%"},"  A"]
["Halouzka Tomáš","  S",1,100,81,{"v":0.81,"d":"81.00%"},"  A"]
["Jung Johannes","  S",4,630,509,{"v":0.808,"d":"80.80%"},"  A"]
["Škanta Marek","  S",5,770,622,{"v":0.808,"d":"80.80%"},"  A"]
["Špaček Pavel","  S",8,1290,1040,{"v":0.806,"d":"80.60%"},"  A"]
["Klement Petr","  S",2,200,160,{"v":0.8,"d":"80.00%"},"  A"]
["Kořínek Jindřich","  S",1,100,80,{"v":0.8,"d":"80.00%"},"  A"]
["Pacyga Bartoloměj","  S",1,150,120,{"v":0.8,"d":"80.00%"},"  A"]
["Ratzenbock Karl","  S",1,200,160,{"v":0.8,"d":"80.00%"},"  A"]
["Jankovský Miroslav","  S",11,1690,1349,{"v":0.798,"d":"79.80%"},"  A"]
["Pluciński Marcin","  S",2,350,279,{"v":0.797,"d":"79.70%"},"  A"]
["Můčka Igor","  S",7,1030,819,{"v":0.795,"d":"79.50%"},"  A"]
["Fojt Martin","  S",2,200,159,{"v":0.795,"d":"79.50%"},"  A"]
["Štengl Jiří","  S",11,1680,1333,{"v":0.793,"d":"79.30%"},"  A"]
["Koloc Martin","  S",9,1300,1031,{"v":0.793,"d":"79.30%"},"  A"]
["Sokola Bronislav","  S",5,750,593,{"v":0.791,"d":"79.10%"},"  A"]
["Novák Libor","  S",2,360,283,{"v":0.786,"d":"78.60%"},"  A"]
["Zeilinger Gerhard","  S",2,200,157,{"v":0.785,"d":"78.50%"},"  A"]
["Lengyel Jan","  S",7,1030,805,{"v":0.782,"d":"78.20%"},"  A"]
["Hlaváček Václav","  S",1,100,78,{"v":0.78,"d":"78.00%"},"  A"]
["Steiner Jan","  S",1,200,156,{"v":0.78,"d":"78.00%"},"  A"]
["Šrom Petr","  S",1,100,78,{"v":0.78,"d":"78.00%"},"  A"]
["Hruška Pavel","  S",6,870,678,{"v":0.779,"d":"77.90%"},"  A"]
["Kotrc Karel","  S",3,380,296,{"v":0.779,"d":"77.90%"},"  A"]
["Amler Walter","  S",2,320,249,{"v":0.778,"d":"77.80%"},"  A"]
["Szolga Josef","  S",1,200,155,{"v":0.775,"d":"77.50%"},"  A"]
["Frenkl Jiří","  S",1,200,155,{"v":0.775,"d":"77.50%"},"  A"]
["Marinč Matic","  S",2,400,309,{"v":0.773,"d":"77.30%"},"  A"]
["Zucker Gerhard","  S",2,200,154,{"v":0.77,"d":"77.00%"},"  A"]
["Kočí Radek","  S",1,160,123,{"v":0.769,"d":"76.90%"},"  A"]
["Vaňáč Václav","  S",6,1000,764,{"v":0.764,"d":"76.40%"},"  A"]
["Šindelář Milan","  S",2,260,198,{"v":0.762,"d":"76.20%"},"  A"]
["Štícha Lubomír","  S",11,1660,1264,{"v":0.761,"d":"76.10%"},"  A"]
["Hertl Igor","  S",8,1250,948,{"v":0.758,"d":"75.80%"},"  A"]
["Stanislav Tomáš","  S",10,1480,1120,{"v":0.757,"d":"75.70%"},"  A"]
["Neuvirt Martin","  S",8,1390,1048,{"v":0.754,"d":"75.40%"},"  A"]
["Kadlec Miroslav","  S",2,220,165,{"v":0.75,"d":"75.00%"},"  A"]
["Fiala Gerhard","  S",1,100,75,{"v":0.75,"d":"75.00%"},"  A"]
["Ornst Milan","  S",1,100,75,{"v":0.75,"d":"75.00%"},"  A"]
["Halouzka Lukáš","  S",0,0,0,{"v":0,"d":"0.00%"},"  A"]
["Jarolím Zdeněk","  S",0,0,0,{"v":0,"d":"0.00%"},"  A"]
["Kobes Jan","  S",0,0,0,{"v":0,"d":"0.00%"},"  A"]
["Kroupa Roman","  S",0,0,0,{"v":0,"d":"0.00%"},"  A"]
["Lyczykowski Kryzstof","  S",0,0,0,{"v":0,"d":"0.00%"},"  A"]
["Pápeš Milan","  S",0,0,0,{"v":0,"d":"0.00%"},"  A"]
["Podsedník Ladislav","  S",0,0,0,{"v":0,"d":"0.00%"},"  A"]
["Vranka Petr","  S",0,0,0,{"v":0,"d":"0.00%"},"  A"]
["Vrzáň Josef ml.","  S",0,0,0,{"v":0,"d":"0.00%"},"  A"]
["Wlodarczyk Remigiusz","  S",0,0,0,{"v":0,"d":"0.00%"},"  A"]
["Zvolánek Petr","  S",0,0,0,{"v":0,"d":"0.00%"},"  A"]
[]
[]
[]
[]
[null,"  Kat.","  Závody","  Terče","  Zásahy","  Průměr","  Kategorie"]
["Honz Petr","  S",7,990,741,{"v":0.748,"d":"74.80%"},"  B"]
["Zigo Martin","  S",6,910,679,{"v":0.746,"d":"74.60%"},"  B"]
["Vaněk Roman","  S",6,930,693,{"v":0.745,"d":"74.50%"},"  B"]
["Mácha Karel","  S",3,360,268,{"v":0.744,"d":"74.40%"},"  B"]
["Komárek Josef","  S",6,1000,743,{"v":0.743,"d":"74.30%"},"  B"]
["Musil Zdeněk","  S",4,420,312,{"v":0.743,"d":"74.30%"},"  B"]
["Pražák Petr","  S",3,420,311,{"v":0.74,"d":"74.00%"},"  B"]
["Vavrečka Michal","  S",2,350,259,{"v":0.74,"d":"74.00%"},"  B"]
["Czerski Pawel","  S",1,100,74,{"v":0.74,"d":"74.00%"},"  B"]
["Pokrzywka Pawel","  S",1,100,74,{"v":0.74,"d":"74.00%"},"  B"]
["Vlček Martin","  S",1,100,74,{"v":0.74,"d":"74.00%"},"  B"]
["Cífka Jan","  S",1,100,74,{"v":0.74,"d":"74.00%"},"  B"]
["Walter Michael","  S",1,100,74,{"v":0.74,"d":"74.00%"},"  B"]
["Jankovský Jakub","  S",1,160,118,{"v":0.738,"d":"73.80%"},"  B"]
["Lengyel Ivan","  S",5,670,494,{"v":0.737,"d":"73.70%"},"  B"]
["Kaprálek Michal","  S",3,420,309,{"v":0.736,"d":"73.60%"},"  B"]
["Němec Tomáš","  S",3,520,382,{"v":0.735,"d":"73.50%"},"  B"]
["Dočkal Jiří","  S",4,500,367,{"v":0.734,"d":"73.40%"},"  B"]
["Kopáček Pavel","  S",3,450,330,{"v":0.733,"d":"73.30%"},"  B"]
["Eder Robert","  S",2,300,220,{"v":0.733,"d":"73.30%"},"  B"]
["Lengyel Jiří","  S",8,1150,842,{"v":0.732,"d":"73.20%"},"  B"]
["Žofka Josef","  S",1,160,117,{"v":0.731,"d":"73.10%"},"  B"]
["Prokeš Martin","  S",1,100,73,{"v":0.73,"d":"73.00%"},"  B"]
["Staněk Tomáš","  S",1,100,73,{"v":0.73,"d":"73.00%"},"  B"]
["Mikulka Peter","  S",13,2000,1452,{"v":0.726,"d":"72.60%"},"  B"]
["Schwerdt Tobias","  S",2,320,232,{"v":0.725,"d":"72.50%"},"  B"]
["Pučálka Karel","  S",2,260,188,{"v":0.723,"d":"72.30%"},"  B"]
["Straka Ladislav ml.","  S",3,360,260,{"v":0.722,"d":"72.20%"},"  B"]
["Jindříšek Pavel","  S",1,100,72,{"v":0.72,"d":"72.00%"},"  B"]
["Husar Vladimír","  S",7,940,670,{"v":0.713,"d":"71.30%"},"  B"]
["Hlušička Martin","  S",7,970,691,{"v":0.712,"d":"71.20%"},"  B"]
["Chrudimský Petr","  S",1,100,71,{"v":0.71,"d":"71.00%"},"  B"]
["Rykr Eduard","  S",1,100,71,{"v":0.71,"d":"71.00%"},"  B"]
["Röttenbacher Uwe","  S",2,320,227,{"v":0.709,"d":"70.90%"},"  B"]
["Hertl Rastislav","  S",7,1090,771,{"v":0.707,"d":"70.70%"},"  B"]
["Někoranec Igor","  S",2,300,212,{"v":0.707,"d":"70.70%"},"  B"]
["Borák Ondřej","  S",3,400,282,{"v":0.705,"d":"70.50%"},"  B"]
["Molnár Anton","  S",3,470,330,{"v":0.702,"d":"70.20%"},"  B"]
["Maruška Jaromír","  S",2,220,154,{"v":0.7,"d":"70.00%"},"  B"]
["Berčík Martin","  S",1,100,70,{"v":0.7,"d":"70.00%"},"  B"]
["Hanuš Jan","  S",1,120,84,{"v":0.7,"d":"70.00%"},"  B"]
["Klesnil Zdeněk ml.","  S",1,100,70,{"v":0.7,"d":"70.00%"},"  B"]
["Náhlík Miroslav","  S",1,100,70,{"v":0.7,"d":"70.00%"},"  B"]
["Ruck Alois","  S",2,350,244,{"v":0.697,"d":"69.70%"},"  B"]
["Škrna Jiří","  S",3,430,298,{"v":0.693,"d":"69.30%"},"  B"]
["Zelina Aleš","  S",1,100,69,{"v":0.69,"d":"69.00%"},"  B"]
["Korál Petr","  S",4,680,467,{"v":0.687,"d":"68.70%"},"  B"]
["Hess Slavomír","  S",1,150,103,{"v":0.687,"d":"68.70%"},"  B"]
["Prokop Jiří","  S",8,1110,760,{"v":0.685,"d":"68.50%"},"  B"]
["Vranák Martin","  S",10,1500,1027,{"v":0.685,"d":"68.50%"},"  B"]
["Lebloch Vladimír","  S",4,650,445,{"v":0.685,"d":"68.50%"},"  B"]
["Mocek Michal","  S",2,220,150,{"v":0.682,"d":"68.20%"},"  B"]
["Potůček Jaroslav","  S",3,360,245,{"v":0.681,"d":"68.10%"},"  B"]
["Babický Jiří","  S",0,0,0,{"v":0,"d":"0.00%"},"  B"]
["Bejček Václav ml.","  S",0,0,0,{"v":0,"d":"0.00%"},"  B"]
["Bělík Michal","  S",0,0,0,{"v":0,"d":"0.00%"},"  B"]
["Beneš Jan","  S",0,0,0,{"v":0,"d":"0.00%"},"  B"]
["Buda Dušan","  S",0,0,0,{"v":0,"d":"0.00%"},"  B"]
["Cieplik Waldemar","  S",0,0,0,{"v":0,"d":"0.00%"},"  B"]
["Červenka Zbyněk","  S",0,0,0,{"v":0,"d":"0.00%"},"  B"]
["Čuda Milan","  S",0,0,0,{"v":0,"d":"0.00%"},"  B"]
["Divíšek Tomáš","  S",0,0,0,{"v":0,"d":"0.00%"},"  B"]
["Hrouda Josef","  S",0,0,0,{"v":0,"d":"0.00%"},"  B"]
["Chaloupský Zdeněk","  S",0,0,0,{"v":0,"d":"0.00%"},"  B"]
["Jedros Witold","  S",0,0,0,{"v":0,"d":"0.00%"},"  B"]
["Kaiser Vladimír","  S",0,0,0,{"v":0,"d":"0.00%"},"  B"]
["Kodeš Václav","  S",0,0,0,{"v":0,"d":"0.00%"},"  B"]
["Krázel Stanislav","  S",0,0,0,{"v":0,"d":"0.00%"},"  B"]
["Krejza Jan","  S",0,0,0,{"v":0,"d":"0.00%"},"  B"]
["Kytlica Vilém","  S",0,0,0,{"v":0,"d":"0.00%"},"  B"]
["Liška Vladislav","  S",0,0,0,{"v":0,"d":"0.00%"},"  B"]
["Mach Jan","  S",0,0,0,{"v":0,"d":"0.00%"},"  B"]
["Málek Vlastimil","  S",0,0,0,{"v":0,"d":"0.00%"},"  B"]
["Mateiczek Marek","  S",0,0,0,{"v":0,"d":"0.00%"},"  B"]
["Minář Jaroslav","  S",0,0,0,{"v":0,"d":"0.00%"},"  B"]
["Mládek Jan","  S",0,0,0,{"v":0,"d":"0.00%"},"  B"]
["Nesiba Josef","  S",0,0,0,{"v":0,"d":"0.00%"},"  B"]
["Neuman Miloslav","  S",0,0,0,{"v":0,"d":"0.00%"},"  B"]
["Pandula Ivan","  S",0,0,0,{"v":0,"d":"0.00%"},"  B"]
["Poupě Jaroslav","  S",0,0,0,{"v":0,"d":"0.00%"},"  B"]
["Pulicar Jaroslav","  S",0,0,0,{"v":0,"d":"0.00%"},"  B"]
["Racek Petr","  S",0,0,0,{"v":0,"d":"0.00%"},"  B"]
["Stránský Lukáš","  S",0,0,0,{"v":0,"d":"0.00%"},"  B"]
["Svoboda Vít","  S",0,0,0,{"v":0,"d":"0.00%"},"  B"]
["Sysel Tomáš","  S",0,0,0,{"v":0,"d":"0.00%"},"  B"]
["Šílený Josef","  S",0,0,0,{"v":0,"d":"0.00%"},"  B"]
["Tůma Martin","  S",0,0,0,{"v":0,"d":"0.00%"},"  B"]
["Ušatý Miroslav","  S",0,0,0,{"v":0,"d":"0.00%"},"  B"]
["Vala Jiří","  S",0,0,0,{"v":0,"d":"0.00%"},"  B"]
["Valapka Peter","  S",0,0,0,{"v":0,"d":"0.00%"},"  B"]
["Vostárek Jindřich","  S",0,0,0,{"v":0,"d":"0.00%"},"  B"]
["Vrbas Josef","  S",0,0,0,{"v":0,"d":"0.00%"},"  B"]
["Vrzáň Josef","  S",0,0,0,{"v":0,"d":"0.00%"},"  B"]
["Zíta Ladislav","  S",0,0,0,{"v":0,"d":"0.00%"},"  B"]
["Žák Josef","  S",0,0,0,{"v":0,"d":"0.00%"},"  B"]
[]
[]
[]
[]
[null,"  Kat.","  Závody","  Terče","  Zásahy","  Průměr","  Kategorie"]
["Vranka David","  S",2,300,203,{"v":0.677,"d":"67.70%"},"  C"]
["Hosnedl Pavel","  S",9,1310,885,{"v":0.676,"d":"67.60%"},"  C"]
["Pospíšil Stanislav","  S",1,160,108,{"v":0.675,"d":"67.50%"},"  C"]
["Hoštička Eduard","  S",4,680,458,{"v":0.674,"d":"67.40%"},"  C"]
["Nosek Tomáš","  S",2,300,202,{"v":0.673,"d":"67.30%"},"  C"]
["Masaryk Boris","  S",4,580,390,{"v":0.672,"d":"67.20%"},"  C"]
["Housa Oldřich","  S",1,100,67,{"v":0.67,"d":"67.00%"},"  C"]
["Kyliánek Petr","  S",1,200,134,{"v":0.67,"d":"67.00%"},"  C"]
["Čech Antonín","  S",1,100,67,{"v":0.67,"d":"67.00%"},"  C"]
["Prokeš Vladimír","  S",1,100,67,{"v":0.67,"d":"67.00%"},"  C"]
["Kašpar Jiří","  S",5,770,515,{"v":0.669,"d":"66.90%"},"  C"]
["Matoušek Václav","  S",4,550,366,{"v":0.665,"d":"66.50%"},"  C"]
["Dvořák Miloš","  S",1,200,133,{"v":0.665,"d":"66.50%"},"  C"]
["Pacal Antonín","  S",3,320,212,{"v":0.663,"d":"66.30%"},"  C"]
["Černý Bohuslav","  S",2,320,212,{"v":0.663,"d":"66.30%"},"  C"]
["Salaj Zdeněk","  S",4,650,429,{"v":0.66,"d":"66.00%"},"  C"]
["Mahel Jindřich","  S",1,100,66,{"v":0.66,"d":"66.00%"},"  C"]
["Rykr Eduard ml.","  S",1,100,66,{"v":0.66,"d":"66.00%"},"  C"]
["Tomeček Karel","  S",1,200,131,{"v":0.655,"d":"65.50%"},"  C"]
["Steklý Zdeněk","  S",1,150,98,{"v":0.653,"d":"65.30%"},"  C"]
["Zavadski Kryzstof","  S",1,150,98,{"v":0.653,"d":"65.30%"},"  C"]
["Čech Pavel","  S",1,100,65,{"v":0.65,"d":"65.00%"},"  C"]
["Forster Gustav","  S",1,100,65,{"v":0.65,"d":"65.00%"},"  C"]
["Bittner Robert","  S",1,100,65,{"v":0.65,"d":"65.00%"},"  C"]
["Stodůlka František","  S",1,100,65,{"v":0.65,"d":"65.00%"},"  C"]
["Kraus Josef","  S",1,100,64,{"v":0.64,"d":"64.00%"},"  C"]
["Sochor Jiří","  S",1,200,128,{"v":0.64,"d":"64.00%"},"  C"]
["Koncilja Franci","  ",1,200,127,{"v":0.635,"d":"63.50%"},"  C"]
["Němec Vít","  S",1,150,95,{"v":0.633,"d":"63.30%"},"  C"]
["Kureš Jan","  S",4,520,329,{"v":0.633,"d":"63.30%"},"  C"]
["Hájek David","  S",4,560,354,{"v":0.632,"d":"63.20%"},"  C"]
["Horák František","  S",1,100,63,{"v":0.63,"d":"63.00%"},"  C"]
["Klásek Václav","  S",1,200,126,{"v":0.63,"d":"63.00%"},"  C"]
["Lukeš Štěpán","  S",1,100,63,{"v":0.63,"d":"63.00%"},"  C"]
["Zelinka Jaroslav","  S",1,100,63,{"v":0.63,"d":"63.00%"},"  C"]
["Petrůj Zdeněk","  S",4,520,327,{"v":0.629,"d":"62.90%"},"  C"]
["Herel Tomáš","  S",1,150,94,{"v":0.627,"d":"62.70%"},"  C"]
["Musel Jan","  S",2,270,169,{"v":0.626,"d":"62.60%"},"  C"]
["Weiss Josef","  S",7,1000,620,{"v":0.62,"d":"62.00%"},"  C"]
["Čumpl Zdeněk","  S",1,100,62,{"v":0.62,"d":"62.00%"},"  C"]
["Wiesinger Hannes","  S",1,100,62,{"v":0.62,"d":"62.00%"},"  C"]
["Soukal František","  S",2,220,136,{"v":0.618,"d":"61.80%"},"  C"]
["Zborník Karel","  S",3,500,309,{"v":0.618,"d":"61.80%"},"  C"]
["Housa Karel","  S",2,250,154,{"v":0.616,"d":"61.60%"},"  C"]
["Spanilý Ivo","  S",2,200,122,{"v":0.61,"d":"61.00%"},"  C"]
["Gregor Aleš","  S",6,730,444,{"v":0.608,"d":"60.80%"},"  C"]
["Kopejtko Vladimír","  S",2,300,182,{"v":0.607,"d":"60.70%"},"  C"]
["Hausner Florian","  S",2,320,194,{"v":0.606,"d":"60.60%"},"  C"]
["Backa Lukáš","  S",2,200,121,{"v":0.605,"d":"60.50%"},"  C"]
["Sahula Vlastimil","  S",6,790,475,{"v":0.601,"d":"60.10%"},"  C"]
["Kupka Přemysl","  S",1,100,60,{"v":0.6,"d":"60.00%"},"  C"]
["Šimon Jaroslav","  S",1,100,60,{"v":0.6,"d":"60.00%"},"  C"]
["Červenka Jaroslav","  S",1,120,71,{"v":0.592,"d":"59.20%"},"  C"]
["Kirchner Milan","  S",1,120,71,{"v":0.592,"d":"59.20%"},"  C"]
["Filippi Marcel","  S",7,1030,609,{"v":0.591,"d":"59.10%"},"  C"]
["Malinský Zbyněk","  S",1,100,59,{"v":0.59,"d":"59.00%"},"  C"]
["Daněk Tomáš","  S",1,100,59,{"v":0.59,"d":"59.00%"},"  C"]
["Miegl Josef","  S",1,100,59,{"v":0.59,"d":"59.00%"},"  C"]
["Král Jaroslav","  S",1,150,88,{"v":0.587,"d":"58.70%"},"  C"]
["Dolanský Jan","  S",8,1100,643,{"v":0.585,"d":"58.50%"},"  C"]
["Hedvik Jaromír","  S",8,1200,697,{"v":0.581,"d":"58.10%"},"  C"]
["Klíma Leoš","  S",2,260,150,{"v":0.577,"d":"57.70%"},"  C"]
["Hejduk Josef","  S",2,270,154,{"v":0.57,"d":"57.00%"},"  C"]
["Bouz Pavel","  S",3,350,199,{"v":0.569,"d":"56.90%"},"  C"]
["Förster Karel","  S",6,960,544,{"v":0.567,"d":"56.70%"},"  C"]
["Havlík Aleš","  S",1,200,113,{"v":0.565,"d":"56.50%"},"  C"]
["Rataj Václav","  S",2,310,175,{"v":0.565,"d":"56.50%"},"  C"]
["Mrázek Lubomír","  S",4,480,270,{"v":0.563,"d":"56.30%"},"  C"]
["Tarek Martin","  S",1,200,111,{"v":0.555,"d":"55.50%"},"  C"]
["Gerger Ján","  S",1,200,110,{"v":0.55,"d":"55.00%"},"  C"]
["Lukeš Jan","  S",1,100,55,{"v":0.55,"d":"55.00%"},"  C"]
["Lukeš Zdeněk","  S",1,100,55,{"v":0.55,"d":"55.00%"},"  C"]
["Stejskal Petr","  S",1,100,55,{"v":0.55,"d":"55.00%"},"  C"]
["Pospíchal Ivan","  S",1,100,54,{"v":0.54,"d":"54.00%"},"  C"]
["Hareter Markus","  S",1,200,107,{"v":0.535,"d":"53.50%"},"  C"]
["Hrych Jan","  S",1,100,53,{"v":0.53,"d":"53.00%"},"  C"]
["Martin Josef","  S",1,150,79,{"v":0.527,"d":"52.70%"},"  C"]
["Kolacia Pavel","  S",1,200,105,{"v":0.525,"d":"52.50%"},"  C"]
["Vazač Václav","  S",1,120,63,{"v":0.525,"d":"52.50%"},"  C"]
["Vrabec Petr","  S",1,120,63,{"v":0.525,"d":"52.50%"},"  C"]
["Pokorný Igor","  S",3,350,182,{"v":0.52,"d":"52.00%"},"  C"]
["Uher Petr","  S",3,380,197,{"v":0.518,"d":"51.80%"},"  C"]
["Bártl Lukáš","  S",1,100,51,{"v":0.51,"d":"51.00%"},"  C"]
["Novák Radek","  S",1,100,51,{"v":0.51,"d":"51.00%"},"  C"]
["Žáček Jiří","  S",1,100,51,{"v":0.51,"d":"51.00%"},"  C"]
["Šimánek Martin","  S",1,120,61,{"v":0.508,"d":"50.80%"},"  C"]
["Langmajer Tomáš","  S",2,350,176,{"v":0.503,"d":"50.30%"},"  C"]
["Kiriakovský Alexej","  S",2,200,100,{"v":0.5,"d":"50.00%"},"  C"]
["Deyssig Petr","  S",1,100,50,{"v":0.5,"d":"50.00%"},"  C"]
["Lexa Pavel","  S",1,100,50,{"v":0.5,"d":"50.00%"},"  C"]
["Petera Adam","  S",1,100,50,{"v":0.5,"d":"50.00%"},"  C"]
["Hanus Marcel","  S",1,200,98,{"v":0.49,"d":"49.00%"},"  C"]
["Zakouřil Jiří","  S",1,100,49,{"v":0.49,"d":"49.00%"},"  C"]
["Kwiatkovski Roland","  S",1,160,76,{"v":0.475,"d":"47.50%"},"  C"]
["Hosnedl Jakub","  S",1,150,71,{"v":0.473,"d":"47.30%"},"  C"]
["Pangrác Jan","  S",4,560,255,{"v":0.455,"d":"45.50%"},"  C"]
["Andrýs Stanislav","  S",1,200,90,{"v":0.45,"d":"45.00%"},"  C"]
["Smeták Milan","  S",1,100,45,{"v":0.45,"d":"45.00%"},"  C"]
["Skala Richard","  S",1,150,67,{"v":0.447,"d":"44.70%"},"  C"]
["Šindelář Jiří","  S",5,720,321,{"v":0.446,"d":"44.60%"},"  C"]
["Zezula Ladislav","  S",1,160,71,{"v":0.444,"d":"44.40%"},"  C"]
["Fus Zdeněk","  S",1,120,53,{"v":0.442,"d":"44.20%"},"  C"]
["Starec Jaroslav","  S",4,650,287,{"v":0.442,"d":"44.20%"},"  C"]
["Houska Petr","  S",1,120,52,{"v":0.433,"d":"43.30%"},"  C"]
["Verner Dušan","  S",1,100,43,{"v":0.43,"d":"43.00%"},"  C"]
["Šmatlák Martin","  S",2,220,93,{"v":0.423,"d":"42.30%"},"  C"]
["Grňák Michal","  S",1,150,63,{"v":0.42,"d":"42.00%"},"  C"]
["Martin Petr","  S",1,150,63,{"v":0.42,"d":"42.00%"},"  C"]
["Salaba Ondřej","  S",1,100,42,{"v":0.42,"d":"42.00%"},"  C"]
["Lokaj Zdeněkml.","  S",1,100,41,{"v":0.41,"d":"41.00%"},"  C"]
["Žáček Oldřich","  S",1,150,60,{"v":0.4,"d":"40.00%"},"  C"]
["Koukolík Václav","  S",1,150,59,{"v":0.393,"d":"39.30%"},"  C"]
["Kříž Jan","  S",1,150,59,{"v":0.393,"d":"39.30%"},"  C"]
["Pěnkava Martin","  ",1,120,47,{"v":0.392,"d":"39.20%"},"  C"]
["Tureček Václav","  S",2,280,104,{"v":0.371,"d":"37.10%"},"  C"]
["Soukup Pavel","  S",1,100,37,{"v":0.37,"d":"37.00%"},"  C"]
["Jelínek Aleš","  S",2,220,80,{"v":0.364,"d":"36.40%"},"  C"]
["Šplíchal Miroslav","  S",1,150,50,{"v":0.333,"d":"33.30%"},"  C"]
["Bugár Imrich","  S",1,200,66,{"v":0.33,"d":"33.00%"},"  C"]
["Blicha Jozef","  S",1,120,38,{"v":0.317,"d":"31.70%"},"  C"]
["Solar David","  S",2,300,80,{"v":0.267,"d":"26.70%"},"  C"]
["Mudra Jan","  S",1,100,23,{"v":0.23,"d":"23.00%"},"  C"]
["Wolf Miroslav","  S",1,150,30,{"v":0.2,"d":"20.00%"},"  C"]
["Bečvář Lukáš","  S",0,0,0,{"v":0,"d":"0.00%"},"  C"]
["Bělohlavý Tomáš","  S",0,0,0,{"v":0,"d":"0.00%"},"  C"]
["Bláha Milan","  S",0,0,0,{"v":0,"d":"0.00%"},"  C"]
["Boháč Vítězslav","  S",0,0,0,{"v":0,"d":"0.00%"},"  C"]
["Brabec Václav","  S",0,0,0,{"v":0,"d":"0.00%"},"  C"]
["Breicha Luděk","  S",0,0,0,{"v":0,"d":"0.00%"},"  C"]
["Burda Zdeněk","  S",0,0,0,{"v":0,"d":"0.00%"},"  C"]
["Červinčák Libor","  S",0,0,0,{"v":0,"d":"0.00%"},"  C"]
["Čírtek Bohumil","  S",0,0,0,{"v":0,"d":"0.00%"},"  C"]
["Dohnal Andrej","  S",0,0,0,{"v":0,"d":"0.00%"},"  C"]
["Dostál Jaroslav","  S",0,0,0,{"v":0,"d":"0.00%"},"  C"]
["Dostál Michal","  S",0,0,0,{"v":0,"d":"0.00%"},"  C"]
["Drahokoupil Jiří","  S",0,0,0,{"v":0,"d":"0.00%"},"  C"]
["Dřímal Jaromír","  S",0,0,0,{"v":0,"d":"0.00%"},"  C"]
["Duchoň Jakub","  S",0,0,0,{"v":0,"d":"0.00%"},"  C"]
["Dušánek Vladimír","  S",0,0,0,{"v":0,"d":"0.00%"},"  C"]
["Fejkl Pavel","  S",0,0,0,{"v":0,"d":"0.00%"},"  C"]
["Ferkl Jan","  S",0,0,0,{"v":0,"d":"0.00%"},"  C"]
["Fiala Jan","  S",0,0,0,{"v":0,"d":"0.00%"},"  C"]
["Geisler Vladimír","  S",0,0,0,{"v":0,"d":"0.00%"},"  C"]
["Gežo Josef","  S",0,0,0,{"v":0,"d":"0.00%"},"  C"]
["Grabowi Adam","  S",0,0,0,{"v":0,"d":"0.00%"},"  C"]
["Greš Marek","  S",0,0,0,{"v":0,"d":"0.00%"},"  C"]
["Hejnyš Miroslav","  S",0,0,0,{"v":0,"d":"0.00%"},"  C"]
["Henzelín Václav","  S",0,0,0,{"v":0,"d":"0.00%"},"  C"]
["Hodek Oskar","  S",0,0,0,{"v":0,"d":"0.00%"},"  C"]
["Hollman Petr","  S",0,0,0,{"v":0,"d":"0.00%"},"  C"]
["Hrouda Miroslav","  S",0,0,0,{"v":0,"d":"0.00%"},"  C"]
["Hýna Roman","  S",0,0,0,{"v":0,"d":"0.00%"},"  C"]
["Jeníček Jiří","  S",0,0,0,{"v":0,"d":"0.00%"},"  C"]
["Jirků Milan","  S",0,0,0,{"v":0,"d":"0.00%"},"  C"]
["Joska František","  S",0,0,0,{"v":0,"d":"0.00%"},"  C"]
["Jurek Martin","  S",0,0,0,{"v":0,"d":"0.00%"},"  C"]
["Kaiser Vladimír","  S",0,0,0,{"v":0,"d":"0.00%"},"  C"]
["Kaiser Vladimír ml.","  S",0,0,0,{"v":0,"d":"0.00%"},"  C"]
["Kaiser Josef","  S",0,0,0,{"v":0,"d":"0.00%"},"  C"]
["Knaizl Tomáš","  S",0,0,0,{"v":0,"d":"0.00%"},"  C"]
["Kodeš Ondřej","  S",0,0,0,{"v":0,"d":"0.00%"},"  C"]
["Kopečný Josef","  S",0,0,0,{"v":0,"d":"0.00%"},"  C"]
["Korman Petr","  S",0,0,0,{"v":0,"d":"0.00%"},"  C"]
["Koťátko Jaroslav","  S",0,0,0,{"v":0,"d":"0.00%"},"  C"]
["Kozák Josef","  S",0,0,0,{"v":0,"d":"0.00%"},"  C"]
["Kratochvíl Vladimír","  S",0,0,0,{"v":0,"d":"0.00%"},"  C"]
["Krška Jan","  S",0,0,0,{"v":0,"d":"0.00%"},"  C"]
["Láska Robert","  S",0,0,0,{"v":0,"d":"0.00%"},"  C"]
["Lokvenc Ilja","  S",0,0,0,{"v":0,"d":"0.00%"},"  C"]
["Loula Jaroslav","  S",0,0,0,{"v":0,"d":"0.00%"},"  C"]
["Luňáček Libor","  S",0,0,0,{"v":0,"d":"0.00%"},"  C"]
["Majer Milan","  S",0,0,0,{"v":0,"d":"0.00%"},"  C"]
["Mareš Petr","  S",0,0,0,{"v":0,"d":"0.00%"},"  C"]
["Maxa Milan","  S",0,0,0,{"v":0,"d":"0.00%"},"  C"]
["Miler Vlastimil","  S",0,0,0,{"v":0,"d":"0.00%"},"  C"]
["Minich Tomáš","  S",0,0,0,{"v":0,"d":"0.00%"},"  C"]
["Němec Jan","  S",0,0,0,{"v":0,"d":"0.00%"},"  C"]
["Nosek Miloš","  S",0,0,0,{"v":0,"d":"0.00%"},"  C"]
["Nosek Ivo","  S",0,0,0,{"v":0,"d":"0.00%"},"  C"]
["Novák Zdeněk","  S",0,0,0,{"v":0,"d":"0.00%"},"  C"]
["Novotný Václav","  S",0,0,0,{"v":0,"d":"0.00%"},"  C"]
["Otáhal František","  S",0,0,0,{"v":0,"d":"0.00%"},"  C"]
["Oubram Zdeněk","  S",0,0,0,{"v":0,"d":"0.00%"},"  C"]
["Pacák Miroslav","  S",0,0,0,{"v":0,"d":"0.00%"},"  C"]
["Pavlíček Martin","  S",0,0,0,{"v":0,"d":"0.00%"},"  C"]
["Pelcman Zdeněk","  S",0,0,0,{"v":0,"d":"0.00%"},"  C"]
["Peluha Antonín","  S",0,0,0,{"v":0,"d":"0.00%"},"  C"]
["Peroutka Karel","  S",0,0,0,{"v":0,"d":"0.00%"},"  C"]
["Petr Roman","  S",0,0,0,{"v":0,"d":"0.00%"},"  C"]
["Polcar Vojtěch","  S",0,0,0,{"v":0,"d":"0.00%"},"  C"]
["Pospíšil Lubomír","  S",0,0,0,{"v":0,"d":"0.00%"},"  C"]
["Pražák Jan","  S",0,0,0,{"v":0,"d":"0.00%"},"  C"]
["Provázek Rudolf","  S",0,0,0,{"v":0,"d":"0.00%"},"  C"]
["Racek Petr","  S",0,0,0,{"v":0,"d":"0.00%"},"  C"]
["Rampas Václav","  S",0,0,0,{"v":0,"d":"0.00%"},"  C"]
["Rampula Pavel","  S",0,0,0,{"v":0,"d":"0.00%"},"  C"]
["Říha Josef","  S",0,0,0,{"v":0,"d":"0.00%"},"  C"]
["Sabin Milan","  S",0,0,0,{"v":0,"d":"0.00%"},"  C"]
["Sedláček Jiří","  S",0,0,0,{"v":0,"d":"0.00%"},"  C"]
["Sedlák Martin","  S",0,0,0,{"v":0,"d":"0.00%"},"  C"]
["Sehnal Martin","  S",0,0,0,{"v":0,"d":"0.00%"},"  C"]
["Schmied Jaroslav","  S",0,0,0,{"v":0,"d":"0.00%"},"  C"]
["Slovák Zdeněk","  S",0,0,0,{"v":0,"d":"0.00%"},"  C"]
["Smejkal Milan","  S",0,0,0,{"v":0,"d":"0.00%"},"  C"]
["Smolka Přemysl","  S",0,0,0,{"v":0,"d":"0.00%"},"  C"]
["Sobotka Jiří","  S",0,0,0,{"v":0,"d":"0.00%"},"  C"]
["Sobotka Libor","  S",0,0,0,{"v":0,"d":"0.00%"},"  C"]
["Staněk Josef","  S",0,0,0,{"v":0,"d":"0.00%"},"  C"]
["Stanke Petr","  S",0,0,0,{"v":0,"d":"0.00%"},"  C"]
["Stejskal Miroslav","  S",0,0,0,{"v":0,"d":"0.00%"},"  C"]
["Stejskal Martin","  S",0,0,0,{"v":0,"d":"0.00%"},"  C"]
["Straka Tomáš","  S",0,0,0,{"v":0,"d":"0.00%"},"  C"]
["Strnad Josef","  S",0,0,0,{"v":0,"d":"0.00%"},"  C"]
["Střítecký Martin","  S",0,0,0,{"v":0,"d":"0.00%"},"  C"]
["Suchý Petr","  S",0,0,0,{"v":0,"d":"0.00%"},"  C"]
["Světlík Karel","  S",0,0,0,{"v":0,"d":"0.00%"},"  C"]
["Svoboda Petr","  S",0,0,0,{"v":0,"d":"0.00%"},"  C"]
["Škarvada Zdeněk","  S",0,0,0,{"v":0,"d":"0.00%"},"  C"]
["Škripek Vladimír","  S",0,0,0,{"v":0,"d":"0.00%"},"  C"]
["Šottl Jaroslav","  S",0,0,0,{"v":0,"d":"0.00%"},"  C"]
["Šťastný Stanislav","  S",0,0,0,{"v":0,"d":"0.00%"},"  C"]
["Štěrba Vladimír ml.","  S",0,0,0,{"v":0,"d":"0.00%"},"  C"]
["Švec Miloslav","  S",0,0,0,{"v":0,"d":"0.00%"},"  C"]
["Tomeček Jakub","  S",0,0,0,{"v":0,"d":"0.00%"},"  C"]
["Trefný Jan","  S",0,0,0,{"v":0,"d":"0.00%"},"  C"]
["Trepka Jiří","  S",0,0,0,{"v":0,"d":"0.00%"},"  C"]
["Tuček Karel","  S",0,0,0,{"v":0,"d":"0.00%"},"  C"]
["Vágner Lukáš","  S",0,0,0,{"v":0,"d":"0.00%"},"  C"]
["Valchař Petr","  S",0,0,0,{"v":0,"d":"0.00%"},"  C"]
["Vejmalka Milan","  S",0,0,0,{"v":0,"d":"0.00%"},"  C"]
["Vent Lubomír","  S",0,0,0,{"v":0,"d":"0.00%"},"  C"]
["Veselý František","  S",0,0,0,{"v":0,"d":"0.00%"},"  C"]
["Vícha Jakub","  S",0,0,0,{"v":0,"d":"0.00%"},"  C"]
["Vítek Jiří","  S",0,0,0,{"v":0,"d":"0.00%"},"  C"]
["Vlk Vladimír","  S",0,0,0,{"v":0,"d":"0.00%"},"  C"]
["Vokál Jan","  S",0,0,0,{"v":0,"d":"0.00%"},"  C"]
["Vrátník Václav","  S",0,0,0,{"v":0,"d":"0.00%"},"  C"]
["Vrňák Libor","  S",0,0,0,{"v":0,"d":"0.00%"},"  C"]
["Zamazal Radek","  S",0,0,0,{"v":0,"d":"0.00%"},"  C"]
["Žid Milan","  S",0,0,0,{"v":0,"d":"0.00%"},"  C"]
[]
[]
[]
[]
[null,"  Kat.","  Závody","  Terče","  Zásahy","  Průměr","  Kategorie"]
["Buksa Jan","  V",5,750,669,{"v":0.892,"d":"89.20%"},"  V"]
["Vlášek Miroslav","  V",1,100,84,{"v":0.84,"d":"84.00%"},"  V"]
["Uher Jaromír","  V",12,1840,1502,{"v":0.816,"d":"81.60%"},"  V"]
["Bastl Václav","  V",1,100,81,{"v":0.81,"d":"81.00%"},"  V"]
["Schoenke Ralf","  V",1,100,78,{"v":0.78,"d":"78.00%"},"  V"]
["Kersnik Mitja","  V",1,200,153,{"v":0.765,"d":"76.50%"},"  V"]
["Thum Rudolf","  V",2,350,261,{"v":0.746,"d":"74.60%"},"  V"]
["Zupan Anton","  V",1,200,149,{"v":0.745,"d":"74.50%"},"  V"]
["Navrátil Bedřich","  V",5,830,618,{"v":0.745,"d":"74.50%"},"  V"]
["Říha Milan","  V",4,590,438,{"v":0.742,"d":"74.20%"},"  V"]
["Kistmacher Joachim","  V",1,100,74,{"v":0.74,"d":"74.00%"},"  V"]
["Pražák František","  V",3,320,236,{"v":0.738,"d":"73.80%"},"  V"]
["Dieplinger Hans","  V",3,470,339,{"v":0.721,"d":"72.10%"},"  V"]
["Matič Davorin","  V",2,400,286,{"v":0.715,"d":"71.50%"},"  V"]
["Mlinarič Rudolf","  V",2,400,285,{"v":0.713,"d":"71.30%"},"  V"]
["Horvath Jozef","  V",1,200,142,{"v":0.71,"d":"71.00%"},"  V"]
["Pospíšil Stanislav","  V",2,250,176,{"v":0.704,"d":"70.40%"},"  V"]
["Hnilička Milan","  V",7,1020,717,{"v":0.703,"d":"70.30%"},"  V"]
["Mitáš Jaroslav","  V",1,100,69,{"v":0.69,"d":"69.00%"},"  V"]
["Hauk Pavel","  V",3,360,248,{"v":0.689,"d":"68.90%"},"  V"]
["Gmeiner Ludwig","  V",2,310,212,{"v":0.684,"d":"68.40%"},"  V"]
["Jiráček Zdeněk","  V",7,1110,758,{"v":0.683,"d":"68.30%"},"  V"]
["Paur Milan","  V",5,780,531,{"v":0.681,"d":"68.10%"},"  V"]
["Hanzlík Václav","  V",2,360,244,{"v":0.678,"d":"67.80%"},"  V"]
["Vadlejch Josef","  V",6,1070,714,{"v":0.667,"d":"66.70%"},"  V"]
["Mandl Friedrich","  V",2,310,203,{"v":0.655,"d":"65.50%"},"  V"]
["Ďurík Jaroslav","  V",2,300,196,{"v":0.653,"d":"65.30%"},"  V"]
["Nestler Christoph","  V",8,1180,769,{"v":0.652,"d":"65.20%"},"  V"]
["Staněk Jan","  V",9,1440,934,{"v":0.649,"d":"64.90%"},"  V"]
["Mitherhuber Alois","  V",1,150,97,{"v":0.647,"d":"64.70%"},"  V"]
["Hůda Jan","  V",4,580,372,{"v":0.641,"d":"64.10%"},"  V"]
["Hildprandt Jan","  V",3,400,256,{"v":0.64,"d":"64.00%"},"  V"]
["Kubíček Karel","  V",3,520,329,{"v":0.633,"d":"63.30%"},"  V"]
["Mraček Jan","  V",1,160,101,{"v":0.631,"d":"63.10%"},"  V"]
["Bašta Václav","  V",1,100,63,{"v":0.63,"d":"63.00%"},"  V"]
["Smutka Radomír","  V",1,100,63,{"v":0.63,"d":"63.00%"},"  V"]
["Tóth Ladislav","  V",9,1300,818,{"v":0.629,"d":"62.90%"},"  V"]
["Švára Ondřej","  V",1,100,62,{"v":0.62,"d":"62.00%"},"  V"]
["Jelínek Jiří","  V",5,700,426,{"v":0.609,"d":"60.90%"},"  V"]
["Scheible Martin","  V",1,160,97,{"v":0.606,"d":"60.60%"},"  V"]
["Moravčík Vlastimil","  V",2,200,121,{"v":0.605,"d":"60.50%"},"  V"]
["Straka Ladislav","  V",2,200,121,{"v":0.605,"d":"60.50%"},"  V"]
["Volf Jan","  V",1,200,121,{"v":0.605,"d":"60.50%"},"  V"]
["Streit Vlastislav","  V",2,350,211,{"v":0.603,"d":"60.30%"},"  V"]
["Rozumek Josef","  V",3,420,249,{"v":0.593,"d":"59.30%"},"  V"]
["Průšek Miroslav","  V",1,100,59,{"v":0.59,"d":"59.00%"},"  V"]
["Semanský Jaromír","  V",3,460,271,{"v":0.589,"d":"58.90%"},"  V"]
["Řezníček Vilém","  V",3,410,238,{"v":0.58,"d":"58.00%"},"  V"]
["Kamiński Jerzy","  V",1,100,58,{"v":0.58,"d":"58.00%"},"  V"]
["Skala Richard","  V",1,100,58,{"v":0.58,"d":"58.00%"},"  V"]
["Klesnil Zdeněk","  V",1,100,57,{"v":0.57,"d":"57.00%"},"  V"]
["Král Jaroslav","  V",1,100,55,{"v":0.55,"d":"55.00%"},"  V"]
["Kučera Josef","  V",1,120,66,{"v":0.55,"d":"55.00%"},"  V"]
["Frnoch Milan","  V",2,280,153,{"v":0.546,"d":"54.60%"},"  V"]
["Ryšavý Miroslav","  V",8,1280,697,{"v":0.545,"d":"54.50%"},"  V"]
["Jiráček Josef","  V",1,160,87,{"v":0.544,"d":"54.40%"},"  V"]
["Vohralík Jiří","  V",1,120,62,{"v":0.517,"d":"51.70%"},"  V"]
["Ulrych Jiří","  V",2,350,178,{"v":0.509,"d":"50.90%"},"  V"]
["Pešek Václav","  V",1,100,49,{"v":0.49,"d":"49.00%"},"  V"]
["Lokaj Zdeněk","  V",2,260,109,{"v":0.419,"d":"41.90%"},"  V"]
["Bejček Václav","  V",0,0,0,{"v":0,"d":"0.00%"},"  V"]
["Hnízdil Milan","  V",0,0,0,{"v":0,"d":"0.00%"},"  V"]
["Janda Jiří","  V",0,0,0,{"v":0,"d":"0.00%"},"  V"]
["Jíra Ladislav","  V",0,0,0,{"v":0,"d":"0.00%"},"  V"]
["Jirotka Jiří","  V",0,0,0,{"v":0,"d":"0.00%"},"  V"]
["Konečný Jan","  V",0,0,0,{"v":0,"d":"0.00%"},"  V"]
["Krejza Jan","  V",0,0,0,{"v":0,"d":"0.00%"},"  V"]
["Moravec Jaroslav","  V",0,0,0,{"v":0,"d":"0.00%"},"  V"]
["Mostecký Jiří","  V",0,0,0,{"v":0,"d":"0.00%"},"  V"]
["Petr Jan","  V",0,0,0,{"v":0,"d":"0.00%"},"  V"]
["Pešek Josef","  V",0,0,0,{"v":0,"d":"0.00%"},"  V"]
["Prachař Jan","  V",0,0,0,{"v":0,"d":"0.00%"},"  V"]
["Půža Václav","  V",0,0,0,{"v":0,"d":"0.00%"},"  V"]
["Rychnovský Petr","  V",0,0,0,{"v":0,"d":"0.00%"},"  V"]
["Sivčák Miroslav","  V",0,0,0,{"v":0,"d":"0.00%"},"  V"]
["Smutný Jaroslav","  V",0,0,0,{"v":0,"d":"0.00%"},"  V"]
["Stavinoha Čestmír","  V",0,0,0,{"v":0,"d":"0.00%"},"  V"]
["Strnad Vladislav","  V",0,0,0,{"v":0,"d":"0.00%"},"  V"]
["Svozil Stanislav","  V",0,0,0,{"v":0,"d":"0.00%"},"  V"]
["Šimáček Pavel","  V",0,0,0,{"v":0,"d":"0.00%"},"  V"]
["Šimánek Jaroslav","  V",0,0,0,{"v":0,"d":"0.00%"},"  V"]
["Šimčík Bohumil","  V",0,0,0,{"v":0,"d":"0.00%"},"  V"]
["Šprinc Jindřich","  V",0,0,0,{"v":0,"d":"0.00%"},"  V"]
["Štěrba Vladimír","  V",0,0,0,{"v":0,"d":"0.00%"},"  V"]
["Vágner Josef","  V",0,0,0,{"v":0,"d":"0.00%"},"  V"]
["Vícha Miroslav","  V",0,0,0,{"v":0,"d":"0.00%"},"  V"]
["Vymětal Josef","  V",0,0,0,{"v":0,"d":"0.00%"},"  V"]
[]
[]
[]
[]
[null,"  Kat.","  Závody","  Terče","  Zásahy","  Průměr","  Kategorie"]
["Spitzka Heinz","  SV",2,260,204,{"v":0.785,"d":"78.50%"},"  SV"]
["Otáhal Milan","  SV",10,1480,1122,{"v":0.758,"d":"75.80%"},"  SV"]
["Münzberger Heinrich","  SV",1,100,75,{"v":0.75,"d":"75.00%"},"  SV"]
["Kubík Jindřich","  SV",4,550,392,{"v":0.713,"d":"71.30%"},"  SV"]
["Brouček Ladislav","  SV",5,670,452,{"v":0.675,"d":"67.50%"},"  SV"]
["Moser Siegfried","  SV",1,100,66,{"v":0.66,"d":"66.00%"},"  SV"]
["Neuvirt Václav","  SV",8,1380,884,{"v":0.641,"d":"64.10%"},"  SV"]
["Hrouda Jaroslav","  SV",5,680,429,{"v":0.631,"d":"63.10%"},"  SV"]
["Elšlégr Josef","  SV",4,520,328,{"v":0.631,"d":"63.10%"},"  SV"]
["Slotta Uli","  SV",1,100,63,{"v":0.63,"d":"63.00%"},"  SV"]
["Goll Jan","  SV",1,160,98,{"v":0.613,"d":"61.30%"},"  SV"]
["Havel František","  SV",1,100,54,{"v":0.54,"d":"54.00%"},"  SV"]
["Zahradník Rudolf","  SV",1,100,47,{"v":0.47,"d":"47.00%"},"  SV"]
["Kupka Ondřej","  SV",2,220,103,{"v":0.468,"d":"46.80%"},"  SV"]
["Štengl Jan","  SV",1,200,79,{"v":0.395,"d":"39.50%"},"  SV"]
["Bicera Štěpán","  SV",0,0,0,{"v":0,"d":"0.00%"},"  SV"]
["Jánošík Fedor","  SV",0,0,0,{"v":0,"d":"0.00%"},"  SV"]
["Kučera Václav","  SV",0,0,0,{"v":0,"d":"0.00%"},"  SV"]
["Petr František","  SV",0,0,0,{"v":0,"d":"0.00%"},"  SV"]

{"sheet":"VysledkovaListina","index":6,"n_rows":128,"n_cols":24,"rows_kept":128,"merged":[[0,0,0,22],[1,0,1,22],[3,0,3,22],[4,0,6,0],[4,1,6,1],[4,2,6,2],[4,3,4,18],[4,19,6,19],[4,20,6,20],[4,21,6,22],[5,3,6,3],[5,4,6,4],[5,5,6,5],[5,6,6,6],[5,7,6,7],[5,8,6,8],[5,9,6,9],[5,10,6,10],[5,11,6,11],[5,12,6,12],[5,13,6,13],[5,14,6,14],[5,15,6,15],[5,16,6,16],[5,17,6,17],[5,18,6,18]]}
[{"$f":"Vstup!C2&IF(Vstup!C3<>\"\",\", \"&Vstup!C3,\"\")","v":"Josefovský brokový trojboj, 60 TERČŮ"}]
[{"$f":"Vstup!C4&\", \"&Vstup!C5","v":"SPORTING, 20.03.2022"}]
[]
["VÝSLEDKOVÁ LISTINA"]
["Pořadí","Příjmení, jméno","Kat.","Linie / Střeliště",{"$nulls":15},"Fin.","R","Σ"]
[{"$nulls":3},{"$f":"Data!D3","v":"Vysoká věž"},{"$f":"Data!D4","v":"Trap"},{"$f":"Data!D5","v":"Zajíc"},{"$f":"Data!D6","v":0},{"$f":"Data!D7","v":0},{"$f":"Data!D8","v":0},{"$f":"Data!D9","v":0},{"$f":"Data!D10","v":0},{"$f":"Data!D11","v":0},{"$f":"Data!D12","v":0},{"$f":"Data!D13","v":0},{"$f":"Data!D14","v":0},{"$f":"Data!D15","v":0},{"$f":"Data!D16","v":0},{"$f":"Data!D17","v":0},{"$f":"Data!D18","v":0}]
[]
[1,{"$f":"IF(Vstup!C18<>\"\",Vstup!C18,\"\")","v":"Frenkl Jiří"},"S",{"$f":"VLOOKUP($B8,VysledkyDoplneni!$C$7:$T$126,3,0)","v":19},{"$f":"VLOOKUP($B8,VysledkyDoplneni!$C$7:$T$126,4,0)","v":19},{"$f":"VLOOKUP($B8,VysledkyDoplneni!$C$7:$T$126,5,0)","v":19},{"$f":"VLOOKUP($B8,VysledkyDoplneni!$C$7:$T$126,6,0)","v":0},{"$f":"VLOOKUP($B8,VysledkyDoplneni!$C$7:$T$126,7,0)","v":0},{"$f":"VLOOKUP($B8,VysledkyDoplneni!$C$7:$T$126,8,0)","v":0},{"$f":"VLOOKUP($B8,VysledkyDoplneni!$C$7:$T$126,9,0)","v":0},{"$f":"VLOOKUP($B8,VysledkyDoplneni!$C$7:$T$126,10,0)","v":0},{"$f":"VLOOKUP($B8,VysledkyDoplneni!$C$7:$T$126,11,0)","v":0},{"$f":"VLOOKUP($B8,VysledkyDoplneni!$C$7:$T$126,12,0)","v":0},{"$f":"VLOOKUP($B8,VysledkyDoplneni!$C$7:$T$126,13,0)","v":0},{"$f":"VLOOKUP($B8,VysledkyDoplneni!$C$7:$T$126,14,0)","v":0},{"$f":"VLOOKUP($B8,VysledkyDoplneni!$C$7:$T$126,15,0)","v":0},{"$f":"VLOOKUP($B8,VysledkyDoplneni!$C$7:$T$126,16,0)","v":0},{"$f":"VLOOKUP($B8,VysledkyDoplneni!$C$7:$T$126,17,0)","v":0},{"$f":"VLOOKUP($B8,VysledkyDoplneni!$C$7:$T$126,18,0)","v":0},null,null,{"$f":"SUM(D8:S8)","v":57},{"$f":"(V8/(Data!$B$18*X8))","v":{"v":0.95,"d":"95.0%"}},{"$f":"COUNTIF(D8:S8,\">0\")","v":3}]
[2,{"$f":"IF(Vstup!C48<>\"\",Vstup!C48,\"\")","v":"Kočí Radek"},"S",{"$f":"VLOOKUP($B9,VysledkyDoplneni!$C$7:$T$126,3,0)","v":18},{"$f":"VLOOKUP($B9,VysledkyDoplneni!$C$7:$T$126,4,0)","v":16},{"$f":"VLOOKUP($B9,VysledkyDoplneni!$C$7:$T$126,5,0)","v":19},{"$f":"VLOOKUP($B9,VysledkyDoplneni!$C$7:$T$126,6,0)","v":0},{"$f":"VLOOKUP($B9,VysledkyDoplneni!$C$7:$T$126,7,0)","v":0},{"$f":"VLOOKUP($B9,VysledkyDoplneni!$C$7:$T$126,8,0)","v":0},{"$f":"VLOOKUP($B9,VysledkyDoplneni!$C$7:$T$126,9,0)","v":0},{"$f":"VLOOKUP($B9,VysledkyDoplneni!$C$7:$T$126,10,0)","v":0},{"$f":"VLOOKUP($B9,VysledkyDoplneni!$C$7:$T$126,11,0)","v":0},{"$f":"VLOOKUP($B9,VysledkyDoplneni!$C$7:$T$126,12,0)","v":0},{"$f":"VLOOKUP($B9,VysledkyDoplneni!$C$7:$T$126,13,0)","v":0},{"$f":"VLOOKUP($B9,VysledkyDoplneni!$C$7:$T$126,14,0)","v":0},{"$f":"VLOOKUP($B9,VysledkyDoplneni!$C$7:$T$126,15,0)","v":0},{"$f":"VLOOKUP($B9,VysledkyDoplneni!$C$7:$T$126,16,0)","v":0},{"$f":"VLOOKUP($B9,VysledkyDoplneni!$C$7:$T$126,17,0)","v":0},{"$f":"VLOOKUP($B9,VysledkyDoplneni!$C$7:$T$126,18,0)","v":0},null,null,{"$f":"SUM(D9:S9)","v":53},{"$f":"(V9/(Data!$B$18*X9))","v":{"v":0.8833333333333333,"d":"88.3%"}},{"$f":"COUNTIF(D9:S9,\">0\")","v":3}]
[3,{"$f":"IF(Vstup!C52<>\"\",Vstup!C52,\"\")","v":"Kubík Jindřich"},"S",{"$f":"VLOOKUP($B10,VysledkyDoplneni!$C$7:$T$126,3,0)","v":15},{"$f":"VLOOKUP($B10,VysledkyDoplneni!$C$7:$T$126,4,0)","v":18},{"$f":"VLOOKUP($B10,VysledkyDoplneni!$C$7:$T$126,5,0)","v":19},{"$f":"VLOOKUP($B10,VysledkyDoplneni!$C$7:$T$126,6,0)","v":0},{"$f":"VLOOKUP($B10,VysledkyDoplneni!$C$7:$T$126,7,0)","v":0},{"$f":"VLOOKUP($B10,VysledkyDoplneni!$C$7:$T$126,8,0)","v":0},{"$f":"VLOOKUP($B10,VysledkyDoplneni!$C$7:$T$126,9,0)","v":0},{"$f":"VLOOKUP($B10,VysledkyDoplneni!$C$7:$T$126,10,0)","v":0},{"$f":"VLOOKUP($B10,VysledkyDoplneni!$C$7:$T$126,11,0)","v":0},{"$f":"VLOOKUP($B10,VysledkyDoplneni!$C$7:$T$126,12,0)","v":0},{"$f":"VLOOKUP($B10,VysledkyDoplneni!$C$7:$T$126,13,0)","v":0},{"$f":"VLOOKUP($B10,VysledkyDoplneni!$C$7:$T$126,14,0)","v":0},{"$f":"VLOOKUP($B10,VysledkyDoplneni!$C$7:$T$126,15,0)","v":0},{"$f":"VLOOKUP($B10,VysledkyDoplneni!$C$7:$T$126,16,0)","v":0},{"$f":"VLOOKUP($B10,VysledkyDoplneni!$C$7:$T$126,17,0)","v":0},{"$f":"VLOOKUP($B10,VysledkyDoplneni!$C$7:$T$126,18,0)","v":0},null,5,{"$f":"SUM(D10:S10)","v":52},{"$f":"(V10/(Data!$B$18*X10))","v":{"v":0.8666666666666667,"d":"86.7%"}},3]
[4,{"$f":"IF(Vstup!C23<>\"\",Vstup!C23,\"\")","v":"Kotrbáček Václav"},"S",{"$f":"VLOOKUP($B11,VysledkyDoplneni!$C$7:$T$126,3,0)","v":19},{"$f":"VLOOKUP($B11,VysledkyDoplneni!$C$7:$T$126,4,0)","v":16},{"$f":"VLOOKUP($B11,VysledkyDoplneni!$C$7:$T$126,5,0)","v":17},{"$f":"VLOOKUP($B11,VysledkyDoplneni!$C$7:$T$126,6,0)","v":0},{"$f":"VLOOKUP($B11,VysledkyDoplneni!$C$7:$T$126,7,0)","v":0},{"$f":"VLOOKUP($B11,VysledkyDoplneni!$C$7:$T$126,8,0)","v":0},{"$f":"VLOOKUP($B11,VysledkyDoplneni!$C$7:$T$126,9,0)","v":0},{"$f":"VLOOKUP($B11,VysledkyDoplneni!$C$7:$T$126,10,0)","v":0},{"$f":"VLOOKUP($B11,VysledkyDoplneni!$C$7:$T$126,11,0)","v":0},{"$f":"VLOOKUP($B11,VysledkyDoplneni!$C$7:$T$126,12,0)","v":0},{"$f":"VLOOKUP($B11,VysledkyDoplneni!$C$7:$T$126,13,0)","v":0},{"$f":"VLOOKUP($B11,VysledkyDoplneni!$C$7:$T$126,14,0)","v":0},{"$f":"VLOOKUP($B11,VysledkyDoplneni!$C$7:$T$126,15,0)","v":0},{"$f":"VLOOKUP($B11,VysledkyDoplneni!$C$7:$T$126,16,0)","v":0},{"$f":"VLOOKUP($B11,VysledkyDoplneni!$C$7:$T$126,17,0)","v":0},{"$f":"VLOOKUP($B11,VysledkyDoplneni!$C$7:$T$126,18,0)","v":0},null,null,{"$f":"SUM(D11:S11)","v":52},{"$f":"(V11/(Data!$B$18*X11))","v":{"v":0.8666666666666667,"d":"86.7%"}},3]
[5,{"$f":"IF(Vstup!C41<>\"\",Vstup!C41,\"\")","v":"Noháček Pavel"},"S",{"$f":"VLOOKUP($B12,VysledkyDoplneni!$C$7:$T$126,3,0)","v":18},{"$f":"VLOOKUP($B12,VysledkyDoplneni!$C$7:$T$126,4,0)","v":15},{"$f":"VLOOKUP($B12,VysledkyDoplneni!$C$7:$T$126,5,0)","v":19},{"$f":"VLOOKUP($B12,VysledkyDoplneni!$C$7:$T$126,6,0)","v":0},{"$f":"VLOOKUP($B12,VysledkyDoplneni!$C$7:$T$126,7,0)","v":0},{"$f":"VLOOKUP($B12,VysledkyDoplneni!$C$7:$T$126,8,0)","v":0},{"$f":"VLOOKUP($B12,VysledkyDoplneni!$C$7:$T$126,9,0)","v":0},{"$f":"VLOOKUP($B12,VysledkyDoplneni!$C$7:$T$126,10,0)","v":0},{"$f":"VLOOKUP($B12,VysledkyDoplneni!$C$7:$T$126,11,0)","v":0},{"$f":"VLOOKUP($B12,VysledkyDoplneni!$C$7:$T$126,12,0)","v":0},{"$f":"VLOOKUP($B12,VysledkyDoplneni!$C$7:$T$126,13,0)","v":0},{"$f":"VLOOKUP($B12,VysledkyDoplneni!$C$7:$T$126,14,0)","v":0},{"$f":"VLOOKUP($B12,VysledkyDoplneni!$C$7:$T$126,15,0)","v":0},{"$f":"VLOOKUP($B12,VysledkyDoplneni!$C$7:$T$126,16,0)","v":0},{"$f":"VLOOKUP($B12,VysledkyDoplneni!$C$7:$T$126,17,0)","v":0},{"$f":"VLOOKUP($B12,VysledkyDoplneni!$C$7:$T$126,18,0)","v":0},null,null,{"$f":"SUM(D12:S12)","v":52},{"$f":"(V12/(Data!$B$18*X12))","v":{"v":0.8666666666666667,"d":"86.7%"}},3]
[6,{"$f":"IF(Vstup!C10<>\"\",Vstup!C10,\"\")","v":"Vaněk Matěj"},"S",{"$f":"VLOOKUP($B13,VysledkyDoplneni!$C$7:$T$126,3,0)","v":16},{"$f":"VLOOKUP($B13,VysledkyDoplneni!$C$7:$T$126,4,0)","v":16},{"$f":"VLOOKUP($B13,VysledkyDoplneni!$C$7:$T$126,5,0)","v":20},{"$f":"VLOOKUP($B13,VysledkyDoplneni!$C$7:$T$126,6,0)","v":0},{"$f":"VLOOKUP($B13,VysledkyDoplneni!$C$7:$T$126,7,0)","v":0},{"$f":"VLOOKUP($B13,VysledkyDoplneni!$C$7:$T$126,8,0)","v":0},{"$f":"VLOOKUP($B13,VysledkyDoplneni!$C$7:$T$126,9,0)","v":0},{"$f":"VLOOKUP($B13,VysledkyDoplneni!$C$7:$T$126,10,0)","v":0},{"$f":"VLOOKUP($B13,VysledkyDoplneni!$C$7:$T$126,11,0)","v":0},{"$f":"VLOOKUP($B13,VysledkyDoplneni!$C$7:$T$126,12,0)","v":0},{"$f":"VLOOKUP($B13,VysledkyDoplneni!$C$7:$T$126,13,0)","v":0},{"$f":"VLOOKUP($B13,VysledkyDoplneni!$C$7:$T$126,14,0)","v":0},{"$f":"VLOOKUP($B13,VysledkyDoplneni!$C$7:$T$126,15,0)","v":0},{"$f":"VLOOKUP($B13,VysledkyDoplneni!$C$7:$T$126,16,0)","v":0},{"$f":"VLOOKUP($B13,VysledkyDoplneni!$C$7:$T$126,17,0)","v":0},{"$f":"VLOOKUP($B13,VysledkyDoplneni!$C$7:$T$126,18,0)","v":0},null,null,{"$f":"SUM(D13:S13)","v":52},{"$f":"(V13/(Data!$B$18*X13))","v":{"v":0.8666666666666667,"d":"86.7%"}},3]
[7,{"$f":"IF(Vstup!C27<>\"\",Vstup!C27,\"\")","v":"Čechura Petr"},"S",{"$f":"VLOOKUP($B14,VysledkyDoplneni!$C$7:$T$126,3,0)","v":14},{"$f":"VLOOKUP($B14,VysledkyDoplneni!$C$7:$T$126,4,0)","v":19},{"$f":"VLOOKUP($B14,VysledkyDoplneni!$C$7:$T$126,5,0)","v":19},{"$f":"VLOOKUP($B14,VysledkyDoplneni!$C$7:$T$126,6,0)","v":0},{"$f":"VLOOKUP($B14,VysledkyDoplneni!$C$7:$T$126,7,0)","v":0},{"$f":"VLOOKUP($B14,VysledkyDoplneni!$C$7:$T$126,8,0)","v":0},{"$f":"VLOOKUP($B14,VysledkyDoplneni!$C$7:$T$126,9,0)","v":0},{"$f":"VLOOKUP($B14,VysledkyDoplneni!$C$7:$T$126,10,0)","v":0},{"$f":"VLOOKUP($B14,VysledkyDoplneni!$C$7:$T$126,11,0)","v":0},{"$f":"VLOOKUP($B14,VysledkyDoplneni!$C$7:$T$126,12,0)","v":0},{"$f":"VLOOKUP($B14,VysledkyDoplneni!$C$7:$T$126,13,0)","v":0},{"$f":"VLOOKUP($B14,VysledkyDoplneni!$C$7:$T$126,14,0)","v":0},{"$f":"VLOOKUP($B14,VysledkyDoplneni!$C$7:$T$126,15,0)","v":0},{"$f":"VLOOKUP($B14,VysledkyDoplneni!$C$7:$T$126,16,0)","v":0},{"$f":"VLOOKUP($B14,VysledkyDoplneni!$C$7:$T$126,17,0)","v":0},{"$f":"VLOOKUP($B14,VysledkyDoplneni!$C$7:$T$126,18,0)","v":0},null,null,{"$f":"SUM(D14:S14)","v":52},{"$f":"(V14/(Data!$B$18*X14))","v":{"v":0.8666666666666667,"d":"86.7%"}},3]
[8,{"$f":"IF(Vstup!C45<>\"\",Vstup!C45,\"\")","v":"Hromada Jaroslav"},"S",{"$f":"VLOOKUP($B15,VysledkyDoplneni!$C$7:$T$126,3,0)","v":18},{"$f":"VLOOKUP($B15,VysledkyDoplneni!$C$7:$T$126,4,0)","v":17},{"$f":"VLOOKUP($B15,VysledkyDoplneni!$C$7:$T$126,5,0)","v":16},{"$f":"VLOOKUP($B15,VysledkyDoplneni!$C$7:$T$126,6,0)","v":0},{"$f":"VLOOKUP($B15,VysledkyDoplneni!$C$7:$T$126,7,0)","v":0},{"$f":"VLOOKUP($B15,VysledkyDoplneni!$C$7:$T$126,8,0)","v":0},{"$f":"VLOOKUP($B15,VysledkyDoplneni!$C$7:$T$126,9,0)","v":0},{"$f":"VLOOKUP($B15,VysledkyDoplneni!$C$7:$T$126,10,0)","v":0},{"$f":"VLOOKUP($B15,VysledkyDoplneni!$C$7:$T$126,11,0)","v":0},{"$f":"VLOOKUP($B15,VysledkyDoplneni!$C$7:$T$126,12,0)","v":0},{"$f":"VLOOKUP($B15,VysledkyDoplneni!$C$7:$T$126,13,0)","v":0},{"$f":"VLOOKUP($B15,VysledkyDoplneni!$C$7:$T$126,14,0)","v":0},{"$f":"VLOOKUP($B15,VysledkyDoplneni!$C$7:$T$126,15,0)","v":0},{"$f":"VLOOKUP($B15,VysledkyDoplneni!$C$7:$T$126,16,0)","v":0},{"$f":"VLOOKUP($B15,VysledkyDoplneni!$C$7:$T$126,17,0)","v":0},{"$f":"VLOOKUP($B15,VysledkyDoplneni!$C$7:$T$126,18,0)","v":0},null,null,{"$f":"SUM(D15:S15)","v":51},{"$f":"(V15/(Data!$B$18*X15))","v":{"v":0.85,"d":"85.0%"}},3]
[9,{"$f":"IF(Vstup!C31<>\"\",Vstup!C31,\"\")","v":"Volf Jiří"},"S",{"$f":"VLOOKUP($B16,VysledkyDoplneni!$C$7:$T$126,3,0)","v":15},{"$f":"VLOOKUP($B16,VysledkyDoplneni!$C$7:$T$126,4,0)","v":16},{"$f":"VLOOKUP($B16,VysledkyDoplneni!$C$7:$T$126,5,0)","v":20},{"$f":"VLOOKUP($B16,VysledkyDoplneni!$C$7:$T$126,6,0)","v":0},{"$f":"VLOOKUP($B16,VysledkyDoplneni!$C$7:$T$126,7,0)","v":0},{"$f":"VLOOKUP($B16,VysledkyDoplneni!$C$7:$T$126,8,0)","v":0},{"$f":"VLOOKUP($B16,VysledkyDoplneni!$C$7:$T$126,9,0)","v":0},{"$f":"VLOOKUP($B16,VysledkyDoplneni!$C$7:$T$126,10,0)","v":0},{"$f":"VLOOKUP($B16,VysledkyDoplneni!$C$7:$T$126,11,0)","v":0},{"$f":"VLOOKUP($B16,VysledkyDoplneni!$C$7:$T$126,12,0)","v":0},{"$f":"VLOOKUP($B16,VysledkyDoplneni!$C$7:$T$126,13,0)","v":0},{"$f":"VLOOKUP($B16,VysledkyDoplneni!$C$7:$T$126,14,0)","v":0},{"$f":"VLOOKUP($B16,VysledkyDoplneni!$C$7:$T$126,15,0)","v":0},{"$f":"VLOOKUP($B16,VysledkyDoplneni!$C$7:$T$126,16,0)","v":0},{"$f":"VLOOKUP($B16,VysledkyDoplneni!$C$7:$T$126,17,0)","v":0},{"$f":"VLOOKUP($B16,VysledkyDoplneni!$C$7:$T$126,18,0)","v":0},null,null,{"$f":"SUM(D16:S16)","v":51},{"$f":"(V16/(Data!$B$18*X16))","v":{"v":0.85,"d":"85.0%"}},3]
[10,{"$f":"IF(Vstup!C26<>\"\",Vstup!C26,\"\")","v":"Bém Josef"},"S",{"$f":"VLOOKUP($B17,VysledkyDoplneni!$C$7:$T$126,3,0)","v":19},{"$f":"VLOOKUP($B17,VysledkyDoplneni!$C$7:$T$126,4,0)","v":15},{"$f":"VLOOKUP($B17,VysledkyDoplneni!$C$7:$T$126,5,0)","v":15},{"$f":"VLOOKUP($B17,VysledkyDoplneni!$C$7:$T$126,6,0)","v":0},{"$f":"VLOOKUP($B17,VysledkyDoplneni!$C$7:$T$126,7,0)","v":0},{"$f":"VLOOKUP($B17,VysledkyDoplneni!$C$7:$T$126,8,0)","v":0},{"$f":"VLOOKUP($B17,VysledkyDoplneni!$C$7:$T$126,9,0)","v":0},{"$f":"VLOOKUP($B17,VysledkyDoplneni!$C$7:$T$126,10,0)","v":0},{"$f":"VLOOKUP($B17,VysledkyDoplneni!$C$7:$T$126,11,0)","v":0},{"$f":"VLOOKUP($B17,VysledkyDoplneni!$C$7:$T$126,12,0)","v":0},{"$f":"VLOOKUP($B17,VysledkyDoplneni!$C$7:$T$126,13,0)","v":0},{"$f":"VLOOKUP($B17,VysledkyDoplneni!$C$7:$T$126,14,0)","v":0},{"$f":"VLOOKUP($B17,VysledkyDoplneni!$C$7:$T$126,15,0)","v":0},{"$f":"VLOOKUP($B17,VysledkyDoplneni!$C$7:$T$126,16,0)","v":0},{"$f":"VLOOKUP($B17,VysledkyDoplneni!$C$7:$T$126,17,0)","v":0},{"$f":"VLOOKUP($B17,VysledkyDoplneni!$C$7:$T$126,18,0)","v":0},null,null,{"$f":"SUM(D17:S17)","v":49},{"$f":"(V17/(Data!$B$18*X17))","v":{"v":0.8166666666666667,"d":"81.7%"}},3]
[11,{"$f":"IF(Vstup!C54<>\"\",Vstup!C54,\"\")","v":"Šindelář Milan"},"S",{"$f":"VLOOKUP($B18,VysledkyDoplneni!$C$7:$T$126,3,0)","v":18},{"$f":"VLOOKUP($B18,VysledkyDoplneni!$C$7:$T$126,4,0)","v":12},{"$f":"VLOOKUP($B18,VysledkyDoplneni!$C$7:$T$126,5,0)","v":19},{"$f":"VLOOKUP($B18,VysledkyDoplneni!$C$7:$T$126,6,0)","v":0},{"$f":"VLOOKUP($B18,VysledkyDoplneni!$C$7:$T$126,7,0)","v":0},{"$f":"VLOOKUP($B18,VysledkyDoplneni!$C$7:$T$126,8,0)","v":0},{"$f":"VLOOKUP($B18,VysledkyDoplneni!$C$7:$T$126,9,0)","v":0},{"$f":"VLOOKUP($B18,VysledkyDoplneni!$C$7:$T$126,10,0)","v":0},{"$f":"VLOOKUP($B18,VysledkyDoplneni!$C$7:$T$126,11,0)","v":0},{"$f":"VLOOKUP($B18,VysledkyDoplneni!$C$7:$T$126,12,0)","v":0},{"$f":"VLOOKUP($B18,VysledkyDoplneni!$C$7:$T$126,13,0)","v":0},{"$f":"VLOOKUP($B18,VysledkyDoplneni!$C$7:$T$126,14,0)","v":0},{"$f":"VLOOKUP($B18,VysledkyDoplneni!$C$7:$T$126,15,0)","v":0},{"$f":"VLOOKUP($B18,VysledkyDoplneni!$C$7:$T$126,16,0)","v":0},{"$f":"VLOOKUP($B18,VysledkyDoplneni!$C$7:$T$126,17,0)","v":0},{"$f":"VLOOKUP($B18,VysledkyDoplneni!$C$7:$T$126,18,0)","v":0},null,null,{"$f":"SUM(D18:S18)","v":49},{"$f":"(V18/(Data!$B$18*X18))","v":{"v":0.8166666666666667,"d":"81.7%"}},3]
[12,{"$f":"IF(Vstup!C44<>\"\",Vstup!C44,\"\")","v":"Mach Jan"},"S",{"$f":"VLOOKUP($B19,VysledkyDoplneni!$C$7:$T$126,3,0)","v":19},{"$f":"VLOOKUP($B19,VysledkyDoplneni!$C$7:$T$126,4,0)","v":9},{"$f":"VLOOKUP($B19,VysledkyDoplneni!$C$7:$T$126,5,0)","v":20},{"$f":"VLOOKUP($B19,VysledkyDoplneni!$C$7:$T$126,6,0)","v":0},{"$f":"VLOOKUP($B19,VysledkyDoplneni!$C$7:$T$126,7,0)","v":0},{"$f":"VLOOKUP($B19,VysledkyDoplneni!$C$7:$T$126,8,0)","v":0},{"$f":"VLOOKUP($B19,VysledkyDoplneni!$C$7:$T$126,9,0)","v":0},{"$f":"VLOOKUP($B19,VysledkyDoplneni!$C$7:$T$126,10,0)","v":0},{"$f":"VLOOKUP($B19,VysledkyDoplneni!$C$7:$T$126,11,0)","v":0},{"$f":"VLOOKUP($B19,VysledkyDoplneni!$C$7:$T$126,12,0)","v":0},{"$f":"VLOOKUP($B19,VysledkyDoplneni!$C$7:$T$126,13,0)","v":0},{"$f":"VLOOKUP($B19,VysledkyDoplneni!$C$7:$T$126,14,0)","v":0},{"$f":"VLOOKUP($B19,VysledkyDoplneni!$C$7:$T$126,15,0)","v":0},{"$f":"VLOOKUP($B19,VysledkyDoplneni!$C$7:$T$126,16,0)","v":0},{"$f":"VLOOKUP($B19,VysledkyDoplneni!$C$7:$T$126,17,0)","v":0},{"$f":"VLOOKUP($B19,VysledkyDoplneni!$C$7:$T$126,18,0)","v":0},null,null,{"$f":"SUM(D19:S19)","v":48},{"$f":"(V19/(Data!$B$18*X19))","v":{"v":0.8,"d":"80.0%"}},3]
[13,{"$f":"IF(Vstup!C36<>\"\",Vstup!C36,\"\")","v":"Leihs Gustav"},"S",{"$f":"VLOOKUP($B20,VysledkyDoplneni!$C$7:$T$126,3,0)","v":16},{"$f":"VLOOKUP($B20,VysledkyDoplneni!$C$7:$T$126,4,0)","v":15},{"$f":"VLOOKUP($B20,VysledkyDoplneni!$C$7:$T$126,5,0)","v":17},{"$f":"VLOOKUP($B20,VysledkyDoplneni!$C$7:$T$126,6,0)","v":0},{"$f":"VLOOKUP($B20,VysledkyDoplneni!$C$7:$T$126,7,0)","v":0},{"$f":"VLOOKUP($B20,VysledkyDoplneni!$C$7:$T$126,8,0)","v":0},{"$f":"VLOOKUP($B20,VysledkyDoplneni!$C$7:$T$126,9,0)","v":0},{"$f":"VLOOKUP($B20,VysledkyDoplneni!$C$7:$T$126,10,0)","v":0},{"$f":"VLOOKUP($B20,VysledkyDoplneni!$C$7:$T$126,11,0)","v":0},{"$f":"VLOOKUP($B20,VysledkyDoplneni!$C$7:$T$126,12,0)","v":0},{"$f":"VLOOKUP($B20,VysledkyDoplneni!$C$7:$T$126,13,0)","v":0},{"$f":"VLOOKUP($B20,VysledkyDoplneni!$C$7:$T$126,14,0)","v":0},{"$f":"VLOOKUP($B20,VysledkyDoplneni!$C$7:$T$126,15,0)","v":0},{"$f":"VLOOKUP($B20,VysledkyDoplneni!$C$7:$T$126,16,0)","v":0},{"$f":"VLOOKUP($B20,VysledkyDoplneni!$C$7:$T$126,17,0)","v":0},{"$f":"VLOOKUP($B20,VysledkyDoplneni!$C$7:$T$126,18,0)","v":0},null,null,{"$f":"SUM(D20:S20)","v":48},{"$f":"(V20/(Data!$B$18*X20))","v":{"v":0.8,"d":"80.0%"}},3]
[14,{"$f":"IF(Vstup!C21<>\"\",Vstup!C21,\"\")","v":"Trepka Jiří"},"S",{"$f":"VLOOKUP($B21,VysledkyDoplneni!$C$7:$T$126,3,0)","v":15},{"$f":"VLOOKUP($B21,VysledkyDoplneni!$C$7:$T$126,4,0)","v":17},{"$f":"VLOOKUP($B21,VysledkyDoplneni!$C$7:$T$126,5,0)","v":16},{"$f":"VLOOKUP($B21,VysledkyDoplneni!$C$7:$T$126,6,0)","v":0},{"$f":"VLOOKUP($B21,VysledkyDoplneni!$C$7:$T$126,7,0)","v":0},{"$f":"VLOOKUP($B21,VysledkyDoplneni!$C$7:$T$126,8,0)","v":0},{"$f":"VLOOKUP($B21,VysledkyDoplneni!$C$7:$T$126,9,0)","v":0},{"$f":"VLOOKUP($B21,VysledkyDoplneni!$C$7:$T$126,10,0)","v":0},{"$f":"VLOOKUP($B21,VysledkyDoplneni!$C$7:$T$126,11,0)","v":0},{"$f":"VLOOKUP($B21,VysledkyDoplneni!$C$7:$T$126,12,0)","v":0},{"$f":"VLOOKUP($B21,VysledkyDoplneni!$C$7:$T$126,13,0)","v":0},{"$f":"VLOOKUP($B21,VysledkyDoplneni!$C$7:$T$126,14,0)","v":0},{"$f":"VLOOKUP($B21,VysledkyDoplneni!$C$7:$T$126,15,0)","v":0},{"$f":"VLOOKUP($B21,VysledkyDoplneni!$C$7:$T$126,16,0)","v":0},{"$f":"VLOOKUP($B21,VysledkyDoplneni!$C$7:$T$126,17,0)","v":0},{"$f":"VLOOKUP($B21,VysledkyDoplneni!$C$7:$T$126,18,0)","v":0},null,null,{"$f":"SUM(D21:S21)","v":48},{"$f":"(V21/(Data!$B$18*X21))","v":{"v":0.8,"d":"80.0%"}},3]
[15,{"$f":"IF(Vstup!C40<>\"\",Vstup!C40,\"\")","v":"Noháček Jaroslav"},"S",{"$f":"VLOOKUP($B22,VysledkyDoplneni!$C$7:$T$126,3,0)","v":15},{"$f":"VLOOKUP($B22,VysledkyDoplneni!$C$7:$T$126,4,0)","v":14},{"$f":"VLOOKUP($B22,VysledkyDoplneni!$C$7:$T$126,5,0)","v":18},{"$f":"VLOOKUP($B22,VysledkyDoplneni!$C$7:$T$126,6,0)","v":0},{"$f":"VLOOKUP($B22,VysledkyDoplneni!$C$7:$T$126,7,0)","v":0},{"$f":"VLOOKUP($B22,VysledkyDoplneni!$C$7:$T$126,8,0)","v":0},{"$f":"VLOOKUP($B22,VysledkyDoplneni!$C$7:$T$126,9,0)","v":0},{"$f":"VLOOKUP($B22,VysledkyDoplneni!$C$7:$T$126,10,0)","v":0},{"$f":"VLOOKUP($B22,VysledkyDoplneni!$C$7:$T$126,11,0)","v":0},{"$f":"VLOOKUP($B22,VysledkyDoplneni!$C$7:$T$126,12,0)","v":0},{"$f":"VLOOKUP($B22,VysledkyDoplneni!$C$7:$T$126,13,0)","v":0},{"$f":"VLOOKUP($B22,VysledkyDoplneni!$C$7:$T$126,14,0)","v":0},{"$f":"VLOOKUP($B22,VysledkyDoplneni!$C$7:$T$126,15,0)","v":0},{"$f":"VLOOKUP($B22,VysledkyDoplneni!$C$7:$T$126,16,0)","v":0},{"$f":"VLOOKUP($B22,VysledkyDoplneni!$C$7:$T$126,17,0)","v":0},{"$f":"VLOOKUP($B22,VysledkyDoplneni!$C$7:$T$126,18,0)","v":0},null,null,{"$f":"SUM(D22:S22)","v":47},{"$f":"(V22/(Data!$B$18*X22))","v":{"v":0.7833333333333333,"d":"78.3%"}},3]
[16,{"$f":"IF(Vstup!C51<>\"\",Vstup!C51,\"\")","v":"Štengl Jiří"},"S",{"$f":"VLOOKUP($B23,VysledkyDoplneni!$C$7:$T$126,3,0)","v":13},{"$f":"VLOOKUP($B23,VysledkyDoplneni!$C$7:$T$126,4,0)","v":15},{"$f":"VLOOKUP($B23,VysledkyDoplneni!$C$7:$T$126,5,0)","v":19},{"$f":"VLOOKUP($B23,VysledkyDoplneni!$C$7:$T$126,6,0)","v":0},{"$f":"VLOOKUP($B23,VysledkyDoplneni!$C$7:$T$126,7,0)","v":0},{"$f":"VLOOKUP($B23,VysledkyDoplneni!$C$7:$T$126,8,0)","v":0},{"$f":"VLOOKUP($B23,VysledkyDoplneni!$C$7:$T$126,9,0)","v":0},{"$f":"VLOOKUP($B23,VysledkyDoplneni!$C$7:$T$126,10,0)","v":0},{"$f":"VLOOKUP($B23,VysledkyDoplneni!$C$7:$T$126,11,0)","v":0},{"$f":"VLOOKUP($B23,VysledkyDoplneni!$C$7:$T$126,12,0)","v":0},{"$f":"VLOOKUP($B23,VysledkyDoplneni!$C$7:$T$126,13,0)","v":0},{"$f":"VLOOKUP($B23,VysledkyDoplneni!$C$7:$T$126,14,0)","v":0},{"$f":"VLOOKUP($B23,VysledkyDoplneni!$C$7:$T$126,15,0)","v":0},{"$f":"VLOOKUP($B23,VysledkyDoplneni!$C$7:$T$126,16,0)","v":0},{"$f":"VLOOKUP($B23,VysledkyDoplneni!$C$7:$T$126,17,0)","v":0},{"$f":"VLOOKUP($B23,VysledkyDoplneni!$C$7:$T$126,18,0)","v":0},null,null,{"$f":"SUM(D23:S23)","v":47},{"$f":"(V23/(Data!$B$18*X23))","v":{"v":0.7833333333333333,"d":"78.3%"}},3]
[17,{"$f":"IF(Vstup!C19<>\"\",Vstup!C19,\"\")","v":"Adámek Bohuslav"},"S",{"$f":"VLOOKUP($B24,VysledkyDoplneni!$C$7:$T$126,3,0)","v":15},{"$f":"VLOOKUP($B24,VysledkyDoplneni!$C$7:$T$126,4,0)","v":15},{"$f":"VLOOKUP($B24,VysledkyDoplneni!$C$7:$T$126,5,0)","v":16},{"$f":"VLOOKUP($B24,VysledkyDoplneni!$C$7:$T$126,6,0)","v":0},{"$f":"VLOOKUP($B24,VysledkyDoplneni!$C$7:$T$126,7,0)","v":0},{"$f":"VLOOKUP($B24,VysledkyDoplneni!$C$7:$T$126,8,0)","v":0},{"$f":"VLOOKUP($B24,VysledkyDoplneni!$C$7:$T$126,9,0)","v":0},{"$f":"VLOOKUP($B24,VysledkyDoplneni!$C$7:$T$126,10,0)","v":0},{"$f":"VLOOKUP($B24,VysledkyDoplneni!$C$7:$T$126,11,0)","v":0},{"$f":"VLOOKUP($B24,VysledkyDoplneni!$C$7:$T$126,12,0)","v":0},{"$f":"VLOOKUP($B24,VysledkyDoplneni!$C$7:$T$126,13,0)","v":0},{"$f":"VLOOKUP($B24,VysledkyDoplneni!$C$7:$T$126,14,0)","v":0},{"$f":"VLOOKUP($B24,VysledkyDoplneni!$C$7:$T$126,15,0)","v":0},{"$f":"VLOOKUP($B24,VysledkyDoplneni!$C$7:$T$126,16,0)","v":0},{"$f":"VLOOKUP($B24,VysledkyDoplneni!$C$7:$T$126,17,0)","v":0},{"$f":"VLOOKUP($B24,VysledkyDoplneni!$C$7:$T$126,18,0)","v":0},null,null,{"$f":"SUM(D24:S24)","v":46},{"$f":"(V24/(Data!$B$18*X24))","v":{"v":0.7666666666666667,"d":"76.7%"}},3]
[18,{"$f":"IF(Vstup!C29<>\"\",Vstup!C29,\"\")","v":"Sedláček Jiří"},"S",{"$f":"VLOOKUP($B25,VysledkyDoplneni!$C$7:$T$126,3,0)","v":12},{"$f":"VLOOKUP($B25,VysledkyDoplneni!$C$7:$T$126,4,0)","v":14},{"$f":"VLOOKUP($B25,VysledkyDoplneni!$C$7:$T$126,5,0)","v":20},{"$f":"VLOOKUP($B25,VysledkyDoplneni!$C$7:$T$126,6,0)","v":0},{"$f":"VLOOKUP($B25,VysledkyDoplneni!$C$7:$T$126,7,0)","v":0},{"$f":"VLOOKUP($B25,VysledkyDoplneni!$C$7:$T$126,8,0)","v":0},{"$f":"VLOOKUP($B25,VysledkyDoplneni!$C$7:$T$126,9,0)","v":0},{"$f":"VLOOKUP($B25,VysledkyDoplneni!$C$7:$T$126,10,0)","v":0},{"$f":"VLOOKUP($B25,VysledkyDoplneni!$C$7:$T$126,11,0)","v":0},{"$f":"VLOOKUP($B25,VysledkyDoplneni!$C$7:$T$126,12,0)","v":0},{"$f":"VLOOKUP($B25,VysledkyDoplneni!$C$7:$T$126,13,0)","v":0},{"$f":"VLOOKUP($B25,VysledkyDoplneni!$C$7:$T$126,14,0)","v":0},{"$f":"VLOOKUP($B25,VysledkyDoplneni!$C$7:$T$126,15,0)","v":0},{"$f":"VLOOKUP($B25,VysledkyDoplneni!$C$7:$T$126,16,0)","v":0},{"$f":"VLOOKUP($B25,VysledkyDoplneni!$C$7:$T$126,17,0)","v":0},{"$f":"VLOOKUP($B25,VysledkyDoplneni!$C$7:$T$126,18,0)","v":0},null,null,{"$f":"SUM(D25:S25)","v":46},{"$f":"(V25/(Data!$B$18*X25))","v":{"v":0.7666666666666667,"d":"76.7%"}},3]
[19,{"$f":"IF(Vstup!C38<>\"\",Vstup!C38,\"\")","v":"Růžek Luboš"},"S",{"$f":"VLOOKUP($B26,VysledkyDoplneni!$C$7:$T$126,3,0)","v":19},{"$f":"VLOOKUP($B26,VysledkyDoplneni!$C$7:$T$126,4,0)","v":11},{"$f":"VLOOKUP($B26,VysledkyDoplneni!$C$7:$T$126,5,0)","v":14},{"$f":"VLOOKUP($B26,VysledkyDoplneni!$C$7:$T$126,6,0)","v":0},{"$f":"VLOOKUP($B26,VysledkyDoplneni!$C$7:$T$126,7,0)","v":0},{"$f":"VLOOKUP($B26,VysledkyDoplneni!$C$7:$T$126,8,0)","v":0},{"$f":"VLOOKUP($B26,VysledkyDoplneni!$C$7:$T$126,9,0)","v":0},{"$f":"VLOOKUP($B26,VysledkyDoplneni!$C$7:$T$126,10,0)","v":0},{"$f":"VLOOKUP($B26,VysledkyDoplneni!$C$7:$T$126,11,0)","v":0},{"$f":"VLOOKUP($B26,VysledkyDoplneni!$C$7:$T$126,12,0)","v":0},{"$f":"VLOOKUP($B26,VysledkyDoplneni!$C$7:$T$126,13,0)","v":0},{"$f":"VLOOKUP($B26,VysledkyDoplneni!$C$7:$T$126,14,0)","v":0},{"$f":"VLOOKUP($B26,VysledkyDoplneni!$C$7:$T$126,15,0)","v":0},{"$f":"VLOOKUP($B26,VysledkyDoplneni!$C$7:$T$126,16,0)","v":0},{"$f":"VLOOKUP($B26,VysledkyDoplneni!$C$7:$T$126,17,0)","v":0},{"$f":"VLOOKUP($B26,VysledkyDoplneni!$C$7:$T$126,18,0)","v":0},null,null,{"$f":"SUM(D26:S26)","v":44},{"$f":"(V26/(Data!$B$18*X26))","v":{"v":0.7333333333333333,"d":"73.3%"}},3]
[20,{"$f":"IF(Vstup!C46<>\"\",Vstup!C46,\"\")","v":"Racek Petr"},"S",{"$f":"VLOOKUP($B27,VysledkyDoplneni!$C$7:$T$126,3,0)","v":15},{"$f":"VLOOKUP($B27,VysledkyDoplneni!$C$7:$T$126,4,0)","v":15},{"$f":"VLOOKUP($B27,VysledkyDoplneni!$C$7:$T$126,5,0)","v":14},{"$f":"VLOOKUP($B27,VysledkyDoplneni!$C$7:$T$126,6,0)","v":0},{"$f":"VLOOKUP($B27,VysledkyDoplneni!$C$7:$T$126,7,0)","v":0},{"$f":"VLOOKUP($B27,VysledkyDoplneni!$C$7:$T$126,8,0)","v":0},{"$f":"VLOOKUP($B27,VysledkyDoplneni!$C$7:$T$126,9,0)","v":0},{"$f":"VLOOKUP($B27,VysledkyDoplneni!$C$7:$T$126,10,0)","v":0},{"$f":"VLOOKUP($B27,VysledkyDoplneni!$C$7:$T$126,11,0)","v":0},{"$f":"VLOOKUP($B27,VysledkyDoplneni!$C$7:$T$126,12,0)","v":0},{"$f":"VLOOKUP($B27,VysledkyDoplneni!$C$7:$T$126,13,0)","v":0},{"$f":"VLOOKUP($B27,VysledkyDoplneni!$C$7:$T$126,14,0)","v":0},{"$f":"VLOOKUP($B27,VysledkyDoplneni!$C$7:$T$126,15,0)","v":0},{"$f":"VLOOKUP($B27,VysledkyDoplneni!$C$7:$T$126,16,0)","v":0},{"$f":"VLOOKUP($B27,VysledkyDoplneni!$C$7:$T$126,17,0)","v":0},{"$f":"VLOOKUP($B27,VysledkyDoplneni!$C$7:$T$126,18,0)","v":0},null,null,{"$f":"SUM(D27:S27)","v":44},{"$f":"(V27/(Data!$B$18*X27))","v":{"v":0.7333333333333333,"d":"73.3%"}},3]
[21,{"$f":"IF(Vstup!C49<>\"\",Vstup!C49,\"\")","v":"Pechan Josef"},"S",{"$f":"VLOOKUP($B28,VysledkyDoplneni!$C$7:$T$126,3,0)","v":14},{"$f":"VLOOKUP($B28,VysledkyDoplneni!$C$7:$T$126,4,0)","v":15},{"$f":"VLOOKUP($B28,VysledkyDoplneni!$C$7:$T$126,5,0)","v":15},{"$f":"VLOOKUP($B28,VysledkyDoplneni!$C$7:$T$126,6,0)","v":0},{"$f":"VLOOKUP($B28,VysledkyDoplneni!$C$7:$T$126,7,0)","v":0},{"$f":"VLOOKUP($B28,VysledkyDoplneni!$C$7:$T$126,8,0)","v":0},{"$f":"VLOOKUP($B28,VysledkyDoplneni!$C$7:$T$126,9,0)","v":0},{"$f":"VLOOKUP($B28,VysledkyDoplneni!$C$7:$T$126,10,0)","v":0},{"$f":"VLOOKUP($B28,VysledkyDoplneni!$C$7:$T$126,11,0)","v":0},{"$f":"VLOOKUP($B28,VysledkyDoplneni!$C$7:$T$126,12,0)","v":0},{"$f":"VLOOKUP($B28,VysledkyDoplneni!$C$7:$T$126,13,0)","v":0},{"$f":"VLOOKUP($B28,VysledkyDoplneni!$C$7:$T$126,14,0)","v":0},{"$f":"VLOOKUP($B28,VysledkyDoplneni!$C$7:$T$126,15,0)","v":0},{"$f":"VLOOKUP($B28,VysledkyDoplneni!$C$7:$T$126,16,0)","v":0},{"$f":"VLOOKUP($B28,VysledkyDoplneni!$C$7:$T$126,17,0)","v":0},{"$f":"VLOOKUP($B28,VysledkyDoplneni!$C$7:$T$126,18,0)","v":0},null,null,{"$f":"SUM(D28:S28)","v":44},{"$f":"(V28/(Data!$B$18*X28))","v":{"v":0.7333333333333333,"d":"73.3%"}},3]
[22,{"$f":"IF(Vstup!C43<>\"\",Vstup!C43,\"\")","v":"Lusk Stanislav"},"S",{"$f":"VLOOKUP($B29,VysledkyDoplneni!$C$7:$T$126,3,0)","v":17},{"$f":"VLOOKUP($B29,VysledkyDoplneni!$C$7:$T$126,4,0)","v":11},{"$f":"VLOOKUP($B29,VysledkyDoplneni!$C$7:$T$126,5,0)","v":14},{"$f":"VLOOKUP($B29,VysledkyDoplneni!$C$7:$T$126,6,0)","v":0},{"$f":"VLOOKUP($B29,VysledkyDoplneni!$C$7:$T$126,7,0)","v":0},{"$f":"VLOOKUP($B29,VysledkyDoplneni!$C$7:$T$126,8,0)","v":0},{"$f":"VLOOKUP($B29,VysledkyDoplneni!$C$7:$T$126,9,0)","v":0},{"$f":"VLOOKUP($B29,VysledkyDoplneni!$C$7:$T$126,10,0)","v":0},{"$f":"VLOOKUP($B29,VysledkyDoplneni!$C$7:$T$126,11,0)","v":0},{"$f":"VLOOKUP($B29,VysledkyDoplneni!$C$7:$T$126,12,0)","v":0},{"$f":"VLOOKUP($B29,VysledkyDoplneni!$C$7:$T$126,13,0)","v":0},{"$f":"VLOOKUP($B29,VysledkyDoplneni!$C$7:$T$126,14,0)","v":0},{"$f":"VLOOKUP($B29,VysledkyDoplneni!$C$7:$T$126,15,0)","v":0},{"$f":"VLOOKUP($B29,VysledkyDoplneni!$C$7:$T$126,16,0)","v":0},{"$f":"VLOOKUP($B29,VysledkyDoplneni!$C$7:$T$126,17,0)","v":0},{"$f":"VLOOKUP($B29,VysledkyDoplneni!$C$7:$T$126,18,0)","v":0},null,null,{"$f":"SUM(D29:S29)","v":42},{"$f":"(V29/(Data!$B$18*X29))","v":{"v":0.7,"d":"70.0%"}},3]
[23,{"$f":"IF(Vstup!C9<>\"\",Vstup!C9,\"\")","v":"Štenglová Michaela"},"S",{"$f":"VLOOKUP($B30,VysledkyDoplneni!$C$7:$T$126,3,0)","v":15},{"$f":"VLOOKUP($B30,VysledkyDoplneni!$C$7:$T$126,4,0)","v":14},{"$f":"VLOOKUP($B30,VysledkyDoplneni!$C$7:$T$126,5,0)","v":13},{"$f":"VLOOKUP($B30,VysledkyDoplneni!$C$7:$T$126,6,0)","v":0},{"$f":"VLOOKUP($B30,VysledkyDoplneni!$C$7:$T$126,7,0)","v":0},{"$f":"VLOOKUP($B30,VysledkyDoplneni!$C$7:$T$126,8,0)","v":0},{"$f":"VLOOKUP($B30,VysledkyDoplneni!$C$7:$T$126,9,0)","v":0},{"$f":"VLOOKUP($B30,VysledkyDoplneni!$C$7:$T$126,10,0)","v":0},{"$f":"VLOOKUP($B30,VysledkyDoplneni!$C$7:$T$126,11,0)","v":0},{"$f":"VLOOKUP($B30,VysledkyDoplneni!$C$7:$T$126,12,0)","v":0},{"$f":"VLOOKUP($B30,VysledkyDoplneni!$C$7:$T$126,13,0)","v":0},{"$f":"VLOOKUP($B30,VysledkyDoplneni!$C$7:$T$126,14,0)","v":0},{"$f":"VLOOKUP($B30,VysledkyDoplneni!$C$7:$T$126,15,0)","v":0},{"$f":"VLOOKUP($B30,VysledkyDoplneni!$C$7:$T$126,16,0)","v":0},{"$f":"VLOOKUP($B30,VysledkyDoplneni!$C$7:$T$126,17,0)","v":0},{"$f":"VLOOKUP($B30,VysledkyDoplneni!$C$7:$T$126,18,0)","v":0},null,null,{"$f":"SUM(D30:S30)","v":42},{"$f":"(V30/(Data!$B$18*X30))","v":{"v":0.7,"d":"70.0%"}},3]
[24,{"$f":"IF(Vstup!C28<>\"\",Vstup!C28,\"\")","v":"Čechura Pavel"},"S",{"$f":"VLOOKUP($B31,VysledkyDoplneni!$C$7:$T$126,3,0)","v":13},{"$f":"VLOOKUP($B31,VysledkyDoplneni!$C$7:$T$126,4,0)","v":13},{"$f":"VLOOKUP($B31,VysledkyDoplneni!$C$7:$T$126,5,0)","v":16},{"$f":"VLOOKUP($B31,VysledkyDoplneni!$C$7:$T$126,6,0)","v":0},{"$f":"VLOOKUP($B31,VysledkyDoplneni!$C$7:$T$126,7,0)","v":0},{"$f":"VLOOKUP($B31,VysledkyDoplneni!$C$7:$T$126,8,0)","v":0},{"$f":"VLOOKUP($B31,VysledkyDoplneni!$C$7:$T$126,9,0)","v":0},{"$f":"VLOOKUP($B31,VysledkyDoplneni!$C$7:$T$126,10,0)","v":0},{"$f":"VLOOKUP($B31,VysledkyDoplneni!$C$7:$T$126,11,0)","v":0},{"$f":"VLOOKUP($B31,VysledkyDoplneni!$C$7:$T$126,12,0)","v":0},{"$f":"VLOOKUP($B31,VysledkyDoplneni!$C$7:$T$126,13,0)","v":0},{"$f":"VLOOKUP($B31,VysledkyDoplneni!$C$7:$T$126,14,0)","v":0},{"$f":"VLOOKUP($B31,VysledkyDoplneni!$C$7:$T$126,15,0)","v":0},{"$f":"VLOOKUP($B31,VysledkyDoplneni!$C$7:$T$126,16,0)","v":0},{"$f":"VLOOKUP($B31,VysledkyDoplneni!$C$7:$T$126,17,0)","v":0},{"$f":"VLOOKUP($B31,VysledkyDoplneni!$C$7:$T$126,18,0)","v":0},null,null,{"$f":"SUM(D31:S31)","v":42},{"$f":"(V31/(Data!$B$18*X31))","v":{"v":0.7,"d":"70.0%"}},3]
[25,{"$f":"IF(Vstup!C22<>\"\",Vstup!C22,\"\")","v":"Dusík Vladimír"},"S",{"$f":"VLOOKUP($B32,VysledkyDoplneni!$C$7:$T$126,3,0)","v":15},{"$f":"VLOOKUP($B32,VysledkyDoplneni!$C$7:$T$126,4,0)","v":12},{"$f":"VLOOKUP($B32,VysledkyDoplneni!$C$7:$T$126,5,0)","v":13},{"$f":"VLOOKUP($B32,VysledkyDoplneni!$C$7:$T$126,6,0)","v":0},{"$f":"VLOOKUP($B32,VysledkyDoplneni!$C$7:$T$126,7,0)","v":0},{"$f":"VLOOKUP($B32,VysledkyDoplneni!$C$7:$T$126,8,0)","v":0},{"$f":"VLOOKUP($B32,VysledkyDoplneni!$C$7:$T$126,9,0)","v":0},{"$f":"VLOOKUP($B32,VysledkyDoplneni!$C$7:$T$126,10,0)","v":0},{"$f":"VLOOKUP($B32,VysledkyDoplneni!$C$7:$T$126,11,0)","v":0},{"$f":"VLOOKUP($B32,VysledkyDoplneni!$C$7:$T$126,12,0)","v":0},{"$f":"VLOOKUP($B32,VysledkyDoplneni!$C$7:$T$126,13,0)","v":0},{"$f":"VLOOKUP($B32,VysledkyDoplneni!$C$7:$T$126,14,0)","v":0},{"$f":"VLOOKUP($B32,VysledkyDoplneni!$C$7:$T$126,15,0)","v":0},{"$f":"VLOOKUP($B32,VysledkyDoplneni!$C$7:$T$126,16,0)","v":0},{"$f":"VLOOKUP($B32,VysledkyDoplneni!$C$7:$T$126,17,0)","v":0},{"$f":"VLOOKUP($B32,VysledkyDoplneni!$C$7:$T$126,18,0)","v":0},null,null,{"$f":"SUM(D32:S32)","v":40},{"$f":"(V32/(Data!$B$18*X32))","v":{"v":0.6666666666666666,"d":"66.7%"}},3]
[26,{"$f":"IF(Vstup!C33<>\"\",Vstup!C33,\"\")","v":"Šindelář Jan"},"S",{"$f":"VLOOKUP($B33,VysledkyDoplneni!$C$7:$T$126,3,0)","v":8},{"$f":"VLOOKUP($B33,VysledkyDoplneni!$C$7:$T$126,4,0)","v":13},{"$f":"VLOOKUP($B33,VysledkyDoplneni!$C$7:$T$126,5,0)","v":19},{"$f":"VLOOKUP($B33,VysledkyDoplneni!$C$7:$T$126,6,0)","v":0},{"$f":"VLOOKUP($B33,VysledkyDoplneni!$C$7:$T$126,7,0)","v":0},{"$f":"VLOOKUP($B33,VysledkyDoplneni!$C$7:$T$126,8,0)","v":0},{"$f":"VLOOKUP($B33,VysledkyDoplneni!$C$7:$T$126,9,0)","v":0},{"$f":"VLOOKUP($B33,VysledkyDoplneni!$C$7:$T$126,10,0)","v":0},{"$f":"VLOOKUP($B33,VysledkyDoplneni!$C$7:$T$126,11,0)","v":0},{"$f":"VLOOKUP($B33,VysledkyDoplneni!$C$7:$T$126,12,0)","v":0},{"$f":"VLOOKUP($B33,VysledkyDoplneni!$C$7:$T$126,13,0)","v":0},{"$f":"VLOOKUP($B33,VysledkyDoplneni!$C$7:$T$126,14,0)","v":0},{"$f":"VLOOKUP($B33,VysledkyDoplneni!$C$7:$T$126,15,0)","v":0},{"$f":"VLOOKUP($B33,VysledkyDoplneni!$C$7:$T$126,16,0)","v":0},{"$f":"VLOOKUP($B33,VysledkyDoplneni!$C$7:$T$126,17,0)","v":0},{"$f":"VLOOKUP($B33,VysledkyDoplneni!$C$7:$T$126,18,0)","v":0},null,null,{"$f":"SUM(D33:T33)","v":40},{"$f":"(V33/(Data!$B$18*X33))","v":{"v":0.6666666666666666,"d":"66.7%"}},3]
[27,{"$f":"IF(Vstup!C50<>\"\",Vstup!C50,\"\")","v":"Kučera Václav"},"S",{"$f":"VLOOKUP($B34,VysledkyDoplneni!$C$7:$T$126,3,0)","v":16},{"$f":"VLOOKUP($B34,VysledkyDoplneni!$C$7:$T$126,4,0)","v":13},{"$f":"VLOOKUP($B34,VysledkyDoplneni!$C$7:$T$126,5,0)","v":10},{"$f":"VLOOKUP($B34,VysledkyDoplneni!$C$7:$T$126,6,0)","v":0},{"$f":"VLOOKUP($B34,VysledkyDoplneni!$C$7:$T$126,7,0)","v":0},{"$f":"VLOOKUP($B34,VysledkyDoplneni!$C$7:$T$126,8,0)","v":0},{"$f":"VLOOKUP($B34,VysledkyDoplneni!$C$7:$T$126,9,0)","v":0},{"$f":"VLOOKUP($B34,VysledkyDoplneni!$C$7:$T$126,10,0)","v":0},{"$f":"VLOOKUP($B34,VysledkyDoplneni!$C$7:$T$126,11,0)","v":0},{"$f":"VLOOKUP($B34,VysledkyDoplneni!$C$7:$T$126,12,0)","v":0},{"$f":"VLOOKUP($B34,VysledkyDoplneni!$C$7:$T$126,13,0)","v":0},{"$f":"VLOOKUP($B34,VysledkyDoplneni!$C$7:$T$126,14,0)","v":0},{"$f":"VLOOKUP($B34,VysledkyDoplneni!$C$7:$T$126,15,0)","v":0},{"$f":"VLOOKUP($B34,VysledkyDoplneni!$C$7:$T$126,16,0)","v":0},{"$f":"VLOOKUP($B34,VysledkyDoplneni!$C$7:$T$126,17,0)","v":0},{"$f":"VLOOKUP($B34,VysledkyDoplneni!$C$7:$T$126,18,0)","v":0},null,null,{"$f":"SUM(D34:S34)","v":39},{"$f":"(V34/(Data!$B$18*X34))","v":{"v":0.65,"d":"65.0%"}},{"$f":"COUNTIF(D34:S34,\">0\")","v":3}]
[28,{"$f":"IF(Vstup!C37<>\"\",Vstup!C37,\"\")","v":"Škrýba Petr"},"S",{"$f":"VLOOKUP($B35,VysledkyDoplneni!$C$7:$T$126,3,0)","v":15},{"$f":"VLOOKUP($B35,VysledkyDoplneni!$C$7:$T$126,4,0)","v":12},{"$f":"VLOOKUP($B35,VysledkyDoplneni!$C$7:$T$126,5,0)","v":12},{"$f":"VLOOKUP($B35,VysledkyDoplneni!$C$7:$T$126,6,0)","v":0},{"$f":"VLOOKUP($B35,VysledkyDoplneni!$C$7:$T$126,7,0)","v":0},{"$f":"VLOOKUP($B35,VysledkyDoplneni!$C$7:$T$126,8,0)","v":0},{"$f":"VLOOKUP($B35,VysledkyDoplneni!$C$7:$T$126,9,0)","v":0},{"$f":"VLOOKUP($B35,VysledkyDoplneni!$C$7:$T$126,10,0)","v":0},{"$f":"VLOOKUP($B35,VysledkyDoplneni!$C$7:$T$126,11,0)","v":0},{"$f":"VLOOKUP($B35,VysledkyDoplneni!$C$7:$T$126,12,0)","v":0},{"$f":"VLOOKUP($B35,VysledkyDoplneni!$C$7:$T$126,13,0)","v":0},{"$f":"VLOOKUP($B35,VysledkyDoplneni!$C$7:$T$126,14,0)","v":0},{"$f":"VLOOKUP($B35,VysledkyDoplneni!$C$7:$T$126,15,0)","v":0},{"$f":"VLOOKUP($B35,VysledkyDoplneni!$C$7:$T$126,16,0)","v":0},{"$f":"VLOOKUP($B35,VysledkyDoplneni!$C$7:$T$126,17,0)","v":0},{"$f":"VLOOKUP($B35,VysledkyDoplneni!$C$7:$T$126,18,0)","v":0},null,null,{"$f":"SUM(D35:S35)","v":39},{"$f":"(V35/(Data!$B$18*X35))","v":{"v":0.65,"d":"65.0%"}},{"$f":"COUNTIF(D35:S35,\">0\")","v":3}]
[29,{"$f":"IF(Vstup!C13<>\"\",Vstup!C13,\"\")","v":"Šindelář Jiří st."},"S",{"$f":"VLOOKUP($B36,VysledkyDoplneni!$C$7:$T$126,3,0)","v":15},{"$f":"VLOOKUP($B36,VysledkyDoplneni!$C$7:$T$126,4,0)","v":11},{"$f":"VLOOKUP($B36,VysledkyDoplneni!$C$7:$T$126,5,0)","v":12},{"$f":"VLOOKUP($B36,VysledkyDoplneni!$C$7:$T$126,6,0)","v":0},{"$f":"VLOOKUP($B36,VysledkyDoplneni!$C$7:$T$126,7,0)","v":0},{"$f":"VLOOKUP($B36,VysledkyDoplneni!$C$7:$T$126,8,0)","v":0},{"$f":"VLOOKUP($B36,VysledkyDoplneni!$C$7:$T$126,9,0)","v":0},{"$f":"VLOOKUP($B36,VysledkyDoplneni!$C$7:$T$126,10,0)","v":0},{"$f":"VLOOKUP($B36,VysledkyDoplneni!$C$7:$T$126,11,0)","v":0},{"$f":"VLOOKUP($B36,VysledkyDoplneni!$C$7:$T$126,12,0)","v":0},{"$f":"VLOOKUP($B36,VysledkyDoplneni!$C$7:$T$126,13,0)","v":0},{"$f":"VLOOKUP($B36,VysledkyDoplneni!$C$7:$T$126,14,0)","v":0},{"$f":"VLOOKUP($B36,VysledkyDoplneni!$C$7:$T$126,15,0)","v":0},{"$f":"VLOOKUP($B36,VysledkyDoplneni!$C$7:$T$126,16,0)","v":0},{"$f":"VLOOKUP($B36,VysledkyDoplneni!$C$7:$T$126,17,0)","v":0},{"$f":"VLOOKUP($B36,VysledkyDoplneni!$C$7:$T$126,18,0)","v":0},null,null,{"$f":"SUM(D36:S36)","v":38},{"$f":"(V36/(Data!$B$18*X36))","v":{"v":0.6333333333333333,"d":"63.3%"}},3]
[30,{"$f":"IF(Vstup!C12<>\"\",Vstup!C12,\"\")","v":"Černý Bohuslav"},"S",{"$f":"VLOOKUP($B37,VysledkyDoplneni!$C$7:$T$126,3,0)","v":13},{"$f":"VLOOKUP($B37,VysledkyDoplneni!$C$7:$T$126,4,0)","v":14},{"$f":"VLOOKUP($B37,VysledkyDoplneni!$C$7:$T$126,5,0)","v":11},{"$f":"VLOOKUP($B37,VysledkyDoplneni!$C$7:$T$126,6,0)","v":0},{"$f":"VLOOKUP($B37,VysledkyDoplneni!$C$7:$T$126,7,0)","v":0},{"$f":"VLOOKUP($B37,VysledkyDoplneni!$C$7:$T$126,8,0)","v":0},{"$f":"VLOOKUP($B37,VysledkyDoplneni!$C$7:$T$126,9,0)","v":0},{"$f":"VLOOKUP($B37,VysledkyDoplneni!$C$7:$T$126,10,0)","v":0},{"$f":"VLOOKUP($B37,VysledkyDoplneni!$C$7:$T$126,11,0)","v":0},{"$f":"VLOOKUP($B37,VysledkyDoplneni!$C$7:$T$126,12,0)","v":0},{"$f":"VLOOKUP($B37,VysledkyDoplneni!$C$7:$T$126,13,0)","v":0},{"$f":"VLOOKUP($B37,VysledkyDoplneni!$C$7:$T$126,14,0)","v":0},{"$f":"VLOOKUP($B37,VysledkyDoplneni!$C$7:$T$126,15,0)","v":0},{"$f":"VLOOKUP($B37,VysledkyDoplneni!$C$7:$T$126,16,0)","v":0},{"$f":"VLOOKUP($B37,VysledkyDoplneni!$C$7:$T$126,17,0)","v":0},{"$f":"VLOOKUP($B37,VysledkyDoplneni!$C$7:$T$126,18,0)","v":0},null,null,{"$f":"SUM(D37:S37)","v":38},{"$f":"(V37/(Data!$B$18*X37))","v":{"v":0.6333333333333333,"d":"63.3%"}},3]
[31,{"$f":"IF(Vstup!C56<>\"\",Vstup!C56,\"\")","v":"Ulrych Jiří"},"S",{"$f":"VLOOKUP($B38,VysledkyDoplneni!$C$7:$T$126,3,0)","v":11},{"$f":"VLOOKUP($B38,VysledkyDoplneni!$C$7:$T$126,4,0)","v":11},{"$f":"VLOOKUP($B38,VysledkyDoplneni!$C$7:$T$126,5,0)","v":16},{"$f":"VLOOKUP($B38,VysledkyDoplneni!$C$7:$T$126,6,0)","v":0},{"$f":"VLOOKUP($B38,VysledkyDoplneni!$C$7:$T$126,7,0)","v":0},{"$f":"VLOOKUP($B38,VysledkyDoplneni!$C$7:$T$126,8,0)","v":0},{"$f":"VLOOKUP($B38,VysledkyDoplneni!$C$7:$T$126,9,0)","v":0},{"$f":"VLOOKUP($B38,VysledkyDoplneni!$C$7:$T$126,10,0)","v":0},{"$f":"VLOOKUP($B38,VysledkyDoplneni!$C$7:$T$126,11,0)","v":0},{"$f":"VLOOKUP($B38,VysledkyDoplneni!$C$7:$T$126,12,0)","v":0},{"$f":"VLOOKUP($B38,VysledkyDoplneni!$C$7:$T$126,13,0)","v":0},{"$f":"VLOOKUP($B38,VysledkyDoplneni!$C$7:$T$126,14,0)","v":0},{"$f":"VLOOKUP($B38,VysledkyDoplneni!$C$7:$T$126,15,0)","v":0},{"$f":"VLOOKUP($B38,VysledkyDoplneni!$C$7:$T$126,16,0)","v":0},{"$f":"VLOOKUP($B38,VysledkyDoplneni!$C$7:$T$126,17,0)","v":0},{"$f":"VLOOKUP($B38,VysledkyDoplneni!$C$7:$T$126,18,0)","v":0},null,null,{"$f":"SUM(D38:S38)","v":38},{"$f":"(V38/(Data!$B$18*X38))","v":{"v":0.6333333333333333,"d":"63.3%"}},3]
[32,{"$f":"IF(Vstup!C32<>\"\",Vstup!C32,\"\")","v":"Navara Josef"},"S",{"$f":"VLOOKUP($B39,VysledkyDoplneni!$C$7:$T$126,3,0)","v":10},{"$f":"VLOOKUP($B39,VysledkyDoplneni!$C$7:$T$126,4,0)","v":15},{"$f":"VLOOKUP($B39,VysledkyDoplneni!$C$7:$T$126,5,0)","v":13},{"$f":"VLOOKUP($B39,VysledkyDoplneni!$C$7:$T$126,6,0)","v":0},{"$f":"VLOOKUP($B39,VysledkyDoplneni!$C$7:$T$126,7,0)","v":0},{"$f":"VLOOKUP($B39,VysledkyDoplneni!$C$7:$T$126,8,0)","v":0},{"$f":"VLOOKUP($B39,VysledkyDoplneni!$C$7:$T$126,9,0)","v":0},{"$f":"VLOOKUP($B39,VysledkyDoplneni!$C$7:$T$126,10,0)","v":0},{"$f":"VLOOKUP($B39,VysledkyDoplneni!$C$7:$T$126,11,0)","v":0},{"$f":"VLOOKUP($B39,VysledkyDoplneni!$C$7:$T$126,12,0)","v":0},{"$f":"VLOOKUP($B39,VysledkyDoplneni!$C$7:$T$126,13,0)","v":0},{"$f":"VLOOKUP($B39,VysledkyDoplneni!$C$7:$T$126,14,0)","v":0},{"$f":"VLOOKUP($B39,VysledkyDoplneni!$C$7:$T$126,15,0)","v":0},{"$f":"VLOOKUP($B39,VysledkyDoplneni!$C$7:$T$126,16,0)","v":0},{"$f":"VLOOKUP($B39,VysledkyDoplneni!$C$7:$T$126,17,0)","v":0},{"$f":"VLOOKUP($B39,VysledkyDoplneni!$C$7:$T$126,18,0)","v":0},null,null,{"$f":"SUM(D39:S39)","v":38},{"$f":"(V39/(Data!$B$18*X39))","v":{"v":0.6333333333333333,"d":"63.3%"}},3]
[33,{"$f":"IF(Vstup!C11<>\"\",Vstup!C11,\"\")","v":"Veltruský Jiří"},"S",{"$f":"VLOOKUP($B40,VysledkyDoplneni!$C$7:$T$126,3,0)","v":16},{"$f":"VLOOKUP($B40,VysledkyDoplneni!$C$7:$T$126,4,0)","v":9},{"$f":"VLOOKUP($B40,VysledkyDoplneni!$C$7:$T$126,5,0)","v":12},{"$f":"VLOOKUP($B40,VysledkyDoplneni!$C$7:$T$126,6,0)","v":0},{"$f":"VLOOKUP($B40,VysledkyDoplneni!$C$7:$T$126,7,0)","v":0},{"$f":"VLOOKUP($B40,VysledkyDoplneni!$C$7:$T$126,8,0)","v":0},{"$f":"VLOOKUP($B40,VysledkyDoplneni!$C$7:$T$126,9,0)","v":0},{"$f":"VLOOKUP($B40,VysledkyDoplneni!$C$7:$T$126,10,0)","v":0},{"$f":"VLOOKUP($B40,VysledkyDoplneni!$C$7:$T$126,11,0)","v":0},{"$f":"VLOOKUP($B40,VysledkyDoplneni!$C$7:$T$126,12,0)","v":0},{"$f":"VLOOKUP($B40,VysledkyDoplneni!$C$7:$T$126,13,0)","v":0},{"$f":"VLOOKUP($B40,VysledkyDoplneni!$C$7:$T$126,14,0)","v":0},{"$f":"VLOOKUP($B40,VysledkyDoplneni!$C$7:$T$126,15,0)","v":0},{"$f":"VLOOKUP($B40,VysledkyDoplneni!$C$7:$T$126,16,0)","v":0},{"$f":"VLOOKUP($B40,VysledkyDoplneni!$C$7:$T$126,17,0)","v":0},{"$f":"VLOOKUP($B40,VysledkyDoplneni!$C$7:$T$126,18,0)","v":0},null,null,{"$f":"SUM(D40:S40)","v":37},{"$f":"(V40/(Data!$B$18*X40))","v":{"v":0.6166666666666667,"d":"61.7%"}},3]
[34,{"$f":"IF(Vstup!C42<>\"\",Vstup!C42,\"\")","v":"Mach Josef"},"S",{"$f":"VLOOKUP($B41,VysledkyDoplneni!$C$7:$T$126,3,0)","v":9},{"$f":"VLOOKUP($B41,VysledkyDoplneni!$C$7:$T$126,4,0)","v":15},{"$f":"VLOOKUP($B41,VysledkyDoplneni!$C$7:$T$126,5,0)","v":13},{"$f":"VLOOKUP($B41,VysledkyDoplneni!$C$7:$T$126,6,0)","v":0},{"$f":"VLOOKUP($B41,VysledkyDoplneni!$C$7:$T$126,7,0)","v":0},{"$f":"VLOOKUP($B41,VysledkyDoplneni!$C$7:$T$126,8,0)","v":0},{"$f":"VLOOKUP($B41,VysledkyDoplneni!$C$7:$T$126,9,0)","v":0},{"$f":"VLOOKUP($B41,VysledkyDoplneni!$C$7:$T$126,10,0)","v":0},{"$f":"VLOOKUP($B41,VysledkyDoplneni!$C$7:$T$126,11,0)","v":0},{"$f":"VLOOKUP($B41,VysledkyDoplneni!$C$7:$T$126,12,0)","v":0},{"$f":"VLOOKUP($B41,VysledkyDoplneni!$C$7:$T$126,13,0)","v":0},{"$f":"VLOOKUP($B41,VysledkyDoplneni!$C$7:$T$126,14,0)","v":0},{"$f":"VLOOKUP($B41,VysledkyDoplneni!$C$7:$T$126,15,0)","v":0},{"$f":"VLOOKUP($B41,VysledkyDoplneni!$C$7:$T$126,16,0)","v":0},{"$f":"VLOOKUP($B41,VysledkyDoplneni!$C$7:$T$126,17,0)","v":0},{"$f":"VLOOKUP($B41,VysledkyDoplneni!$C$7:$T$126,18,0)","v":0},null,null,{"$f":"SUM(D41:T41)","v":37},{"$f":"(V41/(Data!$B$18*X41))","v":{"v":0.6166666666666667,"d":"61.7%"}},{"$f":"COUNTIF(D41:S41,\">0\")","v":3}]
[35,{"$f":"IF(Vstup!C14<>\"\",Vstup!C14,\"\")","v":"Mařík Josef"},"S",{"$f":"VLOOKUP($B42,VysledkyDoplneni!$C$7:$T$126,3,0)","v":13},{"$f":"VLOOKUP($B42,VysledkyDoplneni!$C$7:$T$126,4,0)","v":16},{"$f":"VLOOKUP($B42,VysledkyDoplneni!$C$7:$T$126,5,0)","v":7},{"$f":"VLOOKUP($B42,VysledkyDoplneni!$C$7:$T$126,6,0)","v":0},{"$f":"VLOOKUP($B42,VysledkyDoplneni!$C$7:$T$126,7,0)","v":0},{"$f":"VLOOKUP($B42,VysledkyDoplneni!$C$7:$T$126,8,0)","v":0},{"$f":"VLOOKUP($B42,VysledkyDoplneni!$C$7:$T$126,9,0)","v":0},{"$f":"VLOOKUP($B42,VysledkyDoplneni!$C$7:$T$126,10,0)","v":0},{"$f":"VLOOKUP($B42,VysledkyDoplneni!$C$7:$T$126,11,0)","v":0},{"$f":"VLOOKUP($B42,VysledkyDoplneni!$C$7:$T$126,12,0)","v":0},{"$f":"VLOOKUP($B42,VysledkyDoplneni!$C$7:$T$126,13,0)","v":0},{"$f":"VLOOKUP($B42,VysledkyDoplneni!$C$7:$T$126,14,0)","v":0},{"$f":"VLOOKUP($B42,VysledkyDoplneni!$C$7:$T$126,15,0)","v":0},{"$f":"VLOOKUP($B42,VysledkyDoplneni!$C$7:$T$126,16,0)","v":0},{"$f":"VLOOKUP($B42,VysledkyDoplneni!$C$7:$T$126,17,0)","v":0},{"$f":"VLOOKUP($B42,VysledkyDoplneni!$C$7:$T$126,18,0)","v":0},null,null,{"$f":"SUM(D42:S42)","v":36},{"$f":"(V42/(Data!$B$18*X42))","v":{"v":0.6,"d":"60.0%"}},3]
[36,{"$f":"IF(Vstup!C25<>\"\",Vstup!C25,\"\")","v":"Křepelka Jan"},"S",{"$f":"VLOOKUP($B43,VysledkyDoplneni!$C$7:$T$126,3,0)","v":10},{"$f":"VLOOKUP($B43,VysledkyDoplneni!$C$7:$T$126,4,0)","v":11},{"$f":"VLOOKUP($B43,VysledkyDoplneni!$C$7:$T$126,5,0)","v":15},{"$f":"VLOOKUP($B43,VysledkyDoplneni!$C$7:$T$126,6,0)","v":0},{"$f":"VLOOKUP($B43,VysledkyDoplneni!$C$7:$T$126,7,0)","v":0},{"$f":"VLOOKUP($B43,VysledkyDoplneni!$C$7:$T$126,8,0)","v":0},{"$f":"VLOOKUP($B43,VysledkyDoplneni!$C$7:$T$126,9,0)","v":0},{"$f":"VLOOKUP($B43,VysledkyDoplneni!$C$7:$T$126,10,0)","v":0},{"$f":"VLOOKUP($B43,VysledkyDoplneni!$C$7:$T$126,11,0)","v":0},{"$f":"VLOOKUP($B43,VysledkyDoplneni!$C$7:$T$126,12,0)","v":0},{"$f":"VLOOKUP($B43,VysledkyDoplneni!$C$7:$T$126,13,0)","v":0},{"$f":"VLOOKUP($B43,VysledkyDoplneni!$C$7:$T$126,14,0)","v":0},{"$f":"VLOOKUP($B43,VysledkyDoplneni!$C$7:$T$126,15,0)","v":0},{"$f":"VLOOKUP($B43,VysledkyDoplneni!$C$7:$T$126,16,0)","v":0},{"$f":"VLOOKUP($B43,VysledkyDoplneni!$C$7:$T$126,17,0)","v":0},{"$f":"VLOOKUP($B43,VysledkyDoplneni!$C$7:$T$126,18,0)","v":0},null,null,{"$f":"SUM(D43:S43)","v":36},{"$f":"(V43/(Data!$B$18*X43))","v":{"v":0.6,"d":"60.0%"}},3]
[37,{"$f":"IF(Vstup!C30<>\"\",Vstup!C30,\"\")","v":"Hájek Petr"},"S",{"$f":"VLOOKUP($B44,VysledkyDoplneni!$C$7:$T$126,3,0)","v":11},{"$f":"VLOOKUP($B44,VysledkyDoplneni!$C$7:$T$126,4,0)","v":12},{"$f":"VLOOKUP($B44,VysledkyDoplneni!$C$7:$T$126,5,0)","v":12},{"$f":"VLOOKUP($B44,VysledkyDoplneni!$C$7:$T$126,6,0)","v":0},{"$f":"VLOOKUP($B44,VysledkyDoplneni!$C$7:$T$126,7,0)","v":0},{"$f":"VLOOKUP($B44,VysledkyDoplneni!$C$7:$T$126,8,0)","v":0},{"$f":"VLOOKUP($B44,VysledkyDoplneni!$C$7:$T$126,9,0)","v":0},{"$f":"VLOOKUP($B44,VysledkyDoplneni!$C$7:$T$126,10,0)","v":0},{"$f":"VLOOKUP($B44,VysledkyDoplneni!$C$7:$T$126,11,0)","v":0},{"$f":"VLOOKUP($B44,VysledkyDoplneni!$C$7:$T$126,12,0)","v":0},{"$f":"VLOOKUP($B44,VysledkyDoplneni!$C$7:$T$126,13,0)","v":0},{"$f":"VLOOKUP($B44,VysledkyDoplneni!$C$7:$T$126,14,0)","v":0},{"$f":"VLOOKUP($B44,VysledkyDoplneni!$C$7:$T$126,15,0)","v":0},{"$f":"VLOOKUP($B44,VysledkyDoplneni!$C$7:$T$126,16,0)","v":0},{"$f":"VLOOKUP($B44,VysledkyDoplneni!$C$7:$T$126,17,0)","v":0},{"$f":"VLOOKUP($B44,VysledkyDoplneni!$C$7:$T$126,18,0)","v":0},null,null,{"$f":"SUM(D44:S44)","v":35},{"$f":"(V44/(Data!$B$18*X44))","v":{"v":0.5833333333333334,"d":"58.3%"}},3]
[38,{"$f":"IF(Vstup!C20<>\"\",Vstup!C20,\"\")","v":"Urban Josef"},"S",{"$f":"VLOOKUP($B45,VysledkyDoplneni!$C$7:$T$126,3,0)","v":9},{"$f":"VLOOKUP($B45,VysledkyDoplneni!$C$7:$T$126,4,0)","v":13},{"$f":"VLOOKUP($B45,VysledkyDoplneni!$C$7:$T$126,5,0)","v":13},{"$f":"VLOOKUP($B45,VysledkyDoplneni!$C$7:$T$126,6,0)","v":0},{"$f":"VLOOKUP($B45,VysledkyDoplneni!$C$7:$T$126,7,0)","v":0},{"$f":"VLOOKUP($B45,VysledkyDoplneni!$C$7:$T$126,8,0)","v":0},{"$f":"VLOOKUP($B45,VysledkyDoplneni!$C$7:$T$126,9,0)","v":0},{"$f":"VLOOKUP($B45,VysledkyDoplneni!$C$7:$T$126,10,0)","v":0},{"$f":"VLOOKUP($B45,VysledkyDoplneni!$C$7:$T$126,11,0)","v":0},{"$f":"VLOOKUP($B45,VysledkyDoplneni!$C$7:$T$126,12,0)","v":0},{"$f":"VLOOKUP($B45,VysledkyDoplneni!$C$7:$T$126,13,0)","v":0},{"$f":"VLOOKUP($B45,VysledkyDoplneni!$C$7:$T$126,14,0)","v":0},{"$f":"VLOOKUP($B45,VysledkyDoplneni!$C$7:$T$126,15,0)","v":0},{"$f":"VLOOKUP($B45,VysledkyDoplneni!$C$7:$T$126,16,0)","v":0},{"$f":"VLOOKUP($B45,VysledkyDoplneni!$C$7:$T$126,17,0)","v":0},{"$f":"VLOOKUP($B45,VysledkyDoplneni!$C$7:$T$126,18,0)","v":0},null,null,{"$f":"SUM(D45:S45)","v":35},{"$f":"(V45/(Data!$B$18*X45))","v":{"v":0.5833333333333334,"d":"58.3%"}},3]
[39,{"$f":"IF(Vstup!C55<>\"\",Vstup!C55,\"\")","v":"Förster Karel"},"S",{"$f":"VLOOKUP($B46,VysledkyDoplneni!$C$7:$T$126,3,0)","v":13},{"$f":"VLOOKUP($B46,VysledkyDoplneni!$C$7:$T$126,4,0)","v":12},{"$f":"VLOOKUP($B46,VysledkyDoplneni!$C$7:$T$126,5,0)","v":9},{"$f":"VLOOKUP($B46,VysledkyDoplneni!$C$7:$T$126,6,0)","v":0},{"$f":"VLOOKUP($B46,VysledkyDoplneni!$C$7:$T$126,7,0)","v":0},{"$f":"VLOOKUP($B46,VysledkyDoplneni!$C$7:$T$126,8,0)","v":0},{"$f":"VLOOKUP($B46,VysledkyDoplneni!$C$7:$T$126,9,0)","v":0},{"$f":"VLOOKUP($B46,VysledkyDoplneni!$C$7:$T$126,10,0)","v":0},{"$f":"VLOOKUP($B46,VysledkyDoplneni!$C$7:$T$126,11,0)","v":0},{"$f":"VLOOKUP($B46,VysledkyDoplneni!$C$7:$T$126,12,0)","v":0},{"$f":"VLOOKUP($B46,VysledkyDoplneni!$C$7:$T$126,13,0)","v":0},{"$f":"VLOOKUP($B46,VysledkyDoplneni!$C$7:$T$126,14,0)","v":0},{"$f":"VLOOKUP($B46,VysledkyDoplneni!$C$7:$T$126,15,0)","v":0},{"$f":"VLOOKUP($B46,VysledkyDoplneni!$C$7:$T$126,16,0)","v":0},{"$f":"VLOOKUP($B46,VysledkyDoplneni!$C$7:$T$126,17,0)","v":0},{"$f":"VLOOKUP($B46,VysledkyDoplneni!$C$7:$T$126,18,0)","v":0},null,null,{"$f":"SUM(D46:S46)","v":34},{"$f":"(V46/(Data!$B$18*X46))","v":{"v":0.5666666666666667,"d":"56.7%"}},3]
[40,{"$f":"IF(Vstup!C17<>\"\",Vstup!C17,\"\")","v":"Kondr Václav"},{"$f":"IF(Vstup!C17<>\"\",Vstup!D17,\"\")","v":"S"},{"$f":"VLOOKUP($B47,VysledkyDoplneni!$C$7:$T$126,3,0)","v":8},{"$f":"VLOOKUP($B47,VysledkyDoplneni!$C$7:$T$126,4,0)","v":13},{"$f":"VLOOKUP($B47,VysledkyDoplneni!$C$7:$T$126,5,0)","v":13},{"$f":"VLOOKUP($B47,VysledkyDoplneni!$C$7:$T$126,6,0)","v":0},{"$f":"VLOOKUP($B47,VysledkyDoplneni!$C$7:$T$126,7,0)","v":0},{"$f":"VLOOKUP($B47,VysledkyDoplneni!$C$7:$T$126,8,0)","v":0},{"$f":"VLOOKUP($B47,VysledkyDoplneni!$C$7:$T$126,9,0)","v":0},{"$f":"VLOOKUP($B47,VysledkyDoplneni!$C$7:$T$126,10,0)","v":0},{"$f":"VLOOKUP($B47,VysledkyDoplneni!$C$7:$T$126,11,0)","v":0},{"$f":"VLOOKUP($B47,VysledkyDoplneni!$C$7:$T$126,12,0)","v":0},{"$f":"VLOOKUP($B47,VysledkyDoplneni!$C$7:$T$126,13,0)","v":0},{"$f":"VLOOKUP($B47,VysledkyDoplneni!$C$7:$T$126,14,0)","v":0},{"$f":"VLOOKUP($B47,VysledkyDoplneni!$C$7:$T$126,15,0)","v":0},{"$f":"VLOOKUP($B47,VysledkyDoplneni!$C$7:$T$126,16,0)","v":0},{"$f":"VLOOKUP($B47,VysledkyDoplneni!$C$7:$T$126,17,0)","v":0},{"$f":"VLOOKUP($B47,VysledkyDoplneni!$C$7:$T$126,18,0)","v":0},null,null,{"$f":"SUM(D47:S47)","v":34},{"$f":"(V47/(Data!$B$18*X47))","v":{"v":0.5666666666666667,"d":"56.7%"}},3]
[41,{"$f":"IF(Vstup!C39<>\"\",Vstup!C39,\"\")","v":"Albl Václav"},"S",{"$f":"VLOOKUP($B48,VysledkyDoplneni!$C$7:$T$126,3,0)","v":8},{"$f":"VLOOKUP($B48,VysledkyDoplneni!$C$7:$T$126,4,0)","v":18},{"$f":"VLOOKUP($B48,VysledkyDoplneni!$C$7:$T$126,5,0)","v":7},{"$f":"VLOOKUP($B48,VysledkyDoplneni!$C$7:$T$126,6,0)","v":0},{"$f":"VLOOKUP($B48,VysledkyDoplneni!$C$7:$T$126,7,0)","v":0},{"$f":"VLOOKUP($B48,VysledkyDoplneni!$C$7:$T$126,8,0)","v":0},{"$f":"VLOOKUP($B48,VysledkyDoplneni!$C$7:$T$126,9,0)","v":0},{"$f":"VLOOKUP($B48,VysledkyDoplneni!$C$7:$T$126,10,0)","v":0},{"$f":"VLOOKUP($B48,VysledkyDoplneni!$C$7:$T$126,11,0)","v":0},{"$f":"VLOOKUP($B48,VysledkyDoplneni!$C$7:$T$126,12,0)","v":0},{"$f":"VLOOKUP($B48,VysledkyDoplneni!$C$7:$T$126,13,0)","v":0},{"$f":"VLOOKUP($B48,VysledkyDoplneni!$C$7:$T$126,14,0)","v":0},{"$f":"VLOOKUP($B48,VysledkyDoplneni!$C$7:$T$126,15,0)","v":0},{"$f":"VLOOKUP($B48,VysledkyDoplneni!$C$7:$T$126,16,0)","v":0},{"$f":"VLOOKUP($B48,VysledkyDoplneni!$C$7:$T$126,17,0)","v":0},{"$f":"VLOOKUP($B48,VysledkyDoplneni!$C$7:$T$126,18,0)","v":0},null,null,{"$f":"SUM(D48:S48)","v":33},{"$f":"(V48/(Data!$B$18*X48))","v":{"v":0.55,"d":"55.0%"}},{"$f":"COUNTIF(D48:S48,\">0\")","v":3}]
[42,{"$f":"IF(Vstup!C24<>\"\",Vstup!C24,\"\")","v":"Doležal Jaroslav"},"S",{"$f":"VLOOKUP($B49,VysledkyDoplneni!$C$7:$T$126,3,0)","v":7},{"$f":"VLOOKUP($B49,VysledkyDoplneni!$C$7:$T$126,4,0)","v":12},{"$f":"VLOOKUP($B49,VysledkyDoplneni!$C$7:$T$126,5,0)","v":14},{"$f":"VLOOKUP($B49,VysledkyDoplneni!$C$7:$T$126,6,0)","v":0},{"$f":"VLOOKUP($B49,VysledkyDoplneni!$C$7:$T$126,7,0)","v":0},{"$f":"VLOOKUP($B49,VysledkyDoplneni!$C$7:$T$126,8,0)","v":0},{"$f":"VLOOKUP($B49,VysledkyDoplneni!$C$7:$T$126,9,0)","v":0},{"$f":"VLOOKUP($B49,VysledkyDoplneni!$C$7:$T$126,10,0)","v":0},{"$f":"VLOOKUP($B49,VysledkyDoplneni!$C$7:$T$126,11,0)","v":0},{"$f":"VLOOKUP($B49,VysledkyDoplneni!$C$7:$T$126,12,0)","v":0},{"$f":"VLOOKUP($B49,VysledkyDoplneni!$C$7:$T$126,13,0)","v":0},{"$f":"VLOOKUP($B49,VysledkyDoplneni!$C$7:$T$126,14,0)","v":0},{"$f":"VLOOKUP($B49,VysledkyDoplneni!$C$7:$T$126,15,0)","v":0},{"$f":"VLOOKUP($B49,VysledkyDoplneni!$C$7:$T$126,16,0)","v":0},{"$f":"VLOOKUP($B49,VysledkyDoplneni!$C$7:$T$126,17,0)","v":0},{"$f":"VLOOKUP($B49,VysledkyDoplneni!$C$7:$T$126,18,0)","v":0},null,null,{"$f":"SUM(D49:S49)","v":33},{"$f":"(V49/(Data!$B$18*X49))","v":{"v":0.55,"d":"55.0%"}},3]
[43,{"$f":"IF(Vstup!C47<>\"\",Vstup!C47,\"\")","v":"Říha Jiří"},"S",{"$f":"VLOOKUP($B50,VysledkyDoplneni!$C$7:$T$126,3,0)","v":6},{"$f":"VLOOKUP($B50,VysledkyDoplneni!$C$7:$T$126,4,0)","v":14},{"$f":"VLOOKUP($B50,VysledkyDoplneni!$C$7:$T$126,5,0)","v":13},{"$f":"VLOOKUP($B50,VysledkyDoplneni!$C$7:$T$126,6,0)","v":0},{"$f":"VLOOKUP($B50,VysledkyDoplneni!$C$7:$T$126,7,0)","v":0},{"$f":"VLOOKUP($B50,VysledkyDoplneni!$C$7:$T$126,8,0)","v":0},{"$f":"VLOOKUP($B50,VysledkyDoplneni!$C$7:$T$126,9,0)","v":0},{"$f":"VLOOKUP($B50,VysledkyDoplneni!$C$7:$T$126,10,0)","v":0},{"$f":"VLOOKUP($B50,VysledkyDoplneni!$C$7:$T$126,11,0)","v":0},{"$f":"VLOOKUP($B50,VysledkyDoplneni!$C$7:$T$126,12,0)","v":0},{"$f":"VLOOKUP($B50,VysledkyDoplneni!$C$7:$T$126,13,0)","v":0},{"$f":"VLOOKUP($B50,VysledkyDoplneni!$C$7:$T$126,14,0)","v":0},{"$f":"VLOOKUP($B50,VysledkyDoplneni!$C$7:$T$126,15,0)","v":0},{"$f":"VLOOKUP($B50,VysledkyDoplneni!$C$7:$T$126,16,0)","v":0},{"$f":"VLOOKUP($B50,VysledkyDoplneni!$C$7:$T$126,17,0)","v":0},{"$f":"VLOOKUP($B50,VysledkyDoplneni!$C$7:$T$126,18,0)","v":0},null,null,{"$f":"SUM(D50:S50)","v":33},{"$f":"(V50/(Data!$B$18*X50))","v":{"v":0.55,"d":"55.0%"}},3]
[44,{"$f":"IF(Vstup!C53<>\"\",Vstup!C53,\"\")","v":"Vodička Miroslav"},"S",{"$f":"VLOOKUP($B51,VysledkyDoplneni!$C$7:$T$126,3,0)","v":9},{"$f":"VLOOKUP($B51,VysledkyDoplneni!$C$7:$T$126,4,0)","v":7},{"$f":"VLOOKUP($B51,VysledkyDoplneni!$C$7:$T$126,5,0)","v":11},{"$f":"VLOOKUP($B51,VysledkyDoplneni!$C$7:$T$126,6,0)","v":0},{"$f":"VLOOKUP($B51,VysledkyDoplneni!$C$7:$T$126,7,0)","v":0},{"$f":"VLOOKUP($B51,VysledkyDoplneni!$C$7:$T$126,8,0)","v":0},{"$f":"VLOOKUP($B51,VysledkyDoplneni!$C$7:$T$126,9,0)","v":0},{"$f":"VLOOKUP($B51,VysledkyDoplneni!$C$7:$T$126,10,0)","v":0},{"$f":"VLOOKUP($B51,VysledkyDoplneni!$C$7:$T$126,11,0)","v":0},{"$f":"VLOOKUP($B51,VysledkyDoplneni!$C$7:$T$126,12,0)","v":0},{"$f":"VLOOKUP($B51,VysledkyDoplneni!$C$7:$T$126,13,0)","v":0},{"$f":"VLOOKUP($B51,VysledkyDoplneni!$C$7:$T$126,14,0)","v":0},{"$f":"VLOOKUP($B51,VysledkyDoplneni!$C$7:$T$126,15,0)","v":0},{"$f":"VLOOKUP($B51,VysledkyDoplneni!$C$7:$T$126,16,0)","v":0},{"$f":"VLOOKUP($B51,VysledkyDoplneni!$C$7:$T$126,17,0)","v":0},{"$f":"VLOOKUP($B51,VysledkyDoplneni!$C$7:$T$126,18,0)","v":0},null,null,{"$f":"SUM(D51:S51)","v":27},{"$f":"(V51/(Data!$B$18*X51))","v":{"v":0.45,"d":"45.0%"}},3]
[45,{"$f":"IF(Vstup!C16<>\"\",Vstup!C16,\"\")","v":"Lízal Miroslav ml."},"S",{"$f":"VLOOKUP($B52,VysledkyDoplneni!$C$7:$T$126,3,0)","v":8},{"$f":"VLOOKUP($B52,VysledkyDoplneni!$C$7:$T$126,4,0)","v":16},{"$f":"VLOOKUP($B52,VysledkyDoplneni!$C$7:$T$126,5,0)","v":2},{"$f":"VLOOKUP($B52,VysledkyDoplneni!$C$7:$T$126,6,0)","v":0},{"$f":"VLOOKUP($B52,VysledkyDoplneni!$C$7:$T$126,7,0)","v":0},{"$f":"VLOOKUP($B52,VysledkyDoplneni!$C$7:$T$126,8,0)","v":0},{"$f":"VLOOKUP($B52,VysledkyDoplneni!$C$7:$T$126,9,0)","v":0},{"$f":"VLOOKUP($B52,VysledkyDoplneni!$C$7:$T$126,10,0)","v":0},{"$f":"VLOOKUP($B52,VysledkyDoplneni!$C$7:$T$126,11,0)","v":0},{"$f":"VLOOKUP($B52,VysledkyDoplneni!$C$7:$T$126,12,0)","v":0},{"$f":"VLOOKUP($B52,VysledkyDoplneni!$C$7:$T$126,13,0)","v":0},{"$f":"VLOOKUP($B52,VysledkyDoplneni!$C$7:$T$126,14,0)","v":0},{"$f":"VLOOKUP($B52,VysledkyDoplneni!$C$7:$T$126,15,0)","v":0},{"$f":"VLOOKUP($B52,VysledkyDoplneni!$C$7:$T$126,16,0)","v":0},{"$f":"VLOOKUP($B52,VysledkyDoplneni!$C$7:$T$126,17,0)","v":0},{"$f":"VLOOKUP($B52,VysledkyDoplneni!$C$7:$T$126,18,0)","v":0},null,null,{"$f":"SUM(D52:S52)","v":26},{"$f":"(V52/(Data!$B$18*X52))","v":{"v":0.43333333333333335,"d":"43.3%"}},3]
[46,{"$f":"IF(Vstup!C15<>\"\",Vstup!C15,\"\")","v":"Lízalová Veronika"},"S",{"$f":"VLOOKUP($B53,VysledkyDoplneni!$C$7:$T$126,3,0)","v":3},{"$f":"VLOOKUP($B53,VysledkyDoplneni!$C$7:$T$126,4,0)","v":5},{"$f":"VLOOKUP($B53,VysledkyDoplneni!$C$7:$T$126,5,0)","v":9},{"$f":"VLOOKUP($B53,VysledkyDoplneni!$C$7:$T$126,6,0)","v":0},{"$f":"VLOOKUP($B53,VysledkyDoplneni!$C$7:$T$126,7,0)","v":0},{"$f":"VLOOKUP($B53,VysledkyDoplneni!$C$7:$T$126,8,0)","v":0},{"$f":"VLOOKUP($B53,VysledkyDoplneni!$C$7:$T$126,9,0)","v":0},{"$f":"VLOOKUP($B53,VysledkyDoplneni!$C$7:$T$126,10,0)","v":0},{"$f":"VLOOKUP($B53,VysledkyDoplneni!$C$7:$T$126,11,0)","v":0},{"$f":"VLOOKUP($B53,VysledkyDoplneni!$C$7:$T$126,12,0)","v":0},{"$f":"VLOOKUP($B53,VysledkyDoplneni!$C$7:$T$126,13,0)","v":0},{"$f":"VLOOKUP($B53,VysledkyDoplneni!$C$7:$T$126,14,0)","v":0},{"$f":"VLOOKUP($B53,VysledkyDoplneni!$C$7:$T$126,15,0)","v":0},{"$f":"VLOOKUP($B53,VysledkyDoplneni!$C$7:$T$126,16,0)","v":0},{"$f":"VLOOKUP($B53,VysledkyDoplneni!$C$7:$T$126,17,0)","v":0},{"$f":"VLOOKUP($B53,VysledkyDoplneni!$C$7:$T$126,18,0)","v":0},null,null,{"$f":"SUM(D53:S53)","v":17},{"$f":"(V53/(Data!$B$18*X53))","v":{"v":0.2833333333333333,"d":"28.3%"}},3]
[47,{"$f":"IF(Vstup!C34<>\"\",Vstup!C34,\"\")","v":"Jira Tomáš"},"S",{"$f":"VLOOKUP($B54,VysledkyDoplneni!$C$7:$T$126,3,0)","v":3},{"$f":"VLOOKUP($B54,VysledkyDoplneni!$C$7:$T$126,4,0)","v":9},{"$f":"VLOOKUP($B54,VysledkyDoplneni!$C$7:$T$126,5,0)","v":4},{"$f":"VLOOKUP($B54,VysledkyDoplneni!$C$7:$T$126,6,0)","v":0},{"$f":"VLOOKUP($B54,VysledkyDoplneni!$C$7:$T$126,7,0)","v":0},{"$f":"VLOOKUP($B54,VysledkyDoplneni!$C$7:$T$126,8,0)","v":0},{"$f":"VLOOKUP($B54,VysledkyDoplneni!$C$7:$T$126,9,0)","v":0},{"$f":"VLOOKUP($B54,VysledkyDoplneni!$C$7:$T$126,10,0)","v":0},{"$f":"VLOOKUP($B54,VysledkyDoplneni!$C$7:$T$126,11,0)","v":0},{"$f":"VLOOKUP($B54,VysledkyDoplneni!$C$7:$T$126,12,0)","v":0},{"$f":"VLOOKUP($B54,VysledkyDoplneni!$C$7:$T$126,13,0)","v":0},{"$f":"VLOOKUP($B54,VysledkyDoplneni!$C$7:$T$126,14,0)","v":0},{"$f":"VLOOKUP($B54,VysledkyDoplneni!$C$7:$T$126,15,0)","v":0},{"$f":"VLOOKUP($B54,VysledkyDoplneni!$C$7:$T$126,16,0)","v":0},{"$f":"VLOOKUP($B54,VysledkyDoplneni!$C$7:$T$126,17,0)","v":0},{"$f":"VLOOKUP($B54,VysledkyDoplneni!$C$7:$T$126,18,0)","v":0},null,null,{"$f":"SUM(D54:S54)","v":16},{"$f":"(V54/(Data!$B$18*X54))","v":{"v":0.26666666666666666,"d":"26.7%"}},3]
[48,{"$f":"IF(Vstup!C35<>\"\",Vstup!C35,\"\")","v":"Gorschenek Martin"},"S",{"$f":"VLOOKUP($B55,VysledkyDoplneni!$C$7:$T$126,3,0)","v":6},{"$f":"VLOOKUP($B55,VysledkyDoplneni!$C$7:$T$126,4,0)","v":3},{"$f":"VLOOKUP($B55,VysledkyDoplneni!$C$7:$T$126,5,0)","v":1},{"$f":"VLOOKUP($B55,VysledkyDoplneni!$C$7:$T$126,6,0)","v":0},{"$f":"VLOOKUP($B55,VysledkyDoplneni!$C$7:$T$126,7,0)","v":0},{"$f":"VLOOKUP($B55,VysledkyDoplneni!$C$7:$T$126,8,0)","v":0},{"$f":"VLOOKUP($B55,VysledkyDoplneni!$C$7:$T$126,9,0)","v":0},{"$f":"VLOOKUP($B55,VysledkyDoplneni!$C$7:$T$126,10,0)","v":0},{"$f":"VLOOKUP($B55,VysledkyDoplneni!$C$7:$T$126,11,0)","v":0},{"$f":"VLOOKUP($B55,VysledkyDoplneni!$C$7:$T$126,12,0)","v":0},{"$f":"VLOOKUP($B55,VysledkyDoplneni!$C$7:$T$126,13,0)","v":0},{"$f":"VLOOKUP($B55,VysledkyDoplneni!$C$7:$T$126,14,0)","v":0},{"$f":"VLOOKUP($B55,VysledkyDoplneni!$C$7:$T$126,15,0)","v":0},{"$f":"VLOOKUP($B55,VysledkyDoplneni!$C$7:$T$126,16,0)","v":0},{"$f":"VLOOKUP($B55,VysledkyDoplneni!$C$7:$T$126,17,0)","v":0},{"$f":"VLOOKUP($B55,VysledkyDoplneni!$C$7:$T$126,18,0)","v":0},null,null,{"$f":"SUM(D55:S55)","v":10},{"$f":"(V55/(Data!$B$18*X55))","v":{"v":0.16666666666666666,"d":"16.7%"}},3]
[49,{"$f":"IF(Vstup!C58<>\"\",Vstup!C58,\"\")","v":""},"S",{"$f":"VLOOKUP($B56,VysledkyDoplneni!$C$7:$T$126,3,0)","v":0},{"$f":"VLOOKUP($B56,VysledkyDoplneni!$C$7:$T$126,4,0)","v":0},{"$f":"VLOOKUP($B56,VysledkyDoplneni!$C$7:$T$126,5,0)","v":0},{"$f":"VLOOKUP($B56,VysledkyDoplneni!$C$7:$T$126,6,0)","v":0},{"$f":"VLOOKUP($B56,VysledkyDoplneni!$C$7:$T$126,7,0)","v":0},{"$f":"VLOOKUP($B56,VysledkyDoplneni!$C$7:$T$126,8,0)","v":0},{"$f":"VLOOKUP($B56,VysledkyDoplneni!$C$7:$T$126,9,0)","v":0},{"$f":"VLOOKUP($B56,VysledkyDoplneni!$C$7:$T$126,10,0)","v":0},{"$f":"VLOOKUP($B56,VysledkyDoplneni!$C$7:$T$126,11,0)","v":0},{"$f":"VLOOKUP($B56,VysledkyDoplneni!$C$7:$T$126,12,0)","v":0},{"$f":"VLOOKUP($B56,VysledkyDoplneni!$C$7:$T$126,13,0)","v":0},{"$f":"VLOOKUP($B56,VysledkyDoplneni!$C$7:$T$126,14,0)","v":0},{"$f":"VLOOKUP($B56,VysledkyDoplneni!$C$7:$T$126,15,0)","v":0},{"$f":"VLOOKUP($B56,VysledkyDoplneni!$C$7:$T$126,16,0)","v":0},{"$f":"VLOOKUP($B56,VysledkyDoplneni!$C$7:$T$126,17,0)","v":0},{"$f":"VLOOKUP($B56,VysledkyDoplneni!$C$7:$T$126,18,0)","v":0},null,null,{"$f":"SUM(D56:S56)","v":0},{"$f":"(V56/(Data!$B$18*X56))","v":{"$error":"#DIV/0!"}},0]
[50,{"$f":"IF(Vstup!C57<>\"\",Vstup!C57,\"\")","v":""},"S",{"$f":"VLOOKUP($B57,VysledkyDoplneni!$C$7:$T$126,3,0)","v":0},{"$f":"VLOOKUP($B57,VysledkyDoplneni!$C$7:$T$126,4,0)","v":0},{"$f":"VLOOKUP($B57,VysledkyDoplneni!$C$7:$T$126,5,0)","v":0},{"$f":"VLOOKUP($B57,VysledkyDoplneni!$C$7:$T$126,6,0)","v":0},{"$f":"VLOOKUP($B57,VysledkyDoplneni!$C$7:$T$126,7,0)","v":0},{"$f":"VLOOKUP($B57,VysledkyDoplneni!$C$7:$T$126,8,0)","v":0},{"$f":"VLOOKUP($B57,VysledkyDoplneni!$C$7:$T$126,9,0)","v":0},{"$f":"VLOOKUP($B57,VysledkyDoplneni!$C$7:$T$126,10,0)","v":0},{"$f":"VLOOKUP($B57,VysledkyDoplneni!$C$7:$T$126,11,0)","v":0},{"$f":"VLOOKUP($B57,VysledkyDoplneni!$C$7:$T$126,12,0)","v":0},{"$f":"VLOOKUP($B57,VysledkyDoplneni!$C$7:$T$126,13,0)","v":0},{"$f":"VLOOKUP($B57,VysledkyDoplneni!$C$7:$T$126,14,0)","v":0},{"$f":"VLOOKUP($B57,VysledkyDoplneni!$C$7:$T$126,15,0)","v":0},{"$f":"VLOOKUP($B57,VysledkyDoplneni!$C$7:$T$126,16,0)","v":0},{"$f":"VLOOKUP($B57,VysledkyDoplneni!$C$7:$T$126,17,0)","v":0},{"$f":"VLOOKUP($B57,VysledkyDoplneni!$C$7:$T$126,18,0)","v":0},null,null,{"$f":"SUM(D57:T57)","v":0},{"$f":"(V57/(Data!$B$18*X57))","v":{"$error":"#DIV/0!"}},0]
[51,{"$f":"IF(Vstup!C59<>\"\",Vstup!C59,\"\")","v":""},"S",{"$f":"VLOOKUP($B58,VysledkyDoplneni!$C$7:$T$126,3,0)","v":0},{"$f":"VLOOKUP($B58,VysledkyDoplneni!$C$7:$T$126,4,0)","v":0},{"$f":"VLOOKUP($B58,VysledkyDoplneni!$C$7:$T$126,5,0)","v":0},{"$f":"VLOOKUP($B58,VysledkyDoplneni!$C$7:$T$126,6,0)","v":0},{"$f":"VLOOKUP($B58,VysledkyDoplneni!$C$7:$T$126,7,0)","v":0},{"$f":"VLOOKUP($B58,VysledkyDoplneni!$C$7:$T$126,8,0)","v":0},{"$f":"VLOOKUP($B58,VysledkyDoplneni!$C$7:$T$126,9,0)","v":0},{"$f":"VLOOKUP($B58,VysledkyDoplneni!$C$7:$T$126,10,0)","v":0},{"$f":"VLOOKUP($B58,VysledkyDoplneni!$C$7:$T$126,11,0)","v":0},{"$f":"VLOOKUP($B58,VysledkyDoplneni!$C$7:$T$126,12,0)","v":0},{"$f":"VLOOKUP($B58,VysledkyDoplneni!$C$7:$T$126,13,0)","v":0},{"$f":"VLOOKUP($B58,VysledkyDoplneni!$C$7:$T$126,14,0)","v":0},{"$f":"VLOOKUP($B58,VysledkyDoplneni!$C$7:$T$126,15,0)","v":0},{"$f":"VLOOKUP($B58,VysledkyDoplneni!$C$7:$T$126,16,0)","v":0},{"$f":"VLOOKUP($B58,VysledkyDoplneni!$C$7:$T$126,17,0)","v":0},{"$f":"VLOOKUP($B58,VysledkyDoplneni!$C$7:$T$126,18,0)","v":0},null,null,{"$f":"SUM(D58:S58)","v":0},{"$f":"(V58/(Data!$B$18*X58))","v":{"$error":"#DIV/0!"}},0]
[52,{"$f":"IF(Vstup!C60<>\"\",Vstup!C60,\"\")","v":""},"S",{"$f":"VLOOKUP($B59,VysledkyDoplneni!$C$7:$T$126,3,0)","v":0},{"$f":"VLOOKUP($B59,VysledkyDoplneni!$C$7:$T$126,4,0)","v":0},{"$f":"VLOOKUP($B59,VysledkyDoplneni!$C$7:$T$126,5,0)","v":0},{"$f":"VLOOKUP($B59,VysledkyDoplneni!$C$7:$T$126,6,0)","v":0},{"$f":"VLOOKUP($B59,VysledkyDoplneni!$C$7:$T$126,7,0)","v":0},{"$f":"VLOOKUP($B59,VysledkyDoplneni!$C$7:$T$126,8,0)","v":0},{"$f":"VLOOKUP($B59,VysledkyDoplneni!$C$7:$T$126,9,0)","v":0},{"$f":"VLOOKUP($B59,VysledkyDoplneni!$C$7:$T$126,10,0)","v":0},{"$f":"VLOOKUP($B59,VysledkyDoplneni!$C$7:$T$126,11,0)","v":0},{"$f":"VLOOKUP($B59,VysledkyDoplneni!$C$7:$T$126,12,0)","v":0},{"$f":"VLOOKUP($B59,VysledkyDoplneni!$C$7:$T$126,13,0)","v":0},{"$f":"VLOOKUP($B59,VysledkyDoplneni!$C$7:$T$126,14,0)","v":0},{"$f":"VLOOKUP($B59,VysledkyDoplneni!$C$7:$T$126,15,0)","v":0},{"$f":"VLOOKUP($B59,VysledkyDoplneni!$C$7:$T$126,16,0)","v":0},{"$f":"VLOOKUP($B59,VysledkyDoplneni!$C$7:$T$126,17,0)","v":0},{"$f":"VLOOKUP($B59,VysledkyDoplneni!$C$7:$T$126,18,0)","v":0},null,null,{"$f":"SUM(D59:T59)","v":0},{"$f":"(V59/(Data!$B$18*X59))","v":{"$error":"#DIV/0!"}},0]
[53,{"$f":"IF(Vstup!C63<>\"\",Vstup!C63,\"\")","v":""},"S",{"$f":"VLOOKUP($B60,VysledkyDoplneni!$C$7:$T$126,3,0)","v":0},{"$f":"VLOOKUP($B60,VysledkyDoplneni!$C$7:$T$126,4,0)","v":0},{"$f":"VLOOKUP($B60,VysledkyDoplneni!$C$7:$T$126,5,0)","v":0},{"$f":"VLOOKUP($B60,VysledkyDoplneni!$C$7:$T$126,6,0)","v":0},{"$f":"VLOOKUP($B60,VysledkyDoplneni!$C$7:$T$126,7,0)","v":0},{"$f":"VLOOKUP($B60,VysledkyDoplneni!$C$7:$T$126,8,0)","v":0},{"$f":"VLOOKUP($B60,VysledkyDoplneni!$C$7:$T$126,9,0)","v":0},{"$f":"VLOOKUP($B60,VysledkyDoplneni!$C$7:$T$126,10,0)","v":0},{"$f":"VLOOKUP($B60,VysledkyDoplneni!$C$7:$T$126,11,0)","v":0},{"$f":"VLOOKUP($B60,VysledkyDoplneni!$C$7:$T$126,12,0)","v":0},{"$f":"VLOOKUP($B60,VysledkyDoplneni!$C$7:$T$126,13,0)","v":0},{"$f":"VLOOKUP($B60,VysledkyDoplneni!$C$7:$T$126,14,0)","v":0},{"$f":"VLOOKUP($B60,VysledkyDoplneni!$C$7:$T$126,15,0)","v":0},{"$f":"VLOOKUP($B60,VysledkyDoplneni!$C$7:$T$126,16,0)","v":0},{"$f":"VLOOKUP($B60,VysledkyDoplneni!$C$7:$T$126,17,0)","v":0},{"$f":"VLOOKUP($B60,VysledkyDoplneni!$C$7:$T$126,18,0)","v":0},null,null,{"$f":"SUM(D60:T60)","v":0},{"$f":"(V60/(Data!$B$18*X60))","v":{"$error":"#DIV/0!"}},0]
[54,{"$f":"IF(Vstup!C61<>\"\",Vstup!C61,\"\")","v":""},"S",{"$f":"VLOOKUP($B61,VysledkyDoplneni!$C$7:$T$126,3,0)","v":0},{"$f":"VLOOKUP($B61,VysledkyDoplneni!$C$7:$T$126,4,0)","v":0},{"$f":"VLOOKUP($B61,VysledkyDoplneni!$C$7:$T$126,5,0)","v":0},{"$f":"VLOOKUP($B61,VysledkyDoplneni!$C$7:$T$126,6,0)","v":0},{"$f":"VLOOKUP($B61,VysledkyDoplneni!$C$7:$T$126,7,0)","v":0},{"$f":"VLOOKUP($B61,VysledkyDoplneni!$C$7:$T$126,8,0)","v":0},{"$f":"VLOOKUP($B61,VysledkyDoplneni!$C$7:$T$126,9,0)","v":0},{"$f":"VLOOKUP($B61,VysledkyDoplneni!$C$7:$T$126,10,0)","v":0},{"$f":"VLOOKUP($B61,VysledkyDoplneni!$C$7:$T$126,11,0)","v":0},{"$f":"VLOOKUP($B61,VysledkyDoplneni!$C$7:$T$126,12,0)","v":0},{"$f":"VLOOKUP($B61,VysledkyDoplneni!$C$7:$T$126,13,0)","v":0},{"$f":"VLOOKUP($B61,VysledkyDoplneni!$C$7:$T$126,14,0)","v":0},{"$f":"VLOOKUP($B61,VysledkyDoplneni!$C$7:$T$126,15,0)","v":0},{"$f":"VLOOKUP($B61,VysledkyDoplneni!$C$7:$T$126,16,0)","v":0},{"$f":"VLOOKUP($B61,VysledkyDoplneni!$C$7:$T$126,17,0)","v":0},{"$f":"VLOOKUP($B61,VysledkyDoplneni!$C$7:$T$126,18,0)","v":0},null,null,{"$f":"SUM(D61:S61)","v":0},{"$f":"(V61/(Data!$B$18*X61))","v":{"$error":"#DIV/0!"}},0]
[55,{"$f":"IF(Vstup!C64<>\"\",Vstup!C64,\"\")","v":""},"S",{"$f":"VLOOKUP($B62,VysledkyDoplneni!$C$7:$T$126,3,0)","v":0},{"$f":"VLOOKUP($B62,VysledkyDoplneni!$C$7:$T$126,4,0)","v":0},{"$f":"VLOOKUP($B62,VysledkyDoplneni!$C$7:$T$126,5,0)","v":0},{"$f":"VLOOKUP($B62,VysledkyDoplneni!$C$7:$T$126,6,0)","v":0},{"$f":"VLOOKUP($B62,VysledkyDoplneni!$C$7:$T$126,7,0)","v":0},{"$f":"VLOOKUP($B62,VysledkyDoplneni!$C$7:$T$126,8,0)","v":0},{"$f":"VLOOKUP($B62,VysledkyDoplneni!$C$7:$T$126,9,0)","v":0},{"$f":"VLOOKUP($B62,VysledkyDoplneni!$C$7:$T$126,10,0)","v":0},{"$f":"VLOOKUP($B62,VysledkyDoplneni!$C$7:$T$126,11,0)","v":0},{"$f":"VLOOKUP($B62,VysledkyDoplneni!$C$7:$T$126,12,0)","v":0},{"$f":"VLOOKUP($B62,VysledkyDoplneni!$C$7:$T$126,13,0)","v":0},{"$f":"VLOOKUP($B62,VysledkyDoplneni!$C$7:$T$126,14,0)","v":0},{"$f":"VLOOKUP($B62,VysledkyDoplneni!$C$7:$T$126,15,0)","v":0},{"$f":"VLOOKUP($B62,VysledkyDoplneni!$C$7:$T$126,16,0)","v":0},{"$f":"VLOOKUP($B62,VysledkyDoplneni!$C$7:$T$126,17,0)","v":0},{"$f":"VLOOKUP($B62,VysledkyDoplneni!$C$7:$T$126,18,0)","v":0},null,null,{"$f":"SUM(D62:S62)","v":0},{"$f":"(V62/(Data!$B$18*X62))","v":{"$error":"#DIV/0!"}},0]
[56,{"$f":"IF(Vstup!C62<>\"\",Vstup!C62,\"\")","v":""},"S",{"$f":"VLOOKUP($B63,VysledkyDoplneni!$C$7:$T$126,3,0)","v":0},{"$f":"VLOOKUP($B63,VysledkyDoplneni!$C$7:$T$126,4,0)","v":0},{"$f":"VLOOKUP($B63,VysledkyDoplneni!$C$7:$T$126,5,0)","v":0},{"$f":"VLOOKUP($B63,VysledkyDoplneni!$C$7:$T$126,6,0)","v":0},{"$f":"VLOOKUP($B63,VysledkyDoplneni!$C$7:$T$126,7,0)","v":0},{"$f":"VLOOKUP($B63,VysledkyDoplneni!$C$7:$T$126,8,0)","v":0},{"$f":"VLOOKUP($B63,VysledkyDoplneni!$C$7:$T$126,9,0)","v":0},{"$f":"VLOOKUP($B63,VysledkyDoplneni!$C$7:$T$126,10,0)","v":0},{"$f":"VLOOKUP($B63,VysledkyDoplneni!$C$7:$T$126,11,0)","v":0},{"$f":"VLOOKUP($B63,VysledkyDoplneni!$C$7:$T$126,12,0)","v":0},{"$f":"VLOOKUP($B63,VysledkyDoplneni!$C$7:$T$126,13,0)","v":0},{"$f":"VLOOKUP($B63,VysledkyDoplneni!$C$7:$T$126,14,0)","v":0},{"$f":"VLOOKUP($B63,VysledkyDoplneni!$C$7:$T$126,15,0)","v":0},{"$f":"VLOOKUP($B63,VysledkyDoplneni!$C$7:$T$126,16,0)","v":0},{"$f":"VLOOKUP($B63,VysledkyDoplneni!$C$7:$T$126,17,0)","v":0},{"$f":"VLOOKUP($B63,VysledkyDoplneni!$C$7:$T$126,18,0)","v":0},null,null,{"$f":"SUM(D63:S63)","v":0},{"$f":"(V63/(Data!$B$18*X63))","v":{"$error":"#DIV/0!"}},0]
[57,{"$f":"IF(Vstup!C117<>\"\",Vstup!C117,\"\")","v":""},"S",{"$f":"VLOOKUP($B64,VysledkyDoplneni!$C$7:$T$126,3,0)","v":0},{"$f":"VLOOKUP($B64,VysledkyDoplneni!$C$7:$T$126,4,0)","v":0},{"$f":"VLOOKUP($B64,VysledkyDoplneni!$C$7:$T$126,5,0)","v":0},{"$f":"VLOOKUP($B64,VysledkyDoplneni!$C$7:$T$126,6,0)","v":0},{"$f":"VLOOKUP($B64,VysledkyDoplneni!$C$7:$T$126,7,0)","v":0},{"$f":"VLOOKUP($B64,VysledkyDoplneni!$C$7:$T$126,8,0)","v":0},{"$f":"VLOOKUP($B64,VysledkyDoplneni!$C$7:$T$126,9,0)","v":0},{"$f":"VLOOKUP($B64,VysledkyDoplneni!$C$7:$T$126,10,0)","v":0},{"$f":"VLOOKUP($B64,VysledkyDoplneni!$C$7:$T$126,11,0)","v":0},{"$f":"VLOOKUP($B64,VysledkyDoplneni!$C$7:$T$126,12,0)","v":0},{"$f":"VLOOKUP($B64,VysledkyDoplneni!$C$7:$T$126,13,0)","v":0},{"$f":"VLOOKUP($B64,VysledkyDoplneni!$C$7:$T$126,14,0)","v":0},{"$f":"VLOOKUP($B64,VysledkyDoplneni!$C$7:$T$126,15,0)","v":0},{"$f":"VLOOKUP($B64,VysledkyDoplneni!$C$7:$T$126,16,0)","v":0},{"$f":"VLOOKUP($B64,VysledkyDoplneni!$C$7:$T$126,17,0)","v":0},{"$f":"VLOOKUP($B64,VysledkyDoplneni!$C$7:$T$126,18,0)","v":0},null,null,0,{"$f":"(V64/(Data!$B$18*X64))","v":{"$error":"#DIV/0!"}},0]
[58,{"$f":"IF(Vstup!C76<>\"\",Vstup!C76,\"\")","v":""},"S",{"$f":"VLOOKUP($B65,VysledkyDoplneni!$C$7:$T$126,3,0)","v":0},{"$f":"VLOOKUP($B65,VysledkyDoplneni!$C$7:$T$126,4,0)","v":0},{"$f":"VLOOKUP($B65,VysledkyDoplneni!$C$7:$T$126,5,0)","v":0},{"$f":"VLOOKUP($B65,VysledkyDoplneni!$C$7:$T$126,6,0)","v":0},{"$f":"VLOOKUP($B65,VysledkyDoplneni!$C$7:$T$126,7,0)","v":0},{"$f":"VLOOKUP($B65,VysledkyDoplneni!$C$7:$T$126,8,0)","v":0},{"$f":"VLOOKUP($B65,VysledkyDoplneni!$C$7:$T$126,9,0)","v":0},{"$f":"VLOOKUP($B65,VysledkyDoplneni!$C$7:$T$126,10,0)","v":0},{"$f":"VLOOKUP($B65,VysledkyDoplneni!$C$7:$T$126,11,0)","v":0},{"$f":"VLOOKUP($B65,VysledkyDoplneni!$C$7:$T$126,12,0)","v":0},{"$f":"VLOOKUP($B65,VysledkyDoplneni!$C$7:$T$126,13,0)","v":0},{"$f":"VLOOKUP($B65,VysledkyDoplneni!$C$7:$T$126,14,0)","v":0},{"$f":"VLOOKUP($B65,VysledkyDoplneni!$C$7:$T$126,15,0)","v":0},{"$f":"VLOOKUP($B65,VysledkyDoplneni!$C$7:$T$126,16,0)","v":0},{"$f":"VLOOKUP($B65,VysledkyDoplneni!$C$7:$T$126,17,0)","v":0},{"$f":"VLOOKUP($B65,VysledkyDoplneni!$C$7:$T$126,18,0)","v":0},null,null,0,{"$f":"(V65/(Data!$B$18*X65))","v":{"$error":"#DIV/0!"}},0]
[59,{"$f":"IF(Vstup!C96<>\"\",Vstup!C96,\"\")","v":""},"S",{"$f":"VLOOKUP($B66,VysledkyDoplneni!$C$7:$T$126,3,0)","v":0},{"$f":"VLOOKUP($B66,VysledkyDoplneni!$C$7:$T$126,4,0)","v":0},{"$f":"VLOOKUP($B66,VysledkyDoplneni!$C$7:$T$126,5,0)","v":0},{"$f":"VLOOKUP($B66,VysledkyDoplneni!$C$7:$T$126,6,0)","v":0},{"$f":"VLOOKUP($B66,VysledkyDoplneni!$C$7:$T$126,7,0)","v":0},{"$f":"VLOOKUP($B66,VysledkyDoplneni!$C$7:$T$126,8,0)","v":0},{"$f":"VLOOKUP($B66,VysledkyDoplneni!$C$7:$T$126,9,0)","v":0},{"$f":"VLOOKUP($B66,VysledkyDoplneni!$C$7:$T$126,10,0)","v":0},{"$f":"VLOOKUP($B66,VysledkyDoplneni!$C$7:$T$126,11,0)","v":0},{"$f":"VLOOKUP($B66,VysledkyDoplneni!$C$7:$T$126,12,0)","v":0},{"$f":"VLOOKUP($B66,VysledkyDoplneni!$C$7:$T$126,13,0)","v":0},{"$f":"VLOOKUP($B66,VysledkyDoplneni!$C$7:$T$126,14,0)","v":0},{"$f":"VLOOKUP($B66,VysledkyDoplneni!$C$7:$T$126,15,0)","v":0},{"$f":"VLOOKUP($B66,VysledkyDoplneni!$C$7:$T$126,16,0)","v":0},{"$f":"VLOOKUP($B66,VysledkyDoplneni!$C$7:$T$126,17,0)","v":0},{"$f":"VLOOKUP($B66,VysledkyDoplneni!$C$7:$T$126,18,0)","v":0},null,null,0,{"$f":"(V66/(Data!$B$18*X66))","v":{"$error":"#DIV/0!"}},0]
[60,{"$f":"IF(Vstup!C103<>\"\",Vstup!C103,\"\")","v":""},"S",{"$f":"VLOOKUP($B67,VysledkyDoplneni!$C$7:$T$126,3,0)","v":0},{"$f":"VLOOKUP($B67,VysledkyDoplneni!$C$7:$T$126,4,0)","v":0},{"$f":"VLOOKUP($B67,VysledkyDoplneni!$C$7:$T$126,5,0)","v":0},{"$f":"VLOOKUP($B67,VysledkyDoplneni!$C$7:$T$126,6,0)","v":0},{"$f":"VLOOKUP($B67,VysledkyDoplneni!$C$7:$T$126,7,0)","v":0},{"$f":"VLOOKUP($B67,VysledkyDoplneni!$C$7:$T$126,8,0)","v":0},{"$f":"VLOOKUP($B67,VysledkyDoplneni!$C$7:$T$126,9,0)","v":0},{"$f":"VLOOKUP($B67,VysledkyDoplneni!$C$7:$T$126,10,0)","v":0},{"$f":"VLOOKUP($B67,VysledkyDoplneni!$C$7:$T$126,11,0)","v":0},{"$f":"VLOOKUP($B67,VysledkyDoplneni!$C$7:$T$126,12,0)","v":0},{"$f":"VLOOKUP($B67,VysledkyDoplneni!$C$7:$T$126,13,0)","v":0},{"$f":"VLOOKUP($B67,VysledkyDoplneni!$C$7:$T$126,14,0)","v":0},{"$f":"VLOOKUP($B67,VysledkyDoplneni!$C$7:$T$126,15,0)","v":0},{"$f":"VLOOKUP($B67,VysledkyDoplneni!$C$7:$T$126,16,0)","v":0},{"$f":"VLOOKUP($B67,VysledkyDoplneni!$C$7:$T$126,17,0)","v":0},{"$f":"VLOOKUP($B67,VysledkyDoplneni!$C$7:$T$126,18,0)","v":0},null,null,0,{"$f":"(V67/(Data!$B$18*X67))","v":{"$error":"#DIV/0!"}},0]
[61,{"$f":"IF(Vstup!C82<>\"\",Vstup!C82,\"\")","v":""},"S",{"$f":"VLOOKUP($B68,VysledkyDoplneni!$C$7:$T$126,3,0)","v":0},{"$f":"VLOOKUP($B68,VysledkyDoplneni!$C$7:$T$126,4,0)","v":0},{"$f":"VLOOKUP($B68,VysledkyDoplneni!$C$7:$T$126,5,0)","v":0},{"$f":"VLOOKUP($B68,VysledkyDoplneni!$C$7:$T$126,6,0)","v":0},{"$f":"VLOOKUP($B68,VysledkyDoplneni!$C$7:$T$126,7,0)","v":0},{"$f":"VLOOKUP($B68,VysledkyDoplneni!$C$7:$T$126,8,0)","v":0},{"$f":"VLOOKUP($B68,VysledkyDoplneni!$C$7:$T$126,9,0)","v":0},{"$f":"VLOOKUP($B68,VysledkyDoplneni!$C$7:$T$126,10,0)","v":0},{"$f":"VLOOKUP($B68,VysledkyDoplneni!$C$7:$T$126,11,0)","v":0},{"$f":"VLOOKUP($B68,VysledkyDoplneni!$C$7:$T$126,12,0)","v":0},{"$f":"VLOOKUP($B68,VysledkyDoplneni!$C$7:$T$126,13,0)","v":0},{"$f":"VLOOKUP($B68,VysledkyDoplneni!$C$7:$T$126,14,0)","v":0},{"$f":"VLOOKUP($B68,VysledkyDoplneni!$C$7:$T$126,15,0)","v":0},{"$f":"VLOOKUP($B68,VysledkyDoplneni!$C$7:$T$126,16,0)","v":0},{"$f":"VLOOKUP($B68,VysledkyDoplneni!$C$7:$T$126,17,0)","v":0},{"$f":"VLOOKUP($B68,VysledkyDoplneni!$C$7:$T$126,18,0)","v":0},null,null,0,{"$f":"(V68/(Data!$B$18*X68))","v":{"$error":"#DIV/0!"}},0]
[62,{"$f":"IF(Vstup!C84<>\"\",Vstup!C84,\"\")","v":""},"S",{"$f":"VLOOKUP($B69,VysledkyDoplneni!$C$7:$T$126,3,0)","v":0},{"$f":"VLOOKUP($B69,VysledkyDoplneni!$C$7:$T$126,4,0)","v":0},{"$f":"VLOOKUP($B69,VysledkyDoplneni!$C$7:$T$126,5,0)","v":0},{"$f":"VLOOKUP($B69,VysledkyDoplneni!$C$7:$T$126,6,0)","v":0},{"$f":"VLOOKUP($B69,VysledkyDoplneni!$C$7:$T$126,7,0)","v":0},{"$f":"VLOOKUP($B69,VysledkyDoplneni!$C$7:$T$126,8,0)","v":0},{"$f":"VLOOKUP($B69,VysledkyDoplneni!$C$7:$T$126,9,0)","v":0},{"$f":"VLOOKUP($B69,VysledkyDoplneni!$C$7:$T$126,10,0)","v":0},{"$f":"VLOOKUP($B69,VysledkyDoplneni!$C$7:$T$126,11,0)","v":0},{"$f":"VLOOKUP($B69,VysledkyDoplneni!$C$7:$T$126,12,0)","v":0},{"$f":"VLOOKUP($B69,VysledkyDoplneni!$C$7:$T$126,13,0)","v":0},{"$f":"VLOOKUP($B69,VysledkyDoplneni!$C$7:$T$126,14,0)","v":0},{"$f":"VLOOKUP($B69,VysledkyDoplneni!$C$7:$T$126,15,0)","v":0},{"$f":"VLOOKUP($B69,VysledkyDoplneni!$C$7:$T$126,16,0)","v":0},{"$f":"VLOOKUP($B69,VysledkyDoplneni!$C$7:$T$126,17,0)","v":0},{"$f":"VLOOKUP($B69,VysledkyDoplneni!$C$7:$T$126,18,0)","v":0},null,null,0,{"$f":"(V69/(Data!$B$18*X69))","v":{"$error":"#DIV/0!"}},0]
[63,{"$f":"IF(Vstup!C99<>\"\",Vstup!C99,\"\")","v":""},"S",{"$f":"VLOOKUP($B70,VysledkyDoplneni!$C$7:$T$126,3,0)","v":0},{"$f":"VLOOKUP($B70,VysledkyDoplneni!$C$7:$T$126,4,0)","v":0},{"$f":"VLOOKUP($B70,VysledkyDoplneni!$C$7:$T$126,5,0)","v":0},{"$f":"VLOOKUP($B70,VysledkyDoplneni!$C$7:$T$126,6,0)","v":0},{"$f":"VLOOKUP($B70,VysledkyDoplneni!$C$7:$T$126,7,0)","v":0},{"$f":"VLOOKUP($B70,VysledkyDoplneni!$C$7:$T$126,8,0)","v":0},{"$f":"VLOOKUP($B70,VysledkyDoplneni!$C$7:$T$126,9,0)","v":0},{"$f":"VLOOKUP($B70,VysledkyDoplneni!$C$7:$T$126,10,0)","v":0},{"$f":"VLOOKUP($B70,VysledkyDoplneni!$C$7:$T$126,11,0)","v":0},{"$f":"VLOOKUP($B70,VysledkyDoplneni!$C$7:$T$126,12,0)","v":0},{"$f":"VLOOKUP($B70,VysledkyDoplneni!$C$7:$T$126,13,0)","v":0},{"$f":"VLOOKUP($B70,VysledkyDoplneni!$C$7:$T$126,14,0)","v":0},{"$f":"VLOOKUP($B70,VysledkyDoplneni!$C$7:$T$126,15,0)","v":0},{"$f":"VLOOKUP($B70,VysledkyDoplneni!$C$7:$T$126,16,0)","v":0},{"$f":"VLOOKUP($B70,VysledkyDoplneni!$C$7:$T$126,17,0)","v":0},{"$f":"VLOOKUP($B70,VysledkyDoplneni!$C$7:$T$126,18,0)","v":0},null,null,0,{"$f":"(V70/(Data!$B$18*X70))","v":{"$error":"#DIV/0!"}},0]
[64,{"$f":"IF(Vstup!C67<>\"\",Vstup!C67,\"\")","v":""},"S",{"$f":"VLOOKUP($B71,VysledkyDoplneni!$C$7:$T$126,3,0)","v":0},{"$f":"VLOOKUP($B71,VysledkyDoplneni!$C$7:$T$126,4,0)","v":0},{"$f":"VLOOKUP($B71,VysledkyDoplneni!$C$7:$T$126,5,0)","v":0},{"$f":"VLOOKUP($B71,VysledkyDoplneni!$C$7:$T$126,6,0)","v":0},{"$f":"VLOOKUP($B71,VysledkyDoplneni!$C$7:$T$126,7,0)","v":0},{"$f":"VLOOKUP($B71,VysledkyDoplneni!$C$7:$T$126,8,0)","v":0},{"$f":"VLOOKUP($B71,VysledkyDoplneni!$C$7:$T$126,9,0)","v":0},{"$f":"VLOOKUP($B71,VysledkyDoplneni!$C$7:$T$126,10,0)","v":0},{"$f":"VLOOKUP($B71,VysledkyDoplneni!$C$7:$T$126,11,0)","v":0},{"$f":"VLOOKUP($B71,VysledkyDoplneni!$C$7:$T$126,12,0)","v":0},{"$f":"VLOOKUP($B71,VysledkyDoplneni!$C$7:$T$126,13,0)","v":0},{"$f":"VLOOKUP($B71,VysledkyDoplneni!$C$7:$T$126,14,0)","v":0},{"$f":"VLOOKUP($B71,VysledkyDoplneni!$C$7:$T$126,15,0)","v":0},{"$f":"VLOOKUP($B71,VysledkyDoplneni!$C$7:$T$126,16,0)","v":0},{"$f":"VLOOKUP($B71,VysledkyDoplneni!$C$7:$T$126,17,0)","v":0},{"$f":"VLOOKUP($B71,VysledkyDoplneni!$C$7:$T$126,18,0)","v":0},null,null,0,{"$f":"(V71/(Data!$B$18*X71))","v":{"$error":"#DIV/0!"}},0]
[65,{"$f":"IF(Vstup!C71<>\"\",Vstup!C71,\"\")","v":""},"S",{"$f":"VLOOKUP($B72,VysledkyDoplneni!$C$7:$T$126,3,0)","v":0},{"$f":"VLOOKUP($B72,VysledkyDoplneni!$C$7:$T$126,4,0)","v":0},{"$f":"VLOOKUP($B72,VysledkyDoplneni!$C$7:$T$126,5,0)","v":0},{"$f":"VLOOKUP($B72,VysledkyDoplneni!$C$7:$T$126,6,0)","v":0},{"$f":"VLOOKUP($B72,VysledkyDoplneni!$C$7:$T$126,7,0)","v":0},{"$f":"VLOOKUP($B72,VysledkyDoplneni!$C$7:$T$126,8,0)","v":0},{"$f":"VLOOKUP($B72,VysledkyDoplneni!$C$7:$T$126,9,0)","v":0},{"$f":"VLOOKUP($B72,VysledkyDoplneni!$C$7:$T$126,10,0)","v":0},{"$f":"VLOOKUP($B72,VysledkyDoplneni!$C$7:$T$126,11,0)","v":0},{"$f":"VLOOKUP($B72,VysledkyDoplneni!$C$7:$T$126,12,0)","v":0},{"$f":"VLOOKUP($B72,VysledkyDoplneni!$C$7:$T$126,13,0)","v":0},{"$f":"VLOOKUP($B72,VysledkyDoplneni!$C$7:$T$126,14,0)","v":0},{"$f":"VLOOKUP($B72,VysledkyDoplneni!$C$7:$T$126,15,0)","v":0},{"$f":"VLOOKUP($B72,VysledkyDoplneni!$C$7:$T$126,16,0)","v":0},{"$f":"VLOOKUP($B72,VysledkyDoplneni!$C$7:$T$126,17,0)","v":0},{"$f":"VLOOKUP($B72,VysledkyDoplneni!$C$7:$T$126,18,0)","v":0},null,null,0,{"$f":"(V72/(Data!$B$18*X72))","v":{"$error":"#DIV/0!"}},0]
[66,{"$f":"IF(Vstup!C98<>\"\",Vstup!C98,\"\")","v":""},"S",{"$f":"VLOOKUP($B73,VysledkyDoplneni!$C$7:$T$126,3,0)","v":0},{"$f":"VLOOKUP($B73,VysledkyDoplneni!$C$7:$T$126,4,0)","v":0},{"$f":"VLOOKUP($B73,VysledkyDoplneni!$C$7:$T$126,5,0)","v":0},{"$f":"VLOOKUP($B73,VysledkyDoplneni!$C$7:$T$126,6,0)","v":0},{"$f":"VLOOKUP($B73,VysledkyDoplneni!$C$7:$T$126,7,0)","v":0},{"$f":"VLOOKUP($B73,VysledkyDoplneni!$C$7:$T$126,8,0)","v":0},{"$f":"VLOOKUP($B73,VysledkyDoplneni!$C$7:$T$126,9,0)","v":0},{"$f":"VLOOKUP($B73,VysledkyDoplneni!$C$7:$T$126,10,0)","v":0},{"$f":"VLOOKUP($B73,VysledkyDoplneni!$C$7:$T$126,11,0)","v":0},{"$f":"VLOOKUP($B73,VysledkyDoplneni!$C$7:$T$126,12,0)","v":0},{"$f":"VLOOKUP($B73,VysledkyDoplneni!$C$7:$T$126,13,0)","v":0},{"$f":"VLOOKUP($B73,VysledkyDoplneni!$C$7:$T$126,14,0)","v":0},{"$f":"VLOOKUP($B73,VysledkyDoplneni!$C$7:$T$126,15,0)","v":0},{"$f":"VLOOKUP($B73,VysledkyDoplneni!$C$7:$T$126,16,0)","v":0},{"$f":"VLOOKUP($B73,VysledkyDoplneni!$C$7:$T$126,17,0)","v":0},{"$f":"VLOOKUP($B73,VysledkyDoplneni!$C$7:$T$126,18,0)","v":0},null,null,0,{"$f":"(V73/(Data!$B$18*X73))","v":{"$error":"#DIV/0!"}},{"$f":"COUNTIF(D73:S73,\">0\")","v":0}]
[67,{"$f":"IF(Vstup!C81<>\"\",Vstup!C81,\"\")","v":""},"S",{"$f":"VLOOKUP($B74,VysledkyDoplneni!$C$7:$T$126,3,0)","v":0},{"$f":"VLOOKUP($B74,VysledkyDoplneni!$C$7:$T$126,4,0)","v":0},{"$f":"VLOOKUP($B74,VysledkyDoplneni!$C$7:$T$126,5,0)","v":0},{"$f":"VLOOKUP($B74,VysledkyDoplneni!$C$7:$T$126,6,0)","v":0},{"$f":"VLOOKUP($B74,VysledkyDoplneni!$C$7:$T$126,7,0)","v":0},{"$f":"VLOOKUP($B74,VysledkyDoplneni!$C$7:$T$126,8,0)","v":0},{"$f":"VLOOKUP($B74,VysledkyDoplneni!$C$7:$T$126,9,0)","v":0},{"$f":"VLOOKUP($B74,VysledkyDoplneni!$C$7:$T$126,10,0)","v":0},{"$f":"VLOOKUP($B74,VysledkyDoplneni!$C$7:$T$126,11,0)","v":0},{"$f":"VLOOKUP($B74,VysledkyDoplneni!$C$7:$T$126,12,0)","v":0},{"$f":"VLOOKUP($B74,VysledkyDoplneni!$C$7:$T$126,13,0)","v":0},{"$f":"VLOOKUP($B74,VysledkyDoplneni!$C$7:$T$126,14,0)","v":0},{"$f":"VLOOKUP($B74,VysledkyDoplneni!$C$7:$T$126,15,0)","v":0},{"$f":"VLOOKUP($B74,VysledkyDoplneni!$C$7:$T$126,16,0)","v":0},{"$f":"VLOOKUP($B74,VysledkyDoplneni!$C$7:$T$126,17,0)","v":0},{"$f":"VLOOKUP($B74,VysledkyDoplneni!$C$7:$T$126,18,0)","v":0},null,null,0,{"$f":"(V74/(Data!$B$18*X74))","v":{"$error":"#DIV/0!"}},0]
[68,{"$f":"IF(Vstup!C66<>\"\",Vstup!C66,\"\")","v":""},"S",{"$f":"VLOOKUP($B75,VysledkyDoplneni!$C$7:$T$126,3,0)","v":0},{"$f":"VLOOKUP($B75,VysledkyDoplneni!$C$7:$T$126,4,0)","v":0},{"$f":"VLOOKUP($B75,VysledkyDoplneni!$C$7:$T$126,5,0)","v":0},{"$f":"VLOOKUP($B75,VysledkyDoplneni!$C$7:$T$126,6,0)","v":0},{"$f":"VLOOKUP($B75,VysledkyDoplneni!$C$7:$T$126,7,0)","v":0},{"$f":"VLOOKUP($B75,VysledkyDoplneni!$C$7:$T$126,8,0)","v":0},{"$f":"VLOOKUP($B75,VysledkyDoplneni!$C$7:$T$126,9,0)","v":0},{"$f":"VLOOKUP($B75,VysledkyDoplneni!$C$7:$T$126,10,0)","v":0},{"$f":"VLOOKUP($B75,VysledkyDoplneni!$C$7:$T$126,11,0)","v":0},{"$f":"VLOOKUP($B75,VysledkyDoplneni!$C$7:$T$126,12,0)","v":0},{"$f":"VLOOKUP($B75,VysledkyDoplneni!$C$7:$T$126,13,0)","v":0},{"$f":"VLOOKUP($B75,VysledkyDoplneni!$C$7:$T$126,14,0)","v":0},{"$f":"VLOOKUP($B75,VysledkyDoplneni!$C$7:$T$126,15,0)","v":0},{"$f":"VLOOKUP($B75,VysledkyDoplneni!$C$7:$T$126,16,0)","v":0},{"$f":"VLOOKUP($B75,VysledkyDoplneni!$C$7:$T$126,17,0)","v":0},{"$f":"VLOOKUP($B75,VysledkyDoplneni!$C$7:$T$126,18,0)","v":0},null,null,0,{"$f":"(V75/(Data!$B$18*X75))","v":{"$error":"#DIV/0!"}},0]
[69,{"$f":"IF(Vstup!C75<>\"\",Vstup!C75,\"\")","v":""},"S",{"$f":"VLOOKUP($B76,VysledkyDoplneni!$C$7:$T$126,3,0)","v":0},{"$f":"VLOOKUP($B76,VysledkyDoplneni!$C$7:$T$126,4,0)","v":0},{"$f":"VLOOKUP($B76,VysledkyDoplneni!$C$7:$T$126,5,0)","v":0},{"$f":"VLOOKUP($B76,VysledkyDoplneni!$C$7:$T$126,6,0)","v":0},{"$f":"VLOOKUP($B76,VysledkyDoplneni!$C$7:$T$126,7,0)","v":0},{"$f":"VLOOKUP($B76,VysledkyDoplneni!$C$7:$T$126,8,0)","v":0},{"$f":"VLOOKUP($B76,VysledkyDoplneni!$C$7:$T$126,9,0)","v":0},{"$f":"VLOOKUP($B76,VysledkyDoplneni!$C$7:$T$126,10,0)","v":0},{"$f":"VLOOKUP($B76,VysledkyDoplneni!$C$7:$T$126,11,0)","v":0},{"$f":"VLOOKUP($B76,VysledkyDoplneni!$C$7:$T$126,12,0)","v":0},{"$f":"VLOOKUP($B76,VysledkyDoplneni!$C$7:$T$126,13,0)","v":0},{"$f":"VLOOKUP($B76,VysledkyDoplneni!$C$7:$T$126,14,0)","v":0},{"$f":"VLOOKUP($B76,VysledkyDoplneni!$C$7:$T$126,15,0)","v":0},{"$f":"VLOOKUP($B76,VysledkyDoplneni!$C$7:$T$126,16,0)","v":0},{"$f":"VLOOKUP($B76,VysledkyDoplneni!$C$7:$T$126,17,0)","v":0},{"$f":"VLOOKUP($B76,VysledkyDoplneni!$C$7:$T$126,18,0)","v":0},null,null,0,{"$f":"(V76/(Data!$B$18*X76))","v":{"$error":"#DIV/0!"}},0]
[70,{"$f":"IF(Vstup!C85<>\"\",Vstup!C85,\"\")","v":""},"S",{"$f":"VLOOKUP($B77,VysledkyDoplneni!$C$7:$T$126,3,0)","v":0},{"$f":"VLOOKUP($B77,VysledkyDoplneni!$C$7:$T$126,4,0)","v":0},{"$f":"VLOOKUP($B77,VysledkyDoplneni!$C$7:$T$126,5,0)","v":0},{"$f":"VLOOKUP($B77,VysledkyDoplneni!$C$7:$T$126,6,0)","v":0},{"$f":"VLOOKUP($B77,VysledkyDoplneni!$C$7:$T$126,7,0)","v":0},{"$f":"VLOOKUP($B77,VysledkyDoplneni!$C$7:$T$126,8,0)","v":0},{"$f":"VLOOKUP($B77,VysledkyDoplneni!$C$7:$T$126,9,0)","v":0},{"$f":"VLOOKUP($B77,VysledkyDoplneni!$C$7:$T$126,10,0)","v":0},{"$f":"VLOOKUP($B77,VysledkyDoplneni!$C$7:$T$126,11,0)","v":0},{"$f":"VLOOKUP($B77,VysledkyDoplneni!$C$7:$T$126,12,0)","v":0},{"$f":"VLOOKUP($B77,VysledkyDoplneni!$C$7:$T$126,13,0)","v":0},{"$f":"VLOOKUP($B77,VysledkyDoplneni!$C$7:$T$126,14,0)","v":0},{"$f":"VLOOKUP($B77,VysledkyDoplneni!$C$7:$T$126,15,0)","v":0},{"$f":"VLOOKUP($B77,VysledkyDoplneni!$C$7:$T$126,16,0)","v":0},{"$f":"VLOOKUP($B77,VysledkyDoplneni!$C$7:$T$126,17,0)","v":0},{"$f":"VLOOKUP($B77,VysledkyDoplneni!$C$7:$T$126,18,0)","v":0},null,null,0,{"$f":"(V77/(Data!$B$18*X77))","v":{"$error":"#DIV/0!"}},0]
[71,{"$f":"IF(Vstup!C97<>\"\",Vstup!C97,\"\")","v":""},"S",{"$f":"VLOOKUP($B78,VysledkyDoplneni!$C$7:$T$126,3,0)","v":0},{"$f":"VLOOKUP($B78,VysledkyDoplneni!$C$7:$T$126,4,0)","v":0},{"$f":"VLOOKUP($B78,VysledkyDoplneni!$C$7:$T$126,5,0)","v":0},{"$f":"VLOOKUP($B78,VysledkyDoplneni!$C$7:$T$126,6,0)","v":0},{"$f":"VLOOKUP($B78,VysledkyDoplneni!$C$7:$T$126,7,0)","v":0},{"$f":"VLOOKUP($B78,VysledkyDoplneni!$C$7:$T$126,8,0)","v":0},{"$f":"VLOOKUP($B78,VysledkyDoplneni!$C$7:$T$126,9,0)","v":0},{"$f":"VLOOKUP($B78,VysledkyDoplneni!$C$7:$T$126,10,0)","v":0},{"$f":"VLOOKUP($B78,VysledkyDoplneni!$C$7:$T$126,11,0)","v":0},{"$f":"VLOOKUP($B78,VysledkyDoplneni!$C$7:$T$126,12,0)","v":0},{"$f":"VLOOKUP($B78,VysledkyDoplneni!$C$7:$T$126,13,0)","v":0},{"$f":"VLOOKUP($B78,VysledkyDoplneni!$C$7:$T$126,14,0)","v":0},{"$f":"VLOOKUP($B78,VysledkyDoplneni!$C$7:$T$126,15,0)","v":0},{"$f":"VLOOKUP($B78,VysledkyDoplneni!$C$7:$T$126,16,0)","v":0},{"$f":"VLOOKUP($B78,VysledkyDoplneni!$C$7:$T$126,17,0)","v":0},{"$f":"VLOOKUP($B78,VysledkyDoplneni!$C$7:$T$126,18,0)","v":0},null,null,0,{"$f":"(V78/(Data!$B$18*X78))","v":{"$error":"#DIV/0!"}},0]
[72,{"$f":"IF(Vstup!C101<>\"\",Vstup!C101,\"\")","v":""},"S",{"$f":"VLOOKUP($B79,VysledkyDoplneni!$C$7:$T$126,3,0)","v":0},{"$f":"VLOOKUP($B79,VysledkyDoplneni!$C$7:$T$126,4,0)","v":0},{"$f":"VLOOKUP($B79,VysledkyDoplneni!$C$7:$T$126,5,0)","v":0},{"$f":"VLOOKUP($B79,VysledkyDoplneni!$C$7:$T$126,6,0)","v":0},{"$f":"VLOOKUP($B79,VysledkyDoplneni!$C$7:$T$126,7,0)","v":0},{"$f":"VLOOKUP($B79,VysledkyDoplneni!$C$7:$T$126,8,0)","v":0},{"$f":"VLOOKUP($B79,VysledkyDoplneni!$C$7:$T$126,9,0)","v":0},{"$f":"VLOOKUP($B79,VysledkyDoplneni!$C$7:$T$126,10,0)","v":0},{"$f":"VLOOKUP($B79,VysledkyDoplneni!$C$7:$T$126,11,0)","v":0},{"$f":"VLOOKUP($B79,VysledkyDoplneni!$C$7:$T$126,12,0)","v":0},{"$f":"VLOOKUP($B79,VysledkyDoplneni!$C$7:$T$126,13,0)","v":0},{"$f":"VLOOKUP($B79,VysledkyDoplneni!$C$7:$T$126,14,0)","v":0},{"$f":"VLOOKUP($B79,VysledkyDoplneni!$C$7:$T$126,15,0)","v":0},{"$f":"VLOOKUP($B79,VysledkyDoplneni!$C$7:$T$126,16,0)","v":0},{"$f":"VLOOKUP($B79,VysledkyDoplneni!$C$7:$T$126,17,0)","v":0},{"$f":"VLOOKUP($B79,VysledkyDoplneni!$C$7:$T$126,18,0)","v":0},null,null,0,{"$f":"(V79/(Data!$B$18*X79))","v":{"$error":"#DIV/0!"}},0]
[73,{"$f":"IF(Vstup!C74<>\"\",Vstup!C74,\"\")","v":""},"S",{"$f":"VLOOKUP($B80,VysledkyDoplneni!$C$7:$T$126,3,0)","v":0},{"$f":"VLOOKUP($B80,VysledkyDoplneni!$C$7:$T$126,4,0)","v":0},{"$f":"VLOOKUP($B80,VysledkyDoplneni!$C$7:$T$126,5,0)","v":0},{"$f":"VLOOKUP($B80,VysledkyDoplneni!$C$7:$T$126,6,0)","v":0},{"$f":"VLOOKUP($B80,VysledkyDoplneni!$C$7:$T$126,7,0)","v":0},{"$f":"VLOOKUP($B80,VysledkyDoplneni!$C$7:$T$126,8,0)","v":0},{"$f":"VLOOKUP($B80,VysledkyDoplneni!$C$7:$T$126,9,0)","v":0},{"$f":"VLOOKUP($B80,VysledkyDoplneni!$C$7:$T$126,10,0)","v":0},{"$f":"VLOOKUP($B80,VysledkyDoplneni!$C$7:$T$126,11,0)","v":0},{"$f":"VLOOKUP($B80,VysledkyDoplneni!$C$7:$T$126,12,0)","v":0},{"$f":"VLOOKUP($B80,VysledkyDoplneni!$C$7:$T$126,13,0)","v":0},{"$f":"VLOOKUP($B80,VysledkyDoplneni!$C$7:$T$126,14,0)","v":0},{"$f":"VLOOKUP($B80,VysledkyDoplneni!$C$7:$T$126,15,0)","v":0},{"$f":"VLOOKUP($B80,VysledkyDoplneni!$C$7:$T$126,16,0)","v":0},{"$f":"VLOOKUP($B80,VysledkyDoplneni!$C$7:$T$126,17,0)","v":0},{"$f":"VLOOKUP($B80,VysledkyDoplneni!$C$7:$T$126,18,0)","v":0},null,null,0,{"$f":"(V80/(Data!$B$18*X80))","v":{"$error":"#DIV/0!"}},0]
[74,{"$f":"IF(Vstup!C89<>\"\",Vstup!C89,\"\")","v":""},"S",{"$f":"VLOOKUP($B81,VysledkyDoplneni!$C$7:$T$126,3,0)","v":0},{"$f":"VLOOKUP($B81,VysledkyDoplneni!$C$7:$T$126,4,0)","v":0},{"$f":"VLOOKUP($B81,VysledkyDoplneni!$C$7:$T$126,5,0)","v":0},{"$f":"VLOOKUP($B81,VysledkyDoplneni!$C$7:$T$126,6,0)","v":0},{"$f":"VLOOKUP($B81,VysledkyDoplneni!$C$7:$T$126,7,0)","v":0},{"$f":"VLOOKUP($B81,VysledkyDoplneni!$C$7:$T$126,8,0)","v":0},{"$f":"VLOOKUP($B81,VysledkyDoplneni!$C$7:$T$126,9,0)","v":0},{"$f":"VLOOKUP($B81,VysledkyDoplneni!$C$7:$T$126,10,0)","v":0},{"$f":"VLOOKUP($B81,VysledkyDoplneni!$C$7:$T$126,11,0)","v":0},{"$f":"VLOOKUP($B81,VysledkyDoplneni!$C$7:$T$126,12,0)","v":0},{"$f":"VLOOKUP($B81,VysledkyDoplneni!$C$7:$T$126,13,0)","v":0},{"$f":"VLOOKUP($B81,VysledkyDoplneni!$C$7:$T$126,14,0)","v":0},{"$f":"VLOOKUP($B81,VysledkyDoplneni!$C$7:$T$126,15,0)","v":0},{"$f":"VLOOKUP($B81,VysledkyDoplneni!$C$7:$T$126,16,0)","v":0},{"$f":"VLOOKUP($B81,VysledkyDoplneni!$C$7:$T$126,17,0)","v":0},{"$f":"VLOOKUP($B81,VysledkyDoplneni!$C$7:$T$126,18,0)","v":0},null,null,0,{"$f":"(V81/(Data!$B$18*X81))","v":{"$error":"#DIV/0!"}},0]
[75,{"$f":"IF(Vstup!C90<>\"\",Vstup!C90,\"\")","v":""},"S",{"$f":"VLOOKUP($B82,VysledkyDoplneni!$C$7:$T$126,3,0)","v":0},{"$f":"VLOOKUP($B82,VysledkyDoplneni!$C$7:$T$126,4,0)","v":0},{"$f":"VLOOKUP($B82,VysledkyDoplneni!$C$7:$T$126,5,0)","v":0},{"$f":"VLOOKUP($B82,VysledkyDoplneni!$C$7:$T$126,6,0)","v":0},{"$f":"VLOOKUP($B82,VysledkyDoplneni!$C$7:$T$126,7,0)","v":0},{"$f":"VLOOKUP($B82,VysledkyDoplneni!$C$7:$T$126,8,0)","v":0},{"$f":"VLOOKUP($B82,VysledkyDoplneni!$C$7:$T$126,9,0)","v":0},{"$f":"VLOOKUP($B82,VysledkyDoplneni!$C$7:$T$126,10,0)","v":0},{"$f":"VLOOKUP($B82,VysledkyDoplneni!$C$7:$T$126,11,0)","v":0},{"$f":"VLOOKUP($B82,VysledkyDoplneni!$C$7:$T$126,12,0)","v":0},{"$f":"VLOOKUP($B82,VysledkyDoplneni!$C$7:$T$126,13,0)","v":0},{"$f":"VLOOKUP($B82,VysledkyDoplneni!$C$7:$T$126,14,0)","v":0},{"$f":"VLOOKUP($B82,VysledkyDoplneni!$C$7:$T$126,15,0)","v":0},{"$f":"VLOOKUP($B82,VysledkyDoplneni!$C$7:$T$126,16,0)","v":0},{"$f":"VLOOKUP($B82,VysledkyDoplneni!$C$7:$T$126,17,0)","v":0},{"$f":"VLOOKUP($B82,VysledkyDoplneni!$C$7:$T$126,18,0)","v":0},null,null,0,{"$f":"(V82/(Data!$B$18*X82))","v":{"$error":"#DIV/0!"}},0]
[76,{"$f":"IF(Vstup!C94<>\"\",Vstup!C94,\"\")","v":""},"S",{"$f":"VLOOKUP($B83,VysledkyDoplneni!$C$7:$T$126,3,0)","v":0},{"$f":"VLOOKUP($B83,VysledkyDoplneni!$C$7:$T$126,4,0)","v":0},{"$f":"VLOOKUP($B83,VysledkyDoplneni!$C$7:$T$126,5,0)","v":0},{"$f":"VLOOKUP($B83,VysledkyDoplneni!$C$7:$T$126,6,0)","v":0},{"$f":"VLOOKUP($B83,VysledkyDoplneni!$C$7:$T$126,7,0)","v":0},{"$f":"VLOOKUP($B83,VysledkyDoplneni!$C$7:$T$126,8,0)","v":0},{"$f":"VLOOKUP($B83,VysledkyDoplneni!$C$7:$T$126,9,0)","v":0},{"$f":"VLOOKUP($B83,VysledkyDoplneni!$C$7:$T$126,10,0)","v":0},{"$f":"VLOOKUP($B83,VysledkyDoplneni!$C$7:$T$126,11,0)","v":0},{"$f":"VLOOKUP($B83,VysledkyDoplneni!$C$7:$T$126,12,0)","v":0},{"$f":"VLOOKUP($B83,VysledkyDoplneni!$C$7:$T$126,13,0)","v":0},{"$f":"VLOOKUP($B83,VysledkyDoplneni!$C$7:$T$126,14,0)","v":0},{"$f":"VLOOKUP($B83,VysledkyDoplneni!$C$7:$T$126,15,0)","v":0},{"$f":"VLOOKUP($B83,VysledkyDoplneni!$C$7:$T$126,16,0)","v":0},{"$f":"VLOOKUP($B83,VysledkyDoplneni!$C$7:$T$126,17,0)","v":0},{"$f":"VLOOKUP($B83,VysledkyDoplneni!$C$7:$T$126,18,0)","v":0},null,null,0,{"$f":"(V83/(Data!$B$18*X83))","v":{"$error":"#DIV/0!"}},0]
[77,{"$f":"IF(Vstup!C83<>\"\",Vstup!C83,\"\")","v":""},"S",{"$f":"VLOOKUP($B84,VysledkyDoplneni!$C$7:$T$126,3,0)","v":0},{"$f":"VLOOKUP($B84,VysledkyDoplneni!$C$7:$T$126,4,0)","v":0},{"$f":"VLOOKUP($B84,VysledkyDoplneni!$C$7:$T$126,5,0)","v":0},{"$f":"VLOOKUP($B84,VysledkyDoplneni!$C$7:$T$126,6,0)","v":0},{"$f":"VLOOKUP($B84,VysledkyDoplneni!$C$7:$T$126,7,0)","v":0},{"$f":"VLOOKUP($B84,VysledkyDoplneni!$C$7:$T$126,8,0)","v":0},{"$f":"VLOOKUP($B84,VysledkyDoplneni!$C$7:$T$126,9,0)","v":0},{"$f":"VLOOKUP($B84,VysledkyDoplneni!$C$7:$T$126,10,0)","v":0},{"$f":"VLOOKUP($B84,VysledkyDoplneni!$C$7:$T$126,11,0)","v":0},{"$f":"VLOOKUP($B84,VysledkyDoplneni!$C$7:$T$126,12,0)","v":0},{"$f":"VLOOKUP($B84,VysledkyDoplneni!$C$7:$T$126,13,0)","v":0},{"$f":"VLOOKUP($B84,VysledkyDoplneni!$C$7:$T$126,14,0)","v":0},{"$f":"VLOOKUP($B84,VysledkyDoplneni!$C$7:$T$126,15,0)","v":0},{"$f":"VLOOKUP($B84,VysledkyDoplneni!$C$7:$T$126,16,0)","v":0},{"$f":"VLOOKUP($B84,VysledkyDoplneni!$C$7:$T$126,17,0)","v":0},{"$f":"VLOOKUP($B84,VysledkyDoplneni!$C$7:$T$126,18,0)","v":0},null,null,0,{"$f":"(V84/(Data!$B$18*X84))","v":{"$error":"#DIV/0!"}},0]
[78,{"$f":"IF(Vstup!C77<>\"\",Vstup!C77,\"\")","v":""},"S",{"$f":"VLOOKUP($B85,VysledkyDoplneni!$C$7:$T$126,3,0)","v":0},{"$f":"VLOOKUP($B85,VysledkyDoplneni!$C$7:$T$126,4,0)","v":0},{"$f":"VLOOKUP($B85,VysledkyDoplneni!$C$7:$T$126,5,0)","v":0},{"$f":"VLOOKUP($B85,VysledkyDoplneni!$C$7:$T$126,6,0)","v":0},{"$f":"VLOOKUP($B85,VysledkyDoplneni!$C$7:$T$126,7,0)","v":0},{"$f":"VLOOKUP($B85,VysledkyDoplneni!$C$7:$T$126,8,0)","v":0},{"$f":"VLOOKUP($B85,VysledkyDoplneni!$C$7:$T$126,9,0)","v":0},{"$f":"VLOOKUP($B85,VysledkyDoplneni!$C$7:$T$126,10,0)","v":0},{"$f":"VLOOKUP($B85,VysledkyDoplneni!$C$7:$T$126,11,0)","v":0},{"$f":"VLOOKUP($B85,VysledkyDoplneni!$C$7:$T$126,12,0)","v":0},{"$f":"VLOOKUP($B85,VysledkyDoplneni!$C$7:$T$126,13,0)","v":0},{"$f":"VLOOKUP($B85,VysledkyDoplneni!$C$7:$T$126,14,0)","v":0},{"$f":"VLOOKUP($B85,VysledkyDoplneni!$C$7:$T$126,15,0)","v":0},{"$f":"VLOOKUP($B85,VysledkyDoplneni!$C$7:$T$126,16,0)","v":0},{"$f":"VLOOKUP($B85,VysledkyDoplneni!$C$7:$T$126,17,0)","v":0},{"$f":"VLOOKUP($B85,VysledkyDoplneni!$C$7:$T$126,18,0)","v":0},null,null,0,{"$f":"(V85/(Data!$B$18*X85))","v":{"$error":"#DIV/0!"}},0]
[79,{"$f":"IF(Vstup!C86<>\"\",Vstup!C86,\"\")","v":""},"S",{"$f":"VLOOKUP($B86,VysledkyDoplneni!$C$7:$T$126,3,0)","v":0},{"$f":"VLOOKUP($B86,VysledkyDoplneni!$C$7:$T$126,4,0)","v":0},{"$f":"VLOOKUP($B86,VysledkyDoplneni!$C$7:$T$126,5,0)","v":0},{"$f":"VLOOKUP($B86,VysledkyDoplneni!$C$7:$T$126,6,0)","v":0},{"$f":"VLOOKUP($B86,VysledkyDoplneni!$C$7:$T$126,7,0)","v":0},{"$f":"VLOOKUP($B86,VysledkyDoplneni!$C$7:$T$126,8,0)","v":0},{"$f":"VLOOKUP($B86,VysledkyDoplneni!$C$7:$T$126,9,0)","v":0},{"$f":"VLOOKUP($B86,VysledkyDoplneni!$C$7:$T$126,10,0)","v":0},{"$f":"VLOOKUP($B86,VysledkyDoplneni!$C$7:$T$126,11,0)","v":0},{"$f":"VLOOKUP($B86,VysledkyDoplneni!$C$7:$T$126,12,0)","v":0},{"$f":"VLOOKUP($B86,VysledkyDoplneni!$C$7:$T$126,13,0)","v":0},{"$f":"VLOOKUP($B86,VysledkyDoplneni!$C$7:$T$126,14,0)","v":0},{"$f":"VLOOKUP($B86,VysledkyDoplneni!$C$7:$T$126,15,0)","v":0},{"$f":"VLOOKUP($B86,VysledkyDoplneni!$C$7:$T$126,16,0)","v":0},{"$f":"VLOOKUP($B86,VysledkyDoplneni!$C$7:$T$126,17,0)","v":0},{"$f":"VLOOKUP($B86,VysledkyDoplneni!$C$7:$T$126,18,0)","v":0},null,null,0,{"$f":"(V86/(Data!$B$18*X86))","v":{"$error":"#DIV/0!"}},0]
[80,{"$f":"IF(Vstup!C72<>\"\",Vstup!C72,\"\")","v":""},"S",{"$f":"VLOOKUP($B87,VysledkyDoplneni!$C$7:$T$126,3,0)","v":0},{"$f":"VLOOKUP($B87,VysledkyDoplneni!$C$7:$T$126,4,0)","v":0},{"$f":"VLOOKUP($B87,VysledkyDoplneni!$C$7:$T$126,5,0)","v":0},{"$f":"VLOOKUP($B87,VysledkyDoplneni!$C$7:$T$126,6,0)","v":0},{"$f":"VLOOKUP($B87,VysledkyDoplneni!$C$7:$T$126,7,0)","v":0},{"$f":"VLOOKUP($B87,VysledkyDoplneni!$C$7:$T$126,8,0)","v":0},{"$f":"VLOOKUP($B87,VysledkyDoplneni!$C$7:$T$126,9,0)","v":0},{"$f":"VLOOKUP($B87,VysledkyDoplneni!$C$7:$T$126,10,0)","v":0},{"$f":"VLOOKUP($B87,VysledkyDoplneni!$C$7:$T$126,11,0)","v":0},{"$f":"VLOOKUP($B87,VysledkyDoplneni!$C$7:$T$126,12,0)","v":0},{"$f":"VLOOKUP($B87,VysledkyDoplneni!$C$7:$T$126,13,0)","v":0},{"$f":"VLOOKUP($B87,VysledkyDoplneni!$C$7:$T$126,14,0)","v":0},{"$f":"VLOOKUP($B87,VysledkyDoplneni!$C$7:$T$126,15,0)","v":0},{"$f":"VLOOKUP($B87,VysledkyDoplneni!$C$7:$T$126,16,0)","v":0},{"$f":"VLOOKUP($B87,VysledkyDoplneni!$C$7:$T$126,17,0)","v":0},{"$f":"VLOOKUP($B87,VysledkyDoplneni!$C$7:$T$126,18,0)","v":0},null,null,0,{"$f":"(V87/(Data!$B$18*X87))","v":{"$error":"#DIV/0!"}},0]
[81,{"$f":"IF(Vstup!C87<>\"\",Vstup!C87,\"\")","v":""},"S",{"$f":"VLOOKUP($B88,VysledkyDoplneni!$C$7:$T$126,3,0)","v":0},{"$f":"VLOOKUP($B88,VysledkyDoplneni!$C$7:$T$126,4,0)","v":0},{"$f":"VLOOKUP($B88,VysledkyDoplneni!$C$7:$T$126,5,0)","v":0},{"$f":"VLOOKUP($B88,VysledkyDoplneni!$C$7:$T$126,6,0)","v":0},{"$f":"VLOOKUP($B88,VysledkyDoplneni!$C$7:$T$126,7,0)","v":0},{"$f":"VLOOKUP($B88,VysledkyDoplneni!$C$7:$T$126,8,0)","v":0},{"$f":"VLOOKUP($B88,VysledkyDoplneni!$C$7:$T$126,9,0)","v":0},{"$f":"VLOOKUP($B88,VysledkyDoplneni!$C$7:$T$126,10,0)","v":0},{"$f":"VLOOKUP($B88,VysledkyDoplneni!$C$7:$T$126,11,0)","v":0},{"$f":"VLOOKUP($B88,VysledkyDoplneni!$C$7:$T$126,12,0)","v":0},{"$f":"VLOOKUP($B88,VysledkyDoplneni!$C$7:$T$126,13,0)","v":0},{"$f":"VLOOKUP($B88,VysledkyDoplneni!$C$7:$T$126,14,0)","v":0},{"$f":"VLOOKUP($B88,VysledkyDoplneni!$C$7:$T$126,15,0)","v":0},{"$f":"VLOOKUP($B88,VysledkyDoplneni!$C$7:$T$126,16,0)","v":0},{"$f":"VLOOKUP($B88,VysledkyDoplneni!$C$7:$T$126,17,0)","v":0},{"$f":"VLOOKUP($B88,VysledkyDoplneni!$C$7:$T$126,18,0)","v":0},null,null,0,{"$f":"(V88/(Data!$B$18*X88))","v":{"$error":"#DIV/0!"}},0]
[82,{"$f":"IF(Vstup!C95<>\"\",Vstup!C95,\"\")","v":""},"S",{"$f":"VLOOKUP($B89,VysledkyDoplneni!$C$7:$T$126,3,0)","v":0},{"$f":"VLOOKUP($B89,VysledkyDoplneni!$C$7:$T$126,4,0)","v":0},{"$f":"VLOOKUP($B89,VysledkyDoplneni!$C$7:$T$126,5,0)","v":0},{"$f":"VLOOKUP($B89,VysledkyDoplneni!$C$7:$T$126,6,0)","v":0},{"$f":"VLOOKUP($B89,VysledkyDoplneni!$C$7:$T$126,7,0)","v":0},{"$f":"VLOOKUP($B89,VysledkyDoplneni!$C$7:$T$126,8,0)","v":0},{"$f":"VLOOKUP($B89,VysledkyDoplneni!$C$7:$T$126,9,0)","v":0},{"$f":"VLOOKUP($B89,VysledkyDoplneni!$C$7:$T$126,10,0)","v":0},{"$f":"VLOOKUP($B89,VysledkyDoplneni!$C$7:$T$126,11,0)","v":0},{"$f":"VLOOKUP($B89,VysledkyDoplneni!$C$7:$T$126,12,0)","v":0},{"$f":"VLOOKUP($B89,VysledkyDoplneni!$C$7:$T$126,13,0)","v":0},{"$f":"VLOOKUP($B89,VysledkyDoplneni!$C$7:$T$126,14,0)","v":0},{"$f":"VLOOKUP($B89,VysledkyDoplneni!$C$7:$T$126,15,0)","v":0},{"$f":"VLOOKUP($B89,VysledkyDoplneni!$C$7:$T$126,16,0)","v":0},{"$f":"VLOOKUP($B89,VysledkyDoplneni!$C$7:$T$126,17,0)","v":0},{"$f":"VLOOKUP($B89,VysledkyDoplneni!$C$7:$T$126,18,0)","v":0},null,null,0,{"$f":"(V89/(Data!$B$18*X89))","v":{"$error":"#DIV/0!"}},0]
[83,{"$f":"IF(Vstup!C80<>\"\",Vstup!C80,\"\")","v":""},"S",{"$f":"VLOOKUP($B90,VysledkyDoplneni!$C$7:$T$126,3,0)","v":0},{"$f":"VLOOKUP($B90,VysledkyDoplneni!$C$7:$T$126,4,0)","v":0},{"$f":"VLOOKUP($B90,VysledkyDoplneni!$C$7:$T$126,5,0)","v":0},{"$f":"VLOOKUP($B90,VysledkyDoplneni!$C$7:$T$126,6,0)","v":0},{"$f":"VLOOKUP($B90,VysledkyDoplneni!$C$7:$T$126,7,0)","v":0},{"$f":"VLOOKUP($B90,VysledkyDoplneni!$C$7:$T$126,8,0)","v":0},{"$f":"VLOOKUP($B90,VysledkyDoplneni!$C$7:$T$126,9,0)","v":0},{"$f":"VLOOKUP($B90,VysledkyDoplneni!$C$7:$T$126,10,0)","v":0},{"$f":"VLOOKUP($B90,VysledkyDoplneni!$C$7:$T$126,11,0)","v":0},{"$f":"VLOOKUP($B90,VysledkyDoplneni!$C$7:$T$126,12,0)","v":0},{"$f":"VLOOKUP($B90,VysledkyDoplneni!$C$7:$T$126,13,0)","v":0},{"$f":"VLOOKUP($B90,VysledkyDoplneni!$C$7:$T$126,14,0)","v":0},{"$f":"VLOOKUP($B90,VysledkyDoplneni!$C$7:$T$126,15,0)","v":0},{"$f":"VLOOKUP($B90,VysledkyDoplneni!$C$7:$T$126,16,0)","v":0},{"$f":"VLOOKUP($B90,VysledkyDoplneni!$C$7:$T$126,17,0)","v":0},{"$f":"VLOOKUP($B90,VysledkyDoplneni!$C$7:$T$126,18,0)","v":0},null,null,0,{"$f":"(V90/(Data!$B$18*X90))","v":{"$error":"#DIV/0!"}},0]
[84,{"$f":"IF(Vstup!C73<>\"\",Vstup!C73,\"\")","v":""},"S",{"$f":"VLOOKUP($B91,VysledkyDoplneni!$C$7:$T$126,3,0)","v":0},{"$f":"VLOOKUP($B91,VysledkyDoplneni!$C$7:$T$126,4,0)","v":0},{"$f":"VLOOKUP($B91,VysledkyDoplneni!$C$7:$T$126,5,0)","v":0},{"$f":"VLOOKUP($B91,VysledkyDoplneni!$C$7:$T$126,6,0)","v":0},{"$f":"VLOOKUP($B91,VysledkyDoplneni!$C$7:$T$126,7,0)","v":0},{"$f":"VLOOKUP($B91,VysledkyDoplneni!$C$7:$T$126,8,0)","v":0},{"$f":"VLOOKUP($B91,VysledkyDoplneni!$C$7:$T$126,9,0)","v":0},{"$f":"VLOOKUP($B91,VysledkyDoplneni!$C$7:$T$126,10,0)","v":0},{"$f":"VLOOKUP($B91,VysledkyDoplneni!$C$7:$T$126,11,0)","v":0},{"$f":"VLOOKUP($B91,VysledkyDoplneni!$C$7:$T$126,12,0)","v":0},{"$f":"VLOOKUP($B91,VysledkyDoplneni!$C$7:$T$126,13,0)","v":0},{"$f":"VLOOKUP($B91,VysledkyDoplneni!$C$7:$T$126,14,0)","v":0},{"$f":"VLOOKUP($B91,VysledkyDoplneni!$C$7:$T$126,15,0)","v":0},{"$f":"VLOOKUP($B91,VysledkyDoplneni!$C$7:$T$126,16,0)","v":0},{"$f":"VLOOKUP($B91,VysledkyDoplneni!$C$7:$T$126,17,0)","v":0},{"$f":"VLOOKUP($B91,VysledkyDoplneni!$C$7:$T$126,18,0)","v":0},null,null,0,{"$f":"(V91/(Data!$B$18*X91))","v":{"$error":"#DIV/0!"}},0]
[85,{"$f":"IF(Vstup!C79<>\"\",Vstup!C79,\"\")","v":""},"S",{"$f":"VLOOKUP($B92,VysledkyDoplneni!$C$7:$T$126,3,0)","v":0},{"$f":"VLOOKUP($B92,VysledkyDoplneni!$C$7:$T$126,4,0)","v":0},{"$f":"VLOOKUP($B92,VysledkyDoplneni!$C$7:$T$126,5,0)","v":0},{"$f":"VLOOKUP($B92,VysledkyDoplneni!$C$7:$T$126,6,0)","v":0},{"$f":"VLOOKUP($B92,VysledkyDoplneni!$C$7:$T$126,7,0)","v":0},{"$f":"VLOOKUP($B92,VysledkyDoplneni!$C$7:$T$126,8,0)","v":0},{"$f":"VLOOKUP($B92,VysledkyDoplneni!$C$7:$T$126,9,0)","v":0},{"$f":"VLOOKUP($B92,VysledkyDoplneni!$C$7:$T$126,10,0)","v":0},{"$f":"VLOOKUP($B92,VysledkyDoplneni!$C$7:$T$126,11,0)","v":0},{"$f":"VLOOKUP($B92,VysledkyDoplneni!$C$7:$T$126,12,0)","v":0},{"$f":"VLOOKUP($B92,VysledkyDoplneni!$C$7:$T$126,13,0)","v":0},{"$f":"VLOOKUP($B92,VysledkyDoplneni!$C$7:$T$126,14,0)","v":0},{"$f":"VLOOKUP($B92,VysledkyDoplneni!$C$7:$T$126,15,0)","v":0},{"$f":"VLOOKUP($B92,VysledkyDoplneni!$C$7:$T$126,16,0)","v":0},{"$f":"VLOOKUP($B92,VysledkyDoplneni!$C$7:$T$126,17,0)","v":0},{"$f":"VLOOKUP($B92,VysledkyDoplneni!$C$7:$T$126,18,0)","v":0},null,null,0,{"$f":"(V92/(Data!$B$18*X92))","v":{"$error":"#DIV/0!"}},0]
[86,{"$f":"IF(Vstup!C88<>\"\",Vstup!C88,\"\")","v":""},"S",{"$f":"VLOOKUP($B93,VysledkyDoplneni!$C$7:$T$126,3,0)","v":0},{"$f":"VLOOKUP($B93,VysledkyDoplneni!$C$7:$T$126,4,0)","v":0},{"$f":"VLOOKUP($B93,VysledkyDoplneni!$C$7:$T$126,5,0)","v":0},{"$f":"VLOOKUP($B93,VysledkyDoplneni!$C$7:$T$126,6,0)","v":0},{"$f":"VLOOKUP($B93,VysledkyDoplneni!$C$7:$T$126,7,0)","v":0},{"$f":"VLOOKUP($B93,VysledkyDoplneni!$C$7:$T$126,8,0)","v":0},{"$f":"VLOOKUP($B93,VysledkyDoplneni!$C$7:$T$126,9,0)","v":0},{"$f":"VLOOKUP($B93,VysledkyDoplneni!$C$7:$T$126,10,0)","v":0},{"$f":"VLOOKUP($B93,VysledkyDoplneni!$C$7:$T$126,11,0)","v":0},{"$f":"VLOOKUP($B93,VysledkyDoplneni!$C$7:$T$126,12,0)","v":0},{"$f":"VLOOKUP($B93,VysledkyDoplneni!$C$7:$T$126,13,0)","v":0},{"$f":"VLOOKUP($B93,VysledkyDoplneni!$C$7:$T$126,14,0)","v":0},{"$f":"VLOOKUP($B93,VysledkyDoplneni!$C$7:$T$126,15,0)","v":0},{"$f":"VLOOKUP($B93,VysledkyDoplneni!$C$7:$T$126,16,0)","v":0},{"$f":"VLOOKUP($B93,VysledkyDoplneni!$C$7:$T$126,17,0)","v":0},{"$f":"VLOOKUP($B93,VysledkyDoplneni!$C$7:$T$126,18,0)","v":0},null,null,0,{"$f":"(V93/(Data!$B$18*X93))","v":{"$error":"#DIV/0!"}},0]
[87,{"$f":"IF(Vstup!C93<>\"\",Vstup!C93,\"\")","v":""},"S",{"$f":"VLOOKUP($B94,VysledkyDoplneni!$C$7:$T$126,3,0)","v":0},{"$f":"VLOOKUP($B94,VysledkyDoplneni!$C$7:$T$126,4,0)","v":0},{"$f":"VLOOKUP($B94,VysledkyDoplneni!$C$7:$T$126,5,0)","v":0},{"$f":"VLOOKUP($B94,VysledkyDoplneni!$C$7:$T$126,6,0)","v":0},{"$f":"VLOOKUP($B94,VysledkyDoplneni!$C$7:$T$126,7,0)","v":0},{"$f":"VLOOKUP($B94,VysledkyDoplneni!$C$7:$T$126,8,0)","v":0},{"$f":"VLOOKUP($B94,VysledkyDoplneni!$C$7:$T$126,9,0)","v":0},{"$f":"VLOOKUP($B94,VysledkyDoplneni!$C$7:$T$126,10,0)","v":0},{"$f":"VLOOKUP($B94,VysledkyDoplneni!$C$7:$T$126,11,0)","v":0},{"$f":"VLOOKUP($B94,VysledkyDoplneni!$C$7:$T$126,12,0)","v":0},{"$f":"VLOOKUP($B94,VysledkyDoplneni!$C$7:$T$126,13,0)","v":0},{"$f":"VLOOKUP($B94,VysledkyDoplneni!$C$7:$T$126,14,0)","v":0},{"$f":"VLOOKUP($B94,VysledkyDoplneni!$C$7:$T$126,15,0)","v":0},{"$f":"VLOOKUP($B94,VysledkyDoplneni!$C$7:$T$126,16,0)","v":0},{"$f":"VLOOKUP($B94,VysledkyDoplneni!$C$7:$T$126,17,0)","v":0},{"$f":"VLOOKUP($B94,VysledkyDoplneni!$C$7:$T$126,18,0)","v":0},null,null,0,{"$f":"(V94/(Data!$B$18*X94))","v":{"$error":"#DIV/0!"}},0]
[88,{"$f":"IF(Vstup!C100<>\"\",Vstup!C100,\"\")","v":""},"S",{"$f":"VLOOKUP($B95,VysledkyDoplneni!$C$7:$T$126,3,0)","v":0},{"$f":"VLOOKUP($B95,VysledkyDoplneni!$C$7:$T$126,4,0)","v":0},{"$f":"VLOOKUP($B95,VysledkyDoplneni!$C$7:$T$126,5,0)","v":0},{"$f":"VLOOKUP($B95,VysledkyDoplneni!$C$7:$T$126,6,0)","v":0},{"$f":"VLOOKUP($B95,VysledkyDoplneni!$C$7:$T$126,7,0)","v":0},{"$f":"VLOOKUP($B95,VysledkyDoplneni!$C$7:$T$126,8,0)","v":0},{"$f":"VLOOKUP($B95,VysledkyDoplneni!$C$7:$T$126,9,0)","v":0},{"$f":"VLOOKUP($B95,VysledkyDoplneni!$C$7:$T$126,10,0)","v":0},{"$f":"VLOOKUP($B95,VysledkyDoplneni!$C$7:$T$126,11,0)","v":0},{"$f":"VLOOKUP($B95,VysledkyDoplneni!$C$7:$T$126,12,0)","v":0},{"$f":"VLOOKUP($B95,VysledkyDoplneni!$C$7:$T$126,13,0)","v":0},{"$f":"VLOOKUP($B95,VysledkyDoplneni!$C$7:$T$126,14,0)","v":0},{"$f":"VLOOKUP($B95,VysledkyDoplneni!$C$7:$T$126,15,0)","v":0},{"$f":"VLOOKUP($B95,VysledkyDoplneni!$C$7:$T$126,16,0)","v":0},{"$f":"VLOOKUP($B95,VysledkyDoplneni!$C$7:$T$126,17,0)","v":0},{"$f":"VLOOKUP($B95,VysledkyDoplneni!$C$7:$T$126,18,0)","v":0},null,null,0,{"$f":"(V95/(Data!$B$18*X95))","v":{"$error":"#DIV/0!"}},0]
[89,{"$f":"IF(Vstup!C92<>\"\",Vstup!C92,\"\")","v":""},"S",{"$f":"VLOOKUP($B96,VysledkyDoplneni!$C$7:$T$126,3,0)","v":0},{"$f":"VLOOKUP($B96,VysledkyDoplneni!$C$7:$T$126,4,0)","v":0},{"$f":"VLOOKUP($B96,VysledkyDoplneni!$C$7:$T$126,5,0)","v":0},{"$f":"VLOOKUP($B96,VysledkyDoplneni!$C$7:$T$126,6,0)","v":0},{"$f":"VLOOKUP($B96,VysledkyDoplneni!$C$7:$T$126,7,0)","v":0},{"$f":"VLOOKUP($B96,VysledkyDoplneni!$C$7:$T$126,8,0)","v":0},{"$f":"VLOOKUP($B96,VysledkyDoplneni!$C$7:$T$126,9,0)","v":0},{"$f":"VLOOKUP($B96,VysledkyDoplneni!$C$7:$T$126,10,0)","v":0},{"$f":"VLOOKUP($B96,VysledkyDoplneni!$C$7:$T$126,11,0)","v":0},{"$f":"VLOOKUP($B96,VysledkyDoplneni!$C$7:$T$126,12,0)","v":0},{"$f":"VLOOKUP($B96,VysledkyDoplneni!$C$7:$T$126,13,0)","v":0},{"$f":"VLOOKUP($B96,VysledkyDoplneni!$C$7:$T$126,14,0)","v":0},{"$f":"VLOOKUP($B96,VysledkyDoplneni!$C$7:$T$126,15,0)","v":0},{"$f":"VLOOKUP($B96,VysledkyDoplneni!$C$7:$T$126,16,0)","v":0},{"$f":"VLOOKUP($B96,VysledkyDoplneni!$C$7:$T$126,17,0)","v":0},{"$f":"VLOOKUP($B96,VysledkyDoplneni!$C$7:$T$126,18,0)","v":0},null,null,0,{"$f":"(V96/(Data!$B$18*X96))","v":{"$error":"#DIV/0!"}},0]
[90,{"$f":"IF(Vstup!C91<>\"\",Vstup!C91,\"\")","v":""},"S",{"$f":"VLOOKUP($B97,VysledkyDoplneni!$C$7:$T$126,3,0)","v":0},{"$f":"VLOOKUP($B97,VysledkyDoplneni!$C$7:$T$126,4,0)","v":0},{"$f":"VLOOKUP($B97,VysledkyDoplneni!$C$7:$T$126,5,0)","v":0},{"$f":"VLOOKUP($B97,VysledkyDoplneni!$C$7:$T$126,6,0)","v":0},{"$f":"VLOOKUP($B97,VysledkyDoplneni!$C$7:$T$126,7,0)","v":0},{"$f":"VLOOKUP($B97,VysledkyDoplneni!$C$7:$T$126,8,0)","v":0},{"$f":"VLOOKUP($B97,VysledkyDoplneni!$C$7:$T$126,9,0)","v":0},{"$f":"VLOOKUP($B97,VysledkyDoplneni!$C$7:$T$126,10,0)","v":0},{"$f":"VLOOKUP($B97,VysledkyDoplneni!$C$7:$T$126,11,0)","v":0},{"$f":"VLOOKUP($B97,VysledkyDoplneni!$C$7:$T$126,12,0)","v":0},{"$f":"VLOOKUP($B97,VysledkyDoplneni!$C$7:$T$126,13,0)","v":0},{"$f":"VLOOKUP($B97,VysledkyDoplneni!$C$7:$T$126,14,0)","v":0},{"$f":"VLOOKUP($B97,VysledkyDoplneni!$C$7:$T$126,15,0)","v":0},{"$f":"VLOOKUP($B97,VysledkyDoplneni!$C$7:$T$126,16,0)","v":0},{"$f":"VLOOKUP($B97,VysledkyDoplneni!$C$7:$T$126,17,0)","v":0},{"$f":"VLOOKUP($B97,VysledkyDoplneni!$C$7:$T$126,18,0)","v":0},null,null,0,{"$f":"(V97/(Data!$B$18*X97))","v":{"$error":"#DIV/0!"}},0]
[91,{"$f":"IF(Vstup!C102<>\"\",Vstup!C102,\"\")","v":""},"S",{"$f":"VLOOKUP($B98,VysledkyDoplneni!$C$7:$T$126,3,0)","v":0},{"$f":"VLOOKUP($B98,VysledkyDoplneni!$C$7:$T$126,4,0)","v":0},{"$f":"VLOOKUP($B98,VysledkyDoplneni!$C$7:$T$126,5,0)","v":0},{"$f":"VLOOKUP($B98,VysledkyDoplneni!$C$7:$T$126,6,0)","v":0},{"$f":"VLOOKUP($B98,VysledkyDoplneni!$C$7:$T$126,7,0)","v":0},{"$f":"VLOOKUP($B98,VysledkyDoplneni!$C$7:$T$126,8,0)","v":0},{"$f":"VLOOKUP($B98,VysledkyDoplneni!$C$7:$T$126,9,0)","v":0},{"$f":"VLOOKUP($B98,VysledkyDoplneni!$C$7:$T$126,10,0)","v":0},{"$f":"VLOOKUP($B98,VysledkyDoplneni!$C$7:$T$126,11,0)","v":0},{"$f":"VLOOKUP($B98,VysledkyDoplneni!$C$7:$T$126,12,0)","v":0},{"$f":"VLOOKUP($B98,VysledkyDoplneni!$C$7:$T$126,13,0)","v":0},{"$f":"VLOOKUP($B98,VysledkyDoplneni!$C$7:$T$126,14,0)","v":0},{"$f":"VLOOKUP($B98,VysledkyDoplneni!$C$7:$T$126,15,0)","v":0},{"$f":"VLOOKUP($B98,VysledkyDoplneni!$C$7:$T$126,16,0)","v":0},{"$f":"VLOOKUP($B98,VysledkyDoplneni!$C$7:$T$126,17,0)","v":0},{"$f":"VLOOKUP($B98,VysledkyDoplneni!$C$7:$T$126,18,0)","v":0},null,null,0,{"$f":"(V98/(Data!$B$18*X98))","v":{"$error":"#DIV/0!"}},0]
[92,{"$f":"IF(Vstup!C65<>\"\",Vstup!C65,\"\")","v":""},"S",{"$f":"VLOOKUP($B99,VysledkyDoplneni!$C$7:$T$126,3,0)","v":0},{"$f":"VLOOKUP($B99,VysledkyDoplneni!$C$7:$T$126,4,0)","v":0},{"$f":"VLOOKUP($B99,VysledkyDoplneni!$C$7:$T$126,5,0)","v":0},{"$f":"VLOOKUP($B99,VysledkyDoplneni!$C$7:$T$126,6,0)","v":0},{"$f":"VLOOKUP($B99,VysledkyDoplneni!$C$7:$T$126,7,0)","v":0},{"$f":"VLOOKUP($B99,VysledkyDoplneni!$C$7:$T$126,8,0)","v":0},{"$f":"VLOOKUP($B99,VysledkyDoplneni!$C$7:$T$126,9,0)","v":0},{"$f":"VLOOKUP($B99,VysledkyDoplneni!$C$7:$T$126,10,0)","v":0},{"$f":"VLOOKUP($B99,VysledkyDoplneni!$C$7:$T$126,11,0)","v":0},{"$f":"VLOOKUP($B99,VysledkyDoplneni!$C$7:$T$126,12,0)","v":0},{"$f":"VLOOKUP($B99,VysledkyDoplneni!$C$7:$T$126,13,0)","v":0},{"$f":"VLOOKUP($B99,VysledkyDoplneni!$C$7:$T$126,14,0)","v":0},{"$f":"VLOOKUP($B99,VysledkyDoplneni!$C$7:$T$126,15,0)","v":0},{"$f":"VLOOKUP($B99,VysledkyDoplneni!$C$7:$T$126,16,0)","v":0},{"$f":"VLOOKUP($B99,VysledkyDoplneni!$C$7:$T$126,17,0)","v":0},{"$f":"VLOOKUP($B99,VysledkyDoplneni!$C$7:$T$126,18,0)","v":0},null,null,{"$f":"SUM(D99:T99)","v":0},{"$f":"(V99/(Data!$B$18*X99))","v":{"$error":"#DIV/0!"}},0]
[93,{"$f":"IF(Vstup!C69<>\"\",Vstup!C69,\"\")","v":""},"S",{"$f":"VLOOKUP($B100,VysledkyDoplneni!$C$7:$T$126,3,0)","v":0},{"$f":"VLOOKUP($B100,VysledkyDoplneni!$C$7:$T$126,4,0)","v":0},{"$f":"VLOOKUP($B100,VysledkyDoplneni!$C$7:$T$126,5,0)","v":0},{"$f":"VLOOKUP($B100,VysledkyDoplneni!$C$7:$T$126,6,0)","v":0},{"$f":"VLOOKUP($B100,VysledkyDoplneni!$C$7:$T$126,7,0)","v":0},{"$f":"VLOOKUP($B100,VysledkyDoplneni!$C$7:$T$126,8,0)","v":0},{"$f":"VLOOKUP($B100,VysledkyDoplneni!$C$7:$T$126,9,0)","v":0},{"$f":"VLOOKUP($B100,VysledkyDoplneni!$C$7:$T$126,10,0)","v":0},{"$f":"VLOOKUP($B100,VysledkyDoplneni!$C$7:$T$126,11,0)","v":0},{"$f":"VLOOKUP($B100,VysledkyDoplneni!$C$7:$T$126,12,0)","v":0},{"$f":"VLOOKUP($B100,VysledkyDoplneni!$C$7:$T$126,13,0)","v":0},{"$f":"VLOOKUP($B100,VysledkyDoplneni!$C$7:$T$126,14,0)","v":0},{"$f":"VLOOKUP($B100,VysledkyDoplneni!$C$7:$T$126,15,0)","v":0},{"$f":"VLOOKUP($B100,VysledkyDoplneni!$C$7:$T$126,16,0)","v":0},{"$f":"VLOOKUP($B100,VysledkyDoplneni!$C$7:$T$126,17,0)","v":0},{"$f":"VLOOKUP($B100,VysledkyDoplneni!$C$7:$T$126,18,0)","v":0},null,null,{"$f":"SUM(D100:S100)","v":0},{"$f":"(V100/(Data!$B$18*X100))","v":{"$error":"#DIV/0!"}},0]
[94,{"$f":"IF(Vstup!C68<>\"\",Vstup!C68,\"\")","v":""},"S",{"$f":"VLOOKUP($B101,VysledkyDoplneni!$C$7:$T$126,3,0)","v":0},{"$f":"VLOOKUP($B101,VysledkyDoplneni!$C$7:$T$126,4,0)","v":0},{"$f":"VLOOKUP($B101,VysledkyDoplneni!$C$7:$T$126,5,0)","v":0},{"$f":"VLOOKUP($B101,VysledkyDoplneni!$C$7:$T$126,6,0)","v":0},{"$f":"VLOOKUP($B101,VysledkyDoplneni!$C$7:$T$126,7,0)","v":0},{"$f":"VLOOKUP($B101,VysledkyDoplneni!$C$7:$T$126,8,0)","v":0},{"$f":"VLOOKUP($B101,VysledkyDoplneni!$C$7:$T$126,9,0)","v":0},{"$f":"VLOOKUP($B101,VysledkyDoplneni!$C$7:$T$126,10,0)","v":0},{"$f":"VLOOKUP($B101,VysledkyDoplneni!$C$7:$T$126,11,0)","v":0},{"$f":"VLOOKUP($B101,VysledkyDoplneni!$C$7:$T$126,12,0)","v":0},{"$f":"VLOOKUP($B101,VysledkyDoplneni!$C$7:$T$126,13,0)","v":0},{"$f":"VLOOKUP($B101,VysledkyDoplneni!$C$7:$T$126,14,0)","v":0},{"$f":"VLOOKUP($B101,VysledkyDoplneni!$C$7:$T$126,15,0)","v":0},{"$f":"VLOOKUP($B101,VysledkyDoplneni!$C$7:$T$126,16,0)","v":0},{"$f":"VLOOKUP($B101,VysledkyDoplneni!$C$7:$T$126,17,0)","v":0},{"$f":"VLOOKUP($B101,VysledkyDoplneni!$C$7:$T$126,18,0)","v":0},null,null,0,{"$f":"(V101/(Data!$B$18*X101))","v":{"$error":"#DIV/0!"}},0]
[95,{"$f":"IF(Vstup!C104<>\"\",Vstup!C104,\"\")","v":""},"S",{"$f":"VLOOKUP($B102,VysledkyDoplneni!$C$7:$T$126,3,0)","v":0},{"$f":"VLOOKUP($B102,VysledkyDoplneni!$C$7:$T$126,4,0)","v":0},{"$f":"VLOOKUP($B102,VysledkyDoplneni!$C$7:$T$126,5,0)","v":0},{"$f":"VLOOKUP($B102,VysledkyDoplneni!$C$7:$T$126,6,0)","v":0},{"$f":"VLOOKUP($B102,VysledkyDoplneni!$C$7:$T$126,7,0)","v":0},{"$f":"VLOOKUP($B102,VysledkyDoplneni!$C$7:$T$126,8,0)","v":0},{"$f":"VLOOKUP($B102,VysledkyDoplneni!$C$7:$T$126,9,0)","v":0},{"$f":"VLOOKUP($B102,VysledkyDoplneni!$C$7:$T$126,10,0)","v":0},{"$f":"VLOOKUP($B102,VysledkyDoplneni!$C$7:$T$126,11,0)","v":0},{"$f":"VLOOKUP($B102,VysledkyDoplneni!$C$7:$T$126,12,0)","v":0},{"$f":"VLOOKUP($B102,VysledkyDoplneni!$C$7:$T$126,13,0)","v":0},{"$f":"VLOOKUP($B102,VysledkyDoplneni!$C$7:$T$126,14,0)","v":0},{"$f":"VLOOKUP($B102,VysledkyDoplneni!$C$7:$T$126,15,0)","v":0},{"$f":"VLOOKUP($B102,VysledkyDoplneni!$C$7:$T$126,16,0)","v":0},{"$f":"VLOOKUP($B102,VysledkyDoplneni!$C$7:$T$126,17,0)","v":0},{"$f":"VLOOKUP($B102,VysledkyDoplneni!$C$7:$T$126,18,0)","v":0},null,null,0,{"$f":"(V102/(Data!$B$18*X102))","v":{"$error":"#DIV/0!"}},0]
[96,{"$f":"IF(Vstup!C70<>\"\",Vstup!C70,\"\")","v":""},"S",{"$f":"VLOOKUP($B103,VysledkyDoplneni!$C$7:$T$126,3,0)","v":0},{"$f":"VLOOKUP($B103,VysledkyDoplneni!$C$7:$T$126,4,0)","v":0},{"$f":"VLOOKUP($B103,VysledkyDoplneni!$C$7:$T$126,5,0)","v":0},{"$f":"VLOOKUP($B103,VysledkyDoplneni!$C$7:$T$126,6,0)","v":0},{"$f":"VLOOKUP($B103,VysledkyDoplneni!$C$7:$T$126,7,0)","v":0},{"$f":"VLOOKUP($B103,VysledkyDoplneni!$C$7:$T$126,8,0)","v":0},{"$f":"VLOOKUP($B103,VysledkyDoplneni!$C$7:$T$126,9,0)","v":0},{"$f":"VLOOKUP($B103,VysledkyDoplneni!$C$7:$T$126,10,0)","v":0},{"$f":"VLOOKUP($B103,VysledkyDoplneni!$C$7:$T$126,11,0)","v":0},{"$f":"VLOOKUP($B103,VysledkyDoplneni!$C$7:$T$126,12,0)","v":0},{"$f":"VLOOKUP($B103,VysledkyDoplneni!$C$7:$T$126,13,0)","v":0},{"$f":"VLOOKUP($B103,VysledkyDoplneni!$C$7:$T$126,14,0)","v":0},{"$f":"VLOOKUP($B103,VysledkyDoplneni!$C$7:$T$126,15,0)","v":0},{"$f":"VLOOKUP($B103,VysledkyDoplneni!$C$7:$T$126,16,0)","v":0},{"$f":"VLOOKUP($B103,VysledkyDoplneni!$C$7:$T$126,17,0)","v":0},{"$f":"VLOOKUP($B103,VysledkyDoplneni!$C$7:$T$126,18,0)","v":0},null,null,0,{"$f":"(V103/(Data!$B$18*X103))","v":{"$error":"#DIV/0!"}},0]
[97,{"$f":"IF(Vstup!C78<>\"\",Vstup!C78,\"\")","v":""},"S",{"$f":"VLOOKUP($B104,VysledkyDoplneni!$C$7:$T$126,3,0)","v":0},{"$f":"VLOOKUP($B104,VysledkyDoplneni!$C$7:$T$126,4,0)","v":0},{"$f":"VLOOKUP($B104,VysledkyDoplneni!$C$7:$T$126,5,0)","v":0},{"$f":"VLOOKUP($B104,VysledkyDoplneni!$C$7:$T$126,6,0)","v":0},{"$f":"VLOOKUP($B104,VysledkyDoplneni!$C$7:$T$126,7,0)","v":0},{"$f":"VLOOKUP($B104,VysledkyDoplneni!$C$7:$T$126,8,0)","v":0},{"$f":"VLOOKUP($B104,VysledkyDoplneni!$C$7:$T$126,9,0)","v":0},{"$f":"VLOOKUP($B104,VysledkyDoplneni!$C$7:$T$126,10,0)","v":0},{"$f":"VLOOKUP($B104,VysledkyDoplneni!$C$7:$T$126,11,0)","v":0},{"$f":"VLOOKUP($B104,VysledkyDoplneni!$C$7:$T$126,12,0)","v":0},{"$f":"VLOOKUP($B104,VysledkyDoplneni!$C$7:$T$126,13,0)","v":0},{"$f":"VLOOKUP($B104,VysledkyDoplneni!$C$7:$T$126,14,0)","v":0},{"$f":"VLOOKUP($B104,VysledkyDoplneni!$C$7:$T$126,15,0)","v":0},{"$f":"VLOOKUP($B104,VysledkyDoplneni!$C$7:$T$126,16,0)","v":0},{"$f":"VLOOKUP($B104,VysledkyDoplneni!$C$7:$T$126,17,0)","v":0},{"$f":"VLOOKUP($B104,VysledkyDoplneni!$C$7:$T$126,18,0)","v":0},null,null,0,{"$f":"(V104/(Data!$B$18*X104))","v":{"$error":"#DIV/0!"}},0]
[98,{"$f":"IF(Vstup!C105<>\"\",Vstup!C105,\"\")","v":""},"S",{"$f":"VLOOKUP($B105,VysledkyDoplneni!$C$7:$T$126,3,0)","v":0},{"$f":"VLOOKUP($B105,VysledkyDoplneni!$C$7:$T$126,4,0)","v":0},{"$f":"VLOOKUP($B105,VysledkyDoplneni!$C$7:$T$126,5,0)","v":0},{"$f":"VLOOKUP($B105,VysledkyDoplneni!$C$7:$T$126,6,0)","v":0},{"$f":"VLOOKUP($B105,VysledkyDoplneni!$C$7:$T$126,7,0)","v":0},{"$f":"VLOOKUP($B105,VysledkyDoplneni!$C$7:$T$126,8,0)","v":0},{"$f":"VLOOKUP($B105,VysledkyDoplneni!$C$7:$T$126,9,0)","v":0},{"$f":"VLOOKUP($B105,VysledkyDoplneni!$C$7:$T$126,10,0)","v":0},{"$f":"VLOOKUP($B105,VysledkyDoplneni!$C$7:$T$126,11,0)","v":0},{"$f":"VLOOKUP($B105,VysledkyDoplneni!$C$7:$T$126,12,0)","v":0},{"$f":"VLOOKUP($B105,VysledkyDoplneni!$C$7:$T$126,13,0)","v":0},{"$f":"VLOOKUP($B105,VysledkyDoplneni!$C$7:$T$126,14,0)","v":0},{"$f":"VLOOKUP($B105,VysledkyDoplneni!$C$7:$T$126,15,0)","v":0},{"$f":"VLOOKUP($B105,VysledkyDoplneni!$C$7:$T$126,16,0)","v":0},{"$f":"VLOOKUP($B105,VysledkyDoplneni!$C$7:$T$126,17,0)","v":0},{"$f":"VLOOKUP($B105,VysledkyDoplneni!$C$7:$T$126,18,0)","v":0},null,null,0,{"$f":"(V105/(Data!$B$18*X105))","v":{"$error":"#DIV/0!"}},0]
[99,{"$f":"IF(Vstup!C106<>\"\",Vstup!C106,\"\")","v":""},"S",{"$f":"VLOOKUP($B106,VysledkyDoplneni!$C$7:$T$126,3,0)","v":0},{"$f":"VLOOKUP($B106,VysledkyDoplneni!$C$7:$T$126,4,0)","v":0},{"$f":"VLOOKUP($B106,VysledkyDoplneni!$C$7:$T$126,5,0)","v":0},{"$f":"VLOOKUP($B106,VysledkyDoplneni!$C$7:$T$126,6,0)","v":0},{"$f":"VLOOKUP($B106,VysledkyDoplneni!$C$7:$T$126,7,0)","v":0},{"$f":"VLOOKUP($B106,VysledkyDoplneni!$C$7:$T$126,8,0)","v":0},{"$f":"VLOOKUP($B106,VysledkyDoplneni!$C$7:$T$126,9,0)","v":0},{"$f":"VLOOKUP($B106,VysledkyDoplneni!$C$7:$T$126,10,0)","v":0},{"$f":"VLOOKUP($B106,VysledkyDoplneni!$C$7:$T$126,11,0)","v":0},{"$f":"VLOOKUP($B106,VysledkyDoplneni!$C$7:$T$126,12,0)","v":0},{"$f":"VLOOKUP($B106,VysledkyDoplneni!$C$7:$T$126,13,0)","v":0},{"$f":"VLOOKUP($B106,VysledkyDoplneni!$C$7:$T$126,14,0)","v":0},{"$f":"VLOOKUP($B106,VysledkyDoplneni!$C$7:$T$126,15,0)","v":0},{"$f":"VLOOKUP($B106,VysledkyDoplneni!$C$7:$T$126,16,0)","v":0},{"$f":"VLOOKUP($B106,VysledkyDoplneni!$C$7:$T$126,17,0)","v":0},{"$f":"VLOOKUP($B106,VysledkyDoplneni!$C$7:$T$126,18,0)","v":0},null,null,0,{"$f":"(V106/(Data!$B$18*X106))","v":{"$error":"#DIV/0!"}},0]
[100,{"$f":"IF(Vstup!C107<>\"\",Vstup!C107,\"\")","v":""},"S",{"$f":"VLOOKUP($B107,VysledkyDoplneni!$C$7:$T$126,3,0)","v":0},{"$f":"VLOOKUP($B107,VysledkyDoplneni!$C$7:$T$126,4,0)","v":0},{"$f":"VLOOKUP($B107,VysledkyDoplneni!$C$7:$T$126,5,0)","v":0},{"$f":"VLOOKUP($B107,VysledkyDoplneni!$C$7:$T$126,6,0)","v":0},{"$f":"VLOOKUP($B107,VysledkyDoplneni!$C$7:$T$126,7,0)","v":0},{"$f":"VLOOKUP($B107,VysledkyDoplneni!$C$7:$T$126,8,0)","v":0},{"$f":"VLOOKUP($B107,VysledkyDoplneni!$C$7:$T$126,9,0)","v":0},{"$f":"VLOOKUP($B107,VysledkyDoplneni!$C$7:$T$126,10,0)","v":0},{"$f":"VLOOKUP($B107,VysledkyDoplneni!$C$7:$T$126,11,0)","v":0},{"$f":"VLOOKUP($B107,VysledkyDoplneni!$C$7:$T$126,12,0)","v":0},{"$f":"VLOOKUP($B107,VysledkyDoplneni!$C$7:$T$126,13,0)","v":0},{"$f":"VLOOKUP($B107,VysledkyDoplneni!$C$7:$T$126,14,0)","v":0},{"$f":"VLOOKUP($B107,VysledkyDoplneni!$C$7:$T$126,15,0)","v":0},{"$f":"VLOOKUP($B107,VysledkyDoplneni!$C$7:$T$126,16,0)","v":0},{"$f":"VLOOKUP($B107,VysledkyDoplneni!$C$7:$T$126,17,0)","v":0},{"$f":"VLOOKUP($B107,VysledkyDoplneni!$C$7:$T$126,18,0)","v":0},null,null,0,{"$f":"(V107/(Data!$B$18*X107))","v":{"$error":"#DIV/0!"}},0]
[101,{"$f":"IF(Vstup!C108<>\"\",Vstup!C108,\"\")","v":""},"S",{"$f":"VLOOKUP($B108,VysledkyDoplneni!$C$7:$T$126,3,0)","v":0},{"$f":"VLOOKUP($B108,VysledkyDoplneni!$C$7:$T$126,4,0)","v":0},{"$f":"VLOOKUP($B108,VysledkyDoplneni!$C$7:$T$126,5,0)","v":0},{"$f":"VLOOKUP($B108,VysledkyDoplneni!$C$7:$T$126,6,0)","v":0},{"$f":"VLOOKUP($B108,VysledkyDoplneni!$C$7:$T$126,7,0)","v":0},{"$f":"VLOOKUP($B108,VysledkyDoplneni!$C$7:$T$126,8,0)","v":0},{"$f":"VLOOKUP($B108,VysledkyDoplneni!$C$7:$T$126,9,0)","v":0},{"$f":"VLOOKUP($B108,VysledkyDoplneni!$C$7:$T$126,10,0)","v":0},{"$f":"VLOOKUP($B108,VysledkyDoplneni!$C$7:$T$126,11,0)","v":0},{"$f":"VLOOKUP($B108,VysledkyDoplneni!$C$7:$T$126,12,0)","v":0},{"$f":"VLOOKUP($B108,VysledkyDoplneni!$C$7:$T$126,13,0)","v":0},{"$f":"VLOOKUP($B108,VysledkyDoplneni!$C$7:$T$126,14,0)","v":0},{"$f":"VLOOKUP($B108,VysledkyDoplneni!$C$7:$T$126,15,0)","v":0},{"$f":"VLOOKUP($B108,VysledkyDoplneni!$C$7:$T$126,16,0)","v":0},{"$f":"VLOOKUP($B108,VysledkyDoplneni!$C$7:$T$126,17,0)","v":0},{"$f":"VLOOKUP($B108,VysledkyDoplneni!$C$7:$T$126,18,0)","v":0},null,null,0,{"$f":"(V108/(Data!$B$18*X108))","v":{"$error":"#DIV/0!"}},0]
[102,{"$f":"IF(Vstup!C109<>\"\",Vstup!C109,\"\")","v":""},"S",{"$f":"VLOOKUP($B109,VysledkyDoplneni!$C$7:$T$126,3,0)","v":0},{"$f":"VLOOKUP($B109,VysledkyDoplneni!$C$7:$T$126,4,0)","v":0},{"$f":"VLOOKUP($B109,VysledkyDoplneni!$C$7:$T$126,5,0)","v":0},{"$f":"VLOOKUP($B109,VysledkyDoplneni!$C$7:$T$126,6,0)","v":0},{"$f":"VLOOKUP($B109,VysledkyDoplneni!$C$7:$T$126,7,0)","v":0},{"$f":"VLOOKUP($B109,VysledkyDoplneni!$C$7:$T$126,8,0)","v":0},{"$f":"VLOOKUP($B109,VysledkyDoplneni!$C$7:$T$126,9,0)","v":0},{"$f":"VLOOKUP($B109,VysledkyDoplneni!$C$7:$T$126,10,0)","v":0},{"$f":"VLOOKUP($B109,VysledkyDoplneni!$C$7:$T$126,11,0)","v":0},{"$f":"VLOOKUP($B109,VysledkyDoplneni!$C$7:$T$126,12,0)","v":0},{"$f":"VLOOKUP($B109,VysledkyDoplneni!$C$7:$T$126,13,0)","v":0},{"$f":"VLOOKUP($B109,VysledkyDoplneni!$C$7:$T$126,14,0)","v":0},{"$f":"VLOOKUP($B109,VysledkyDoplneni!$C$7:$T$126,15,0)","v":0},{"$f":"VLOOKUP($B109,VysledkyDoplneni!$C$7:$T$126,16,0)","v":0},{"$f":"VLOOKUP($B109,VysledkyDoplneni!$C$7:$T$126,17,0)","v":0},{"$f":"VLOOKUP($B109,VysledkyDoplneni!$C$7:$T$126,18,0)","v":0},null,null,0,{"$f":"(V109/(Data!$B$18*X109))","v":{"$error":"#DIV/0!"}},0]
[103,{"$f":"IF(Vstup!C110<>\"\",Vstup!C110,\"\")","v":""},"S",{"$f":"VLOOKUP($B110,VysledkyDoplneni!$C$7:$T$126,3,0)","v":0},{"$f":"VLOOKUP($B110,VysledkyDoplneni!$C$7:$T$126,4,0)","v":0},{"$f":"VLOOKUP($B110,VysledkyDoplneni!$C$7:$T$126,5,0)","v":0},{"$f":"VLOOKUP($B110,VysledkyDoplneni!$C$7:$T$126,6,0)","v":0},{"$f":"VLOOKUP($B110,VysledkyDoplneni!$C$7:$T$126,7,0)","v":0},{"$f":"VLOOKUP($B110,VysledkyDoplneni!$C$7:$T$126,8,0)","v":0},{"$f":"VLOOKUP($B110,VysledkyDoplneni!$C$7:$T$126,9,0)","v":0},{"$f":"VLOOKUP($B110,VysledkyDoplneni!$C$7:$T$126,10,0)","v":0},{"$f":"VLOOKUP($B110,VysledkyDoplneni!$C$7:$T$126,11,0)","v":0},{"$f":"VLOOKUP($B110,VysledkyDoplneni!$C$7:$T$126,12,0)","v":0},{"$f":"VLOOKUP($B110,VysledkyDoplneni!$C$7:$T$126,13,0)","v":0},{"$f":"VLOOKUP($B110,VysledkyDoplneni!$C$7:$T$126,14,0)","v":0},{"$f":"VLOOKUP($B110,VysledkyDoplneni!$C$7:$T$126,15,0)","v":0},{"$f":"VLOOKUP($B110,VysledkyDoplneni!$C$7:$T$126,16,0)","v":0},{"$f":"VLOOKUP($B110,VysledkyDoplneni!$C$7:$T$126,17,0)","v":0},{"$f":"VLOOKUP($B110,VysledkyDoplneni!$C$7:$T$126,18,0)","v":0},null,null,0,{"$f":"(V110/(Data!$B$18*X110))","v":{"$error":"#DIV/0!"}},0]
[104,{"$f":"IF(Vstup!C111<>\"\",Vstup!C111,\"\")","v":""},"S",{"$f":"VLOOKUP($B111,VysledkyDoplneni!$C$7:$T$126,3,0)","v":0},{"$f":"VLOOKUP($B111,VysledkyDoplneni!$C$7:$T$126,4,0)","v":0},{"$f":"VLOOKUP($B111,VysledkyDoplneni!$C$7:$T$126,5,0)","v":0},{"$f":"VLOOKUP($B111,VysledkyDoplneni!$C$7:$T$126,6,0)","v":0},{"$f":"VLOOKUP($B111,VysledkyDoplneni!$C$7:$T$126,7,0)","v":0},{"$f":"VLOOKUP($B111,VysledkyDoplneni!$C$7:$T$126,8,0)","v":0},{"$f":"VLOOKUP($B111,VysledkyDoplneni!$C$7:$T$126,9,0)","v":0},{"$f":"VLOOKUP($B111,VysledkyDoplneni!$C$7:$T$126,10,0)","v":0},{"$f":"VLOOKUP($B111,VysledkyDoplneni!$C$7:$T$126,11,0)","v":0},{"$f":"VLOOKUP($B111,VysledkyDoplneni!$C$7:$T$126,12,0)","v":0},{"$f":"VLOOKUP($B111,VysledkyDoplneni!$C$7:$T$126,13,0)","v":0},{"$f":"VLOOKUP($B111,VysledkyDoplneni!$C$7:$T$126,14,0)","v":0},{"$f":"VLOOKUP($B111,VysledkyDoplneni!$C$7:$T$126,15,0)","v":0},{"$f":"VLOOKUP($B111,VysledkyDoplneni!$C$7:$T$126,16,0)","v":0},{"$f":"VLOOKUP($B111,VysledkyDoplneni!$C$7:$T$126,17,0)","v":0},{"$f":"VLOOKUP($B111,VysledkyDoplneni!$C$7:$T$126,18,0)","v":0},null,null,0,{"$f":"(V111/(Data!$B$18*X111))","v":{"$error":"#DIV/0!"}},0]
[105,{"$f":"IF(Vstup!C112<>\"\",Vstup!C112,\"\")","v":""},"S",{"$f":"VLOOKUP($B112,VysledkyDoplneni!$C$7:$T$126,3,0)","v":0},{"$f":"VLOOKUP($B112,VysledkyDoplneni!$C$7:$T$126,4,0)","v":0},{"$f":"VLOOKUP($B112,VysledkyDoplneni!$C$7:$T$126,5,0)","v":0},{"$f":"VLOOKUP($B112,VysledkyDoplneni!$C$7:$T$126,6,0)","v":0},{"$f":"VLOOKUP($B112,VysledkyDoplneni!$C$7:$T$126,7,0)","v":0},{"$f":"VLOOKUP($B112,VysledkyDoplneni!$C$7:$T$126,8,0)","v":0},{"$f":"VLOOKUP($B112,VysledkyDoplneni!$C$7:$T$126,9,0)","v":0},{"$f":"VLOOKUP($B112,VysledkyDoplneni!$C$7:$T$126,10,0)","v":0},{"$f":"VLOOKUP($B112,VysledkyDoplneni!$C$7:$T$126,11,0)","v":0},{"$f":"VLOOKUP($B112,VysledkyDoplneni!$C$7:$T$126,12,0)","v":0},{"$f":"VLOOKUP($B112,VysledkyDoplneni!$C$7:$T$126,13,0)","v":0},{"$f":"VLOOKUP($B112,VysledkyDoplneni!$C$7:$T$126,14,0)","v":0},{"$f":"VLOOKUP($B112,VysledkyDoplneni!$C$7:$T$126,15,0)","v":0},{"$f":"VLOOKUP($B112,VysledkyDoplneni!$C$7:$T$126,16,0)","v":0},{"$f":"VLOOKUP($B112,VysledkyDoplneni!$C$7:$T$126,17,0)","v":0},{"$f":"VLOOKUP($B112,VysledkyDoplneni!$C$7:$T$126,18,0)","v":0},null,null,{"$f":"SUM(D112:S112)","v":0},{"$f":"(V112/(Data!$B$18*X112))","v":{"$error":"#DIV/0!"}},0]
[106,{"$f":"IF(Vstup!C113<>\"\",Vstup!C113,\"\")","v":""},"S",{"$f":"VLOOKUP($B113,VysledkyDoplneni!$C$7:$T$126,3,0)","v":0},{"$f":"VLOOKUP($B113,VysledkyDoplneni!$C$7:$T$126,4,0)","v":0},{"$f":"VLOOKUP($B113,VysledkyDoplneni!$C$7:$T$126,5,0)","v":0},{"$f":"VLOOKUP($B113,VysledkyDoplneni!$C$7:$T$126,6,0)","v":0},{"$f":"VLOOKUP($B113,VysledkyDoplneni!$C$7:$T$126,7,0)","v":0},{"$f":"VLOOKUP($B113,VysledkyDoplneni!$C$7:$T$126,8,0)","v":0},{"$f":"VLOOKUP($B113,VysledkyDoplneni!$C$7:$T$126,9,0)","v":0},{"$f":"VLOOKUP($B113,VysledkyDoplneni!$C$7:$T$126,10,0)","v":0},{"$f":"VLOOKUP($B113,VysledkyDoplneni!$C$7:$T$126,11,0)","v":0},{"$f":"VLOOKUP($B113,VysledkyDoplneni!$C$7:$T$126,12,0)","v":0},{"$f":"VLOOKUP($B113,VysledkyDoplneni!$C$7:$T$126,13,0)","v":0},{"$f":"VLOOKUP($B113,VysledkyDoplneni!$C$7:$T$126,14,0)","v":0},{"$f":"VLOOKUP($B113,VysledkyDoplneni!$C$7:$T$126,15,0)","v":0},{"$f":"VLOOKUP($B113,VysledkyDoplneni!$C$7:$T$126,16,0)","v":0},{"$f":"VLOOKUP($B113,VysledkyDoplneni!$C$7:$T$126,17,0)","v":0},{"$f":"VLOOKUP($B113,VysledkyDoplneni!$C$7:$T$126,18,0)","v":0},null,null,0,{"$f":"(V113/(Data!$B$18*X113))","v":{"$error":"#DIV/0!"}},0]
[107,{"$f":"IF(Vstup!C114<>\"\",Vstup!C114,\"\")","v":""},"S",{"$f":"VLOOKUP($B114,VysledkyDoplneni!$C$7:$T$126,3,0)","v":0},{"$f":"VLOOKUP($B114,VysledkyDoplneni!$C$7:$T$126,4,0)","v":0},{"$f":"VLOOKUP($B114,VysledkyDoplneni!$C$7:$T$126,5,0)","v":0},{"$f":"VLOOKUP($B114,VysledkyDoplneni!$C$7:$T$126,6,0)","v":0},{"$f":"VLOOKUP($B114,VysledkyDoplneni!$C$7:$T$126,7,0)","v":0},{"$f":"VLOOKUP($B114,VysledkyDoplneni!$C$7:$T$126,8,0)","v":0},{"$f":"VLOOKUP($B114,VysledkyDoplneni!$C$7:$T$126,9,0)","v":0},{"$f":"VLOOKUP($B114,VysledkyDoplneni!$C$7:$T$126,10,0)","v":0},{"$f":"VLOOKUP($B114,VysledkyDoplneni!$C$7:$T$126,11,0)","v":0},{"$f":"VLOOKUP($B114,VysledkyDoplneni!$C$7:$T$126,12,0)","v":0},{"$f":"VLOOKUP($B114,VysledkyDoplneni!$C$7:$T$126,13,0)","v":0},{"$f":"VLOOKUP($B114,VysledkyDoplneni!$C$7:$T$126,14,0)","v":0},{"$f":"VLOOKUP($B114,VysledkyDoplneni!$C$7:$T$126,15,0)","v":0},{"$f":"VLOOKUP($B114,VysledkyDoplneni!$C$7:$T$126,16,0)","v":0},{"$f":"VLOOKUP($B114,VysledkyDoplneni!$C$7:$T$126,17,0)","v":0},{"$f":"VLOOKUP($B114,VysledkyDoplneni!$C$7:$T$126,18,0)","v":0},null,null,0,{"$f":"(V114/(Data!$B$18*X114))","v":{"$error":"#DIV/0!"}},0]
[108,{"$f":"IF(Vstup!C115<>\"\",Vstup!C115,\"\")","v":""},"S",{"$f":"VLOOKUP($B115,VysledkyDoplneni!$C$7:$T$126,3,0)","v":0},{"$f":"VLOOKUP($B115,VysledkyDoplneni!$C$7:$T$126,4,0)","v":0},{"$f":"VLOOKUP($B115,VysledkyDoplneni!$C$7:$T$126,5,0)","v":0},{"$f":"VLOOKUP($B115,VysledkyDoplneni!$C$7:$T$126,6,0)","v":0},{"$f":"VLOOKUP($B115,VysledkyDoplneni!$C$7:$T$126,7,0)","v":0},{"$f":"VLOOKUP($B115,VysledkyDoplneni!$C$7:$T$126,8,0)","v":0},{"$f":"VLOOKUP($B115,VysledkyDoplneni!$C$7:$T$126,9,0)","v":0},{"$f":"VLOOKUP($B115,VysledkyDoplneni!$C$7:$T$126,10,0)","v":0},{"$f":"VLOOKUP($B115,VysledkyDoplneni!$C$7:$T$126,11,0)","v":0},{"$f":"VLOOKUP($B115,VysledkyDoplneni!$C$7:$T$126,12,0)","v":0},{"$f":"VLOOKUP($B115,VysledkyDoplneni!$C$7:$T$126,13,0)","v":0},{"$f":"VLOOKUP($B115,VysledkyDoplneni!$C$7:$T$126,14,0)","v":0},{"$f":"VLOOKUP($B115,VysledkyDoplneni!$C$7:$T$126,15,0)","v":0},{"$f":"VLOOKUP($B115,VysledkyDoplneni!$C$7:$T$126,16,0)","v":0},{"$f":"VLOOKUP($B115,VysledkyDoplneni!$C$7:$T$126,17,0)","v":0},{"$f":"VLOOKUP($B115,VysledkyDoplneni!$C$7:$T$126,18,0)","v":0},null,null,0,{"$f":"(V115/(Data!$B$18*X115))","v":{"$error":"#DIV/0!"}},0]
[109,{"$f":"IF(Vstup!C116<>\"\",Vstup!C116,\"\")","v":""},"S",{"$f":"VLOOKUP($B116,VysledkyDoplneni!$C$7:$T$126,3,0)","v":0},{"$f":"VLOOKUP($B116,VysledkyDoplneni!$C$7:$T$126,4,0)","v":0},{"$f":"VLOOKUP($B116,VysledkyDoplneni!$C$7:$T$126,5,0)","v":0},{"$f":"VLOOKUP($B116,VysledkyDoplneni!$C$7:$T$126,6,0)","v":0},{"$f":"VLOOKUP($B116,VysledkyDoplneni!$C$7:$T$126,7,0)","v":0},{"$f":"VLOOKUP($B116,VysledkyDoplneni!$C$7:$T$126,8,0)","v":0},{"$f":"VLOOKUP($B116,VysledkyDoplneni!$C$7:$T$126,9,0)","v":0},{"$f":"VLOOKUP($B116,VysledkyDoplneni!$C$7:$T$126,10,0)","v":0},{"$f":"VLOOKUP($B116,VysledkyDoplneni!$C$7:$T$126,11,0)","v":0},{"$f":"VLOOKUP($B116,VysledkyDoplneni!$C$7:$T$126,12,0)","v":0},{"$f":"VLOOKUP($B116,VysledkyDoplneni!$C$7:$T$126,13,0)","v":0},{"$f":"VLOOKUP($B116,VysledkyDoplneni!$C$7:$T$126,14,0)","v":0},{"$f":"VLOOKUP($B116,VysledkyDoplneni!$C$7:$T$126,15,0)","v":0},{"$f":"VLOOKUP($B116,VysledkyDoplneni!$C$7:$T$126,16,0)","v":0},{"$f":"VLOOKUP($B116,VysledkyDoplneni!$C$7:$T$126,17,0)","v":0},{"$f":"VLOOKUP($B116,VysledkyDoplneni!$C$7:$T$126,18,0)","v":0},null,null,0,{"$f":"(V116/(Data!$B$18*X116))","v":{"$error":"#DIV/0!"}},0]
[null,{"$f":"IF(Vstup!C118<>\"\",Vstup!C118,\"\")","v":""},"S",{"$f":"VLOOKUP($B117,VysledkyDoplneni!$C$7:$T$126,3,0)","v":0},{"$f":"VLOOKUP($B117,VysledkyDoplneni!$C$7:$T$126,4,0)","v":0},{"$f":"VLOOKUP($B117,VysledkyDoplneni!$C$7:$T$126,5,0)","v":0},{"$f":"VLOOKUP($B117,VysledkyDoplneni!$C$7:$T$126,6,0)","v":0},{"$f":"VLOOKUP($B117,VysledkyDoplneni!$C$7:$T$126,7,0)","v":0},{"$f":"VLOOKUP($B117,VysledkyDoplneni!$C$7:$T$126,8,0)","v":0},{"$f":"VLOOKUP($B117,VysledkyDoplneni!$C$7:$T$126,9,0)","v":0},{"$f":"VLOOKUP($B117,VysledkyDoplneni!$C$7:$T$126,10,0)","v":0},{"$f":"VLOOKUP($B117,VysledkyDoplneni!$C$7:$T$126,11,0)","v":0},{"$f":"VLOOKUP($B117,VysledkyDoplneni!$C$7:$T$126,12,0)","v":0},{"$f":"VLOOKUP($B117,VysledkyDoplneni!$C$7:$T$126,13,0)","v":0},{"$f":"VLOOKUP($B117,VysledkyDoplneni!$C$7:$T$126,14,0)","v":0},{"$f":"VLOOKUP($B117,VysledkyDoplneni!$C$7:$T$126,15,0)","v":0},{"$f":"VLOOKUP($B117,VysledkyDoplneni!$C$7:$T$126,16,0)","v":0},{"$f":"VLOOKUP($B117,VysledkyDoplneni!$C$7:$T$126,17,0)","v":0},{"$f":"VLOOKUP($B117,VysledkyDoplneni!$C$7:$T$126,18,0)","v":0},null,null,{"$f":"SUM(D117:S117)","v":0},{"$f":"(V117/(Data!$B$18*X117))","v":{"$error":"#DIV/0!"}},0]
[null,{"$f":"IF(Vstup!C119<>\"\",Vstup!C119,\"\")","v":""},"S",{"$f":"VLOOKUP($B118,VysledkyDoplneni!$C$7:$T$126,3,0)","v":0},{"$f":"VLOOKUP($B118,VysledkyDoplneni!$C$7:$T$126,4,0)","v":0},{"$f":"VLOOKUP($B118,VysledkyDoplneni!$C$7:$T$126,5,0)","v":0},{"$f":"VLOOKUP($B118,VysledkyDoplneni!$C$7:$T$126,6,0)","v":0},{"$f":"VLOOKUP($B118,VysledkyDoplneni!$C$7:$T$126,7,0)","v":0},{"$f":"VLOOKUP($B118,VysledkyDoplneni!$C$7:$T$126,8,0)","v":0},{"$f":"VLOOKUP($B118,VysledkyDoplneni!$C$7:$T$126,9,0)","v":0},{"$f":"VLOOKUP($B118,VysledkyDoplneni!$C$7:$T$126,10,0)","v":0},{"$f":"VLOOKUP($B118,VysledkyDoplneni!$C$7:$T$126,11,0)","v":0},{"$f":"VLOOKUP($B118,VysledkyDoplneni!$C$7:$T$126,12,0)","v":0},{"$f":"VLOOKUP($B118,VysledkyDoplneni!$C$7:$T$126,13,0)","v":0},{"$f":"VLOOKUP($B118,VysledkyDoplneni!$C$7:$T$126,14,0)","v":0},{"$f":"VLOOKUP($B118,VysledkyDoplneni!$C$7:$T$126,15,0)","v":0},{"$f":"VLOOKUP($B118,VysledkyDoplneni!$C$7:$T$126,16,0)","v":0},{"$f":"VLOOKUP($B118,VysledkyDoplneni!$C$7:$T$126,17,0)","v":0},{"$f":"VLOOKUP($B118,VysledkyDoplneni!$C$7:$T$126,18,0)","v":0},null,null,0,{"$f":"(V118/(Data!$B$18*X118))","v":{"$error":"#DIV/0!"}},0]
[null,{"$f":"IF(Vstup!C120<>\"\",Vstup!C120,\"\")","v":""},"S",{"$f":"VLOOKUP($B119,VysledkyDoplneni!$C$7:$T$126,3,0)","v":0},{"$f":"VLOOKUP($B119,VysledkyDoplneni!$C$7:$T$126,4,0)","v":0},{"$f":"VLOOKUP($B119,VysledkyDoplneni!$C$7:$T$126,5,0)","v":0},{"$f":"VLOOKUP($B119,VysledkyDoplneni!$C$7:$T$126,6,0)","v":0},{"$f":"VLOOKUP($B119,VysledkyDoplneni!$C$7:$T$126,7,0)","v":0},{"$f":"VLOOKUP($B119,VysledkyDoplneni!$C$7:$T$126,8,0)","v":0},{"$f":"VLOOKUP($B119,VysledkyDoplneni!$C$7:$T$126,9,0)","v":0},{"$f":"VLOOKUP($B119,VysledkyDoplneni!$C$7:$T$126,10,0)","v":0},{"$f":"VLOOKUP($B119,VysledkyDoplneni!$C$7:$T$126,11,0)","v":0},{"$f":"VLOOKUP($B119,VysledkyDoplneni!$C$7:$T$126,12,0)","v":0},{"$f":"VLOOKUP($B119,VysledkyDoplneni!$C$7:$T$126,13,0)","v":0},{"$f":"VLOOKUP($B119,VysledkyDoplneni!$C$7:$T$126,14,0)","v":0},{"$f":"VLOOKUP($B119,VysledkyDoplneni!$C$7:$T$126,15,0)","v":0},{"$f":"VLOOKUP($B119,VysledkyDoplneni!$C$7:$T$126,16,0)","v":0},{"$f":"VLOOKUP($B119,VysledkyDoplneni!$C$7:$T$126,17,0)","v":0},{"$f":"VLOOKUP($B119,VysledkyDoplneni!$C$7:$T$126,18,0)","v":0},null,null,0,{"$f":"(V119/(Data!$B$18*X119))","v":{"$error":"#DIV/0!"}},0]
[null,{"$f":"IF(Vstup!C121<>\"\",Vstup!C121,\"\")","v":""},"S",{"$f":"VLOOKUP($B120,VysledkyDoplneni!$C$7:$T$126,3,0)","v":0},{"$f":"VLOOKUP($B120,VysledkyDoplneni!$C$7:$T$126,4,0)","v":0},{"$f":"VLOOKUP($B120,VysledkyDoplneni!$C$7:$T$126,5,0)","v":0},{"$f":"VLOOKUP($B120,VysledkyDoplneni!$C$7:$T$126,6,0)","v":0},{"$f":"VLOOKUP($B120,VysledkyDoplneni!$C$7:$T$126,7,0)","v":0},{"$f":"VLOOKUP($B120,VysledkyDoplneni!$C$7:$T$126,8,0)","v":0},{"$f":"VLOOKUP($B120,VysledkyDoplneni!$C$7:$T$126,9,0)","v":0},{"$f":"VLOOKUP($B120,VysledkyDoplneni!$C$7:$T$126,10,0)","v":0},{"$f":"VLOOKUP($B120,VysledkyDoplneni!$C$7:$T$126,11,0)","v":0},{"$f":"VLOOKUP($B120,VysledkyDoplneni!$C$7:$T$126,12,0)","v":0},{"$f":"VLOOKUP($B120,VysledkyDoplneni!$C$7:$T$126,13,0)","v":0},{"$f":"VLOOKUP($B120,VysledkyDoplneni!$C$7:$T$126,14,0)","v":0},{"$f":"VLOOKUP($B120,VysledkyDoplneni!$C$7:$T$126,15,0)","v":0},{"$f":"VLOOKUP($B120,VysledkyDoplneni!$C$7:$T$126,16,0)","v":0},{"$f":"VLOOKUP($B120,VysledkyDoplneni!$C$7:$T$126,17,0)","v":0},{"$f":"VLOOKUP($B120,VysledkyDoplneni!$C$7:$T$126,18,0)","v":0},null,null,0,{"$f":"(V120/(Data!$B$18*X120))","v":{"$error":"#DIV/0!"}},0]
[null,{"$f":"IF(Vstup!C122<>\"\",Vstup!C122,\"\")","v":""},"S",{"$f":"VLOOKUP($B121,VysledkyDoplneni!$C$7:$T$126,3,0)","v":0},{"$f":"VLOOKUP($B121,VysledkyDoplneni!$C$7:$T$126,4,0)","v":0},{"$f":"VLOOKUP($B121,VysledkyDoplneni!$C$7:$T$126,5,0)","v":0},{"$f":"VLOOKUP($B121,VysledkyDoplneni!$C$7:$T$126,6,0)","v":0},{"$f":"VLOOKUP($B121,VysledkyDoplneni!$C$7:$T$126,7,0)","v":0},{"$f":"VLOOKUP($B121,VysledkyDoplneni!$C$7:$T$126,8,0)","v":0},{"$f":"VLOOKUP($B121,VysledkyDoplneni!$C$7:$T$126,9,0)","v":0},{"$f":"VLOOKUP($B121,VysledkyDoplneni!$C$7:$T$126,10,0)","v":0},{"$f":"VLOOKUP($B121,VysledkyDoplneni!$C$7:$T$126,11,0)","v":0},{"$f":"VLOOKUP($B121,VysledkyDoplneni!$C$7:$T$126,12,0)","v":0},{"$f":"VLOOKUP($B121,VysledkyDoplneni!$C$7:$T$126,13,0)","v":0},{"$f":"VLOOKUP($B121,VysledkyDoplneni!$C$7:$T$126,14,0)","v":0},{"$f":"VLOOKUP($B121,VysledkyDoplneni!$C$7:$T$126,15,0)","v":0},{"$f":"VLOOKUP($B121,VysledkyDoplneni!$C$7:$T$126,16,0)","v":0},{"$f":"VLOOKUP($B121,VysledkyDoplneni!$C$7:$T$126,17,0)","v":0},{"$f":"VLOOKUP($B121,VysledkyDoplneni!$C$7:$T$126,18,0)","v":0},null,null,0,{"$f":"(V121/(Data!$B$18*X121))","v":{"$error":"#DIV/0!"}},0]
[null,{"$f":"IF(Vstup!C123<>\"\",Vstup!C123,\"\")","v":""},"S",{"$f":"VLOOKUP($B122,VysledkyDoplneni!$C$7:$T$126,3,0)","v":0},{"$f":"VLOOKUP($B122,VysledkyDoplneni!$C$7:$T$126,4,0)","v":0},{"$f":"VLOOKUP($B122,VysledkyDoplneni!$C$7:$T$126,5,0)","v":0},{"$f":"VLOOKUP($B122,VysledkyDoplneni!$C$7:$T$126,6,0)","v":0},{"$f":"VLOOKUP($B122,VysledkyDoplneni!$C$7:$T$126,7,0)","v":0},{"$f":"VLOOKUP($B122,VysledkyDoplneni!$C$7:$T$126,8,0)","v":0},{"$f":"VLOOKUP($B122,VysledkyDoplneni!$C$7:$T$126,9,0)","v":0},{"$f":"VLOOKUP($B122,VysledkyDoplneni!$C$7:$T$126,10,0)","v":0},{"$f":"VLOOKUP($B122,VysledkyDoplneni!$C$7:$T$126,11,0)","v":0},{"$f":"VLOOKUP($B122,VysledkyDoplneni!$C$7:$T$126,12,0)","v":0},{"$f":"VLOOKUP($B122,VysledkyDoplneni!$C$7:$T$126,13,0)","v":0},{"$f":"VLOOKUP($B122,VysledkyDoplneni!$C$7:$T$126,14,0)","v":0},{"$f":"VLOOKUP($B122,VysledkyDoplneni!$C$7:$T$126,15,0)","v":0},{"$f":"VLOOKUP($B122,VysledkyDoplneni!$C$7:$T$126,16,0)","v":0},{"$f":"VLOOKUP($B122,VysledkyDoplneni!$C$7:$T$126,17,0)","v":0},{"$f":"VLOOKUP($B122,VysledkyDoplneni!$C$7:$T$126,18,0)","v":0},null,null,0,{"$f":"(V122/(Data!$B$18*X122))","v":{"$error":"#DIV/0!"}},0]
[null,{"$f":"IF(Vstup!C124<>\"\",Vstup!C124,\"\")","v":""},{"$f":"IF(Vstup!C124<>\"\",Vstup!D124,\"\")","v":""},{"$f":"VLOOKUP($B123,VysledkyDoplneni!$C$7:$T$126,3,0)","v":0},{"$f":"VLOOKUP($B123,VysledkyDoplneni!$C$7:$T$126,4,0)","v":0},{"$f":"VLOOKUP($B123,VysledkyDoplneni!$C$7:$T$126,5,0)","v":0},{"$f":"VLOOKUP($B123,VysledkyDoplneni!$C$7:$T$126,6,0)","v":0},{"$f":"VLOOKUP($B123,VysledkyDoplneni!$C$7:$T$126,7,0)","v":0},{"$f":"VLOOKUP($B123,VysledkyDoplneni!$C$7:$T$126,8,0)","v":0},{"$f":"VLOOKUP($B123,VysledkyDoplneni!$C$7:$T$126,9,0)","v":0},{"$f":"VLOOKUP($B123,VysledkyDoplneni!$C$7:$T$126,10,0)","v":0},{"$f":"VLOOKUP($B123,VysledkyDoplneni!$C$7:$T$126,11,0)","v":0},{"$f":"VLOOKUP($B123,VysledkyDoplneni!$C$7:$T$126,12,0)","v":0},{"$f":"VLOOKUP($B123,VysledkyDoplneni!$C$7:$T$126,13,0)","v":0},{"$f":"VLOOKUP($B123,VysledkyDoplneni!$C$7:$T$126,14,0)","v":0},{"$f":"VLOOKUP($B123,VysledkyDoplneni!$C$7:$T$126,15,0)","v":0},{"$f":"VLOOKUP($B123,VysledkyDoplneni!$C$7:$T$126,16,0)","v":0},{"$f":"VLOOKUP($B123,VysledkyDoplneni!$C$7:$T$126,17,0)","v":0},{"$f":"VLOOKUP($B123,VysledkyDoplneni!$C$7:$T$126,18,0)","v":0},null,null,0,{"$f":"(V123/(Data!$B$18*X123))","v":{"$error":"#DIV/0!"}},0]
[null,{"$f":"IF(Vstup!C125<>\"\",Vstup!C125,\"\")","v":""},{"$f":"IF(Vstup!C125<>\"\",Vstup!D125,\"\")","v":""},{"$f":"VLOOKUP($B124,VysledkyDoplneni!$C$7:$T$126,3,0)","v":0},{"$f":"VLOOKUP($B124,VysledkyDoplneni!$C$7:$T$126,4,0)","v":0},{"$f":"VLOOKUP($B124,VysledkyDoplneni!$C$7:$T$126,5,0)","v":0},{"$f":"VLOOKUP($B124,VysledkyDoplneni!$C$7:$T$126,6,0)","v":0},{"$f":"VLOOKUP($B124,VysledkyDoplneni!$C$7:$T$126,7,0)","v":0},{"$f":"VLOOKUP($B124,VysledkyDoplneni!$C$7:$T$126,8,0)","v":0},{"$f":"VLOOKUP($B124,VysledkyDoplneni!$C$7:$T$126,9,0)","v":0},{"$f":"VLOOKUP($B124,VysledkyDoplneni!$C$7:$T$126,10,0)","v":0},{"$f":"VLOOKUP($B124,VysledkyDoplneni!$C$7:$T$126,11,0)","v":0},{"$f":"VLOOKUP($B124,VysledkyDoplneni!$C$7:$T$126,12,0)","v":0},{"$f":"VLOOKUP($B124,VysledkyDoplneni!$C$7:$T$126,13,0)","v":0},{"$f":"VLOOKUP($B124,VysledkyDoplneni!$C$7:$T$126,14,0)","v":0},{"$f":"VLOOKUP($B124,VysledkyDoplneni!$C$7:$T$126,15,0)","v":0},{"$f":"VLOOKUP($B124,VysledkyDoplneni!$C$7:$T$126,16,0)","v":0},{"$f":"VLOOKUP($B124,VysledkyDoplneni!$C$7:$T$126,17,0)","v":0},{"$f":"VLOOKUP($B124,VysledkyDoplneni!$C$7:$T$126,18,0)","v":0},null,null,0,{"$f":"(V124/(Data!$B$18*X124))","v":{"$error":"#DIV/0!"}},0]
[null,{"$f":"IF(Vstup!C126<>\"\",Vstup!C126,\"\")","v":""},{"$f":"IF(Vstup!C126<>\"\",Vstup!D126,\"\")","v":""},{"$f":"VLOOKUP($B125,VysledkyDoplneni!$C$7:$T$126,3,0)","v":0},{"$f":"VLOOKUP($B125,VysledkyDoplneni!$C$7:$T$126,4,0)","v":0},{"$f":"VLOOKUP($B125,VysledkyDoplneni!$C$7:$T$126,5,0)","v":0},{"$f":"VLOOKUP($B125,VysledkyDoplneni!$C$7:$T$126,6,0)","v":0},{"$f":"VLOOKUP($B125,VysledkyDoplneni!$C$7:$T$126,7,0)","v":0},{"$f":"VLOOKUP($B125,VysledkyDoplneni!$C$7:$T$126,8,0)","v":0},{"$f":"VLOOKUP($B125,VysledkyDoplneni!$C$7:$T$126,9,0)","v":0},{"$f":"VLOOKUP($B125,VysledkyDoplneni!$C$7:$T$126,10,0)","v":0},{"$f":"VLOOKUP($B125,VysledkyDoplneni!$C$7:$T$126,11,0)","v":0},{"$f":"VLOOKUP($B125,VysledkyDoplneni!$C$7:$T$126,12,0)","v":0},{"$f":"VLOOKUP($B125,VysledkyDoplneni!$C$7:$T$126,13,0)","v":0},{"$f":"VLOOKUP($B125,VysledkyDoplneni!$C$7:$T$126,14,0)","v":0},{"$f":"VLOOKUP($B125,VysledkyDoplneni!$C$7:$T$126,15,0)","v":0},{"$f":"VLOOKUP($B125,VysledkyDoplneni!$C$7:$T$126,16,0)","v":0},{"$f":"VLOOKUP($B125,VysledkyDoplneni!$C$7:$T$126,17,0)","v":0},{"$f":"VLOOKUP($B125,VysledkyDoplneni!$C$7:$T$126,18,0)","v":0},null,null,0,{"$f":"(V125/(Data!$B$18*X125))","v":{"$error":"#DIV/0!"}},0]
[null,{"$f":"IF(Vstup!C127<>\"\",Vstup!C127,\"\")","v":""},{"$f":"IF(Vstup!C127<>\"\",Vstup!D127,\"\")","v":""},{"$f":"VLOOKUP($B126,VysledkyDoplneni!$C$7:$T$126,3,0)","v":0},{"$f":"VLOOKUP($B126,VysledkyDoplneni!$C$7:$T$126,4,0)","v":0},{"$f":"VLOOKUP($B126,VysledkyDoplneni!$C$7:$T$126,5,0)","v":0},{"$f":"VLOOKUP($B126,VysledkyDoplneni!$C$7:$T$126,6,0)","v":0},{"$f":"VLOOKUP($B126,VysledkyDoplneni!$C$7:$T$126,7,0)","v":0},{"$f":"VLOOKUP($B126,VysledkyDoplneni!$C$7:$T$126,8,0)","v":0},{"$f":"VLOOKUP($B126,VysledkyDoplneni!$C$7:$T$126,9,0)","v":0},{"$f":"VLOOKUP($B126,VysledkyDoplneni!$C$7:$T$126,10,0)","v":0},{"$f":"VLOOKUP($B126,VysledkyDoplneni!$C$7:$T$126,11,0)","v":0},{"$f":"VLOOKUP($B126,VysledkyDoplneni!$C$7:$T$126,12,0)","v":0},{"$f":"VLOOKUP($B126,VysledkyDoplneni!$C$7:$T$126,13,0)","v":0},{"$f":"VLOOKUP($B126,VysledkyDoplneni!$C$7:$T$126,14,0)","v":0},{"$f":"VLOOKUP($B126,VysledkyDoplneni!$C$7:$T$126,15,0)","v":0},{"$f":"VLOOKUP($B126,VysledkyDoplneni!$C$7:$T$126,16,0)","v":0},{"$f":"VLOOKUP($B126,VysledkyDoplneni!$C$7:$T$126,17,0)","v":0},{"$f":"VLOOKUP($B126,VysledkyDoplneni!$C$7:$T$126,18,0)","v":0},null,null,0,{"$f":"(V126/(Data!$B$18*X126))","v":{"$error":"#DIV/0!"}},0]
[null,{"$f":"IF(Vstup!C128<>\"\",Vstup!C128,\"\")","v":""},{"$f":"IF(Vstup!C128<>\"\",Vstup!D128,\"\")","v":""},{"$f":"VLOOKUP($B127,VysledkyDoplneni!$C$7:$T$126,3,0)","v":0},{"$f":"VLOOKUP($B127,VysledkyDoplneni!$C$7:$T$126,4,0)","v":0},{"$f":"VLOOKUP($B127,VysledkyDoplneni!$C$7:$T$126,5,0)","v":0},{"$f":"VLOOKUP($B127,VysledkyDoplneni!$C$7:$T$126,6,0)","v":0},{"$f":"VLOOKUP($B127,VysledkyDoplneni!$C$7:$T$126,7,0)","v":0},{"$f":"VLOOKUP($B127,VysledkyDoplneni!$C$7:$T$126,8,0)","v":0},{"$f":"VLOOKUP($B127,VysledkyDoplneni!$C$7:$T$126,9,0)","v":0},{"$f":"VLOOKUP($B127,VysledkyDoplneni!$C$7:$T$126,10,0)","v":0},{"$f":"VLOOKUP($B127,VysledkyDoplneni!$C$7:$T$126,11,0)","v":0},{"$f":"VLOOKUP($B127,VysledkyDoplneni!$C$7:$T$126,12,0)","v":0},{"$f":"VLOOKUP($B127,VysledkyDoplneni!$C$7:$T$126,13,0)","v":0},{"$f":"VLOOKUP($B127,VysledkyDoplneni!$C$7:$T$126,14,0)","v":0},{"$f":"VLOOKUP($B127,VysledkyDoplneni!$C$7:$T$126,15,0)","v":0},{"$f":"VLOOKUP($B127,VysledkyDoplneni!$C$7:$T$126,16,0)","v":0},{"$f":"VLOOKUP($B127,VysledkyDoplneni!$C$7:$T$126,17,0)","v":0},{"$f":"VLOOKUP($B127,VysledkyDoplneni!$C$7:$T$126,18,0)","v":0},null,null,0,{"$f":"(V127/(Data!$B$18*X127))","v":{"$error":"#DIV/0!"}},0]
[{"$nulls":3},{"$f":"SUM(D8:D127)/(COUNTIF(D8:D127,\">0\")*Data!$B$18)","v":{"v":0.6552083333333333,"d":"65.5%"}},{"$f":"SUM(E8:E127)/(COUNTIF(E8:E127,\">0\")*Data!$B$18)","v":{"v":0.6697916666666667,"d":"67.0%"}},{"$f":"SUM(F8:F127)/(COUNTIF(F8:F127,\">0\")*Data!$B$18)","v":{"v":0.703125,"d":"70.3%"}},{"$f":"SUM(G8:G127)/(COUNTIF(G8:G127,\">0\")*Data!$B$18)","v":{"$error":"#DIV/0!"}},{"$f":"SUM(H8:H127)/(COUNTIF(H8:H127,\">0\")*Data!$B$18)","v":{"$error":"#DIV/0!"}},{"$f":"SUM(I8:I127)/(COUNTIF(I8:I127,\">0\")*Data!$B$18)","v":{"$error":"#DIV/0!"}},{"$f":"SUM(J8:J127)/(COUNTIF(J8:J127,\">0\")*Data!$B$18)","v":{"$error":"#DIV/0!"}},{"$f":"SUM(K8:K127)/(COUNTIF(K8:K127,\">0\")*Data!$B$18)","v":{"$error":"#DIV/0!"}},{"$f":"SUM(L8:L127)/(COUNTIF(L8:L127,\">0\")*Data!$B$18)","v":{"$error":"#DIV/0!"}},{"$f":"SUM(M8:M127)/(COUNTIF(M8:M127,\">0\")*Data!$B$18)","v":{"$error":"#DIV/0!"}},{"$f":"SUM(N8:N127)/(COUNTIF(N8:N127,\">0\")*Data!$B$18)","v":{"$error":"#DIV/0!"}},{"$f":"SUM(O8:O127)/(COUNTIF(O8:O127,\">0\")*Data!$B$18)","v":{"$error":"#DIV/0!"}},{"$f":"SUM(P8:P127)/(COUNTIF(P8:P127,\">0\")*Data!$B$18)","v":{"$error":"#DIV/0!"}},{"$f":"SUM(Q8:Q127)/(COUNTIF(Q8:Q127,\">0\")*Data!$B$18)","v":{"$error":"#DIV/0!"}},{"$f":"SUM(R8:R127)/(COUNTIF(R8:R127,\">0\")*Data!$B$18)","v":{"$error":"#DIV/0!"}},{"$f":"SUM(S8:S127)/(COUNTIF(S8:S127,\">0\")*Data!$B$18)","v":{"$error":"#DIV/0!"}}]

{"sheet":"Sk1","index":7,"n_rows":32,"n_cols":37,"rows_kept":32,"hidden":true,"merged":[[1,0,1,36],[2,0,2,36],[3,0,3,36],[5,0,5,1],[5,5,5,8],[5,9,5,34],[5,35,6,35],[5,36,6,36],[6,1,6,3],[6,5,6,34],[7,0,10,0],[7,1,10,3],[7,4,10,4],[7,35,10,35],[7,36,10,36],[8,5,10,5],[8,6,10,6],[8,7,10,7],[8,8,10,8],[8,9,10,9],[8,10,10,10],[8,11,10,11],[8,12,10,12],[8,13,10,13],[8,14,10,14],[8,15,10,15],[8,16,10,16],[8,17,10,17],[8,18,10,18],[8,19,10,19],[8,20,10,20],[8,21,10,21],[8,22,10,22],[8,23,10,23],[8,24,10,24],[11,0,14,0],[11,1,14,3],[11,4,14,4],[11,35,14,35],[11,36,14,36],[12,5,14,5],[12,6,14,6],[12,7,14,7],[12,8,14,8],[12,9,14,9],[12,10,14,10],[12,11,14,11],[12,12,14,12],[12,13,14,13],[12,14,14,14],[12,15,14,15],[12,16,14,16],[12,17,14,17],[12,18,14,18],[12,19,14,19],[12,20,14,20],[12,21,14,21],[12,22,14,22],[12,23,14,23],[12,24,14,24],[15,0,18,0],[15,1,18,3],[15,4,18,4],[15,35,18,35],[15,36,18,36],[16,5,18,5],[16,6,18,6],[16,7,18,7],[16,8,18,8],[16,9,18,9],[16,10,18,10],[16,11,18,11],[16,12,18,12],[16,13,18,13],[16,14,18,14],[16,15,18,15],[16,16,18,16],[16,17,18,17],[16,18,18,18],[16,19,18,19],[16,20,18,20],[16,21,18,21],[16,22,18,22],[16,23,18,23],[16,24,18,24],[19,0,22,0],[19,1,22,3],[19,4,22,4],[19,35,22,35],[19,36,22,36],[20,5,22,5],[20,6,22,6],[20,7,22,7],[20,8,22,8],[20,9,22,9],[20,10,22,10],[20,11,22,11],[20,12,22,12],[20,13,22,13],[20,14,22,14],[20,15,22,15],[20,16,22,16],[20,17,22,17],[20,18,22,18],[20,19,22,19],[20,20,22,20],[20,21,22,21],[20,22,22,22],[20,23,22,23],[20,24,22,24],[23,0,26,0],[23,1,26,3],[23,4,26,4],[23,35,26,35],[23,36,26,36],[24,5,26,5],[24,6,26,6],[24,7,26,7],[24,8,26,8],[24,9,26,9],[24,10,26,10],[24,11,26,11],[24,12,26,12],[24,13,26,13],[24,14,26,14],[24,15,26,15],[24,16,26,16],[24,17,26,17],[24,18,26,18],[24,19,26,19],[24,20,26,20],[24,21,26,21],[24,22,26,22],[24,23,26,23],[24,24,26,24],[27,0,30,0],[27,1,30,3],[27,4,30,4],[27,35,30,35],[27,36,30,36],[28,5,30,5],[28,6,30,6],[28,7,30,7],[28,8,30,8],[28,9,30,9],[28,10,30,10],[28,11,30,11],[28,12,30,12],[28,13,30,13],[28,14,30,14],[28,15,30,15],[28,16,30,16],[28,17,30,17],[28,18,30,18],[28,19,30,19],[28,20,30,20],[28,21,30,21],[28,22,30,22],[28,23,30,23],[28,24,30,24],[31,0,31,4]]}
[]
["POLOŽKOVÝ LIST                                                                                      "]
[{"$f":"Vstup!$C$2&IF(Vstup!$C$3<>\"\",\", \"&Vstup!$C$3,\"\")","v":"Josefovský brokový trojboj, 60 TERČŮ"}]
[{"$f":"Vstup!$C$4&\", \"&Vstup!$C$5","v":"SPORTING, 20.03.2022"}]
[]
["Skupina: ",null,1,"Kolo :",1,"Rozhodčí:",{"$nulls":3},"____________________________________________________________________________________________",{"$nulls":25},"∑","Podpis"]
["St. č.","Příjmení, jméno",null,null,"Kat.","Terče"]
[1,"Štenglová Michaela",null,null,"S",20,19,18,17,16,15,14,13,12,11,10,9,8,7,6,5,4,3,2,1]
[]
[]
[]
[2,"Vaněk Matěj",null,null,"S",20,19,18,17,16,15,14,13,12,11,10,9,8,7,6,5,4,3,2,1]
[]
[]
[]
[3,"Veltruský Jiří",null,null,"S",20,19,18,17,16,15,14,13,12,11,10,9,8,7,6,5,4,3,2,1]
[]
[]
[]
[4,"Černý Bohuslav",null,null,"S",20,19,18,17,16,15,14,13,12,11,10,9,8,7,6,5,4,3,2,1]
[]
[]
[]
[5,"Šindelář Jiří st.",null,null,"S",20,19,18,17,16,15,14,13,12,11,10,9,8,7,6,5,4,3,2,1]
[]
[]
[]
[6,"Mařík Josef",null,null,"S",20,19,18,17,16,15,14,13,12,11,10,9,8,7,6,5,4,3,2,1]
[]
[]
[]
["Poznámky:"]

{"sheet":"Sk2","index":8,"n_rows":32,"n_cols":37,"rows_kept":32,"hidden":true,"merged":[[1,0,1,36],[2,0,2,36],[3,0,3,36],[5,0,5,1],[5,5,5,8],[5,9,5,34],[5,35,6,35],[5,36,6,36],[6,1,6,3],[6,5,6,34],[7,0,10,0],[7,1,10,3],[7,4,10,4],[7,35,10,35],[7,36,10,36],[8,5,10,5],[8,6,10,6],[8,7,10,7],[8,8,10,8],[8,9,10,9],[8,10,10,10],[8,11,10,11],[8,12,10,12],[8,13,10,13],[8,14,10,14],[8,15,10,15],[8,16,10,16],[8,17,10,17],[8,18,10,18],[8,19,10,19],[8,20,10,20],[8,21,10,21],[8,22,10,22],[8,23,10,23],[8,24,10,24],[11,0,14,0],[11,1,14,3],[11,4,14,4],[11,35,14,35],[11,36,14,36],[12,5,14,5],[12,6,14,6],[12,7,14,7],[12,8,14,8],[12,9,14,9],[12,10,14,10],[12,11,14,11],[12,12,14,12],[12,13,14,13],[12,14,14,14],[12,15,14,15],[12,16,14,16],[12,17,14,17],[12,18,14,18],[12,19,14,19],[12,20,14,20],[12,21,14,21],[12,22,14,22],[12,23,14,23],[12,24,14,24],[15,0,18,0],[15,1,18,3],[15,4,18,4],[15,35,18,35],[15,36,18,36],[16,5,18,5],[16,6,18,6],[16,7,18,7],[16,8,18,8],[16,9,18,9],[16,10,18,10],[16,11,18,11],[16,12,18,12],[16,13,18,13],[16,14,18,14],[16,15,18,15],[16,16,18,16],[16,17,18,17],[16,18,18,18],[16,19,18,19],[16,20,18,20],[16,21,18,21],[16,22,18,22],[16,23,18,23],[16,24,18,24],[19,0,22,0],[19,1,22,3],[19,4,22,4],[19,35,22,35],[19,36,22,36],[20,5,22,5],[20,6,22,6],[20,7,22,7],[20,8,22,8],[20,9,22,9],[20,10,22,10],[20,11,22,11],[20,12,22,12],[20,13,22,13],[20,14,22,14],[20,15,22,15],[20,16,22,16],[20,17,22,17],[20,18,22,18],[20,19,22,19],[20,20,22,20],[20,21,22,21],[20,22,22,22],[20,23,22,23],[20,24,22,24],[23,0,26,0],[23,1,26,3],[23,4,26,4],[23,35,26,35],[23,36,26,36],[24,5,26,5],[24,6,26,6],[24,7,26,7],[24,8,26,8],[24,9,26,9],[24,10,26,10],[24,11,26,11],[24,12,26,12],[24,13,26,13],[24,14,26,14],[24,15,26,15],[24,16,26,16],[24,17,26,17],[24,18,26,18],[24,19,26,19],[24,20,26,20],[24,21,26,21],[24,22,26,22],[24,23,26,23],[24,24,26,24],[27,0,30,0],[27,1,30,3],[27,4,30,4],[27,35,30,35],[27,36,30,36],[28,5,30,5],[28,6,30,6],[28,7,30,7],[28,8,30,8],[28,9,30,9],[28,10,30,10],[28,11,30,11],[28,12,30,12],[28,13,30,13],[28,14,30,14],[28,15,30,15],[28,16,30,16],[28,17,30,17],[28,18,30,18],[28,19,30,19],[28,20,30,20],[28,21,30,21],[28,22,30,22],[28,23,30,23],[28,24,30,24],[31,0,31,4]]}
[]
["POLOŽKOVÝ LIST                                                                                      "]
[{"$f":"Vstup!C2&IF(Vstup!C3<>\"\",\", \"&Vstup!C3,\"\")","v":"Josefovský brokový trojboj, 60 TERČŮ"}]
[{"$f":"Vstup!C4&\", \"&Vstup!C5","v":"SPORTING, 20.03.2022"}]
[]
["Skupina: ",null,2,"Kolo :",1,"Rozhodčí:",{"$nulls":3},"____________________________________________________________________________________________",{"$nulls":25},"∑","Podpis"]
["St. č.","Příjmení, jméno",null,null,"Kat.","Terče"]
[7,"Lízalová Veronika",null,null,"S",20,19,18,17,16,15,14,13,12,11,10,9,8,7,6,5,4,3,2,1]
[]
[]
[]
[8,"Lízal Miroslav ml.",null,null,"S",20,19,18,17,16,15,14,13,12,11,10,9,8,7,6,5,4,3,2,1]
[]
[]
[]
[9,"Kondr Václav",null,null,"S",20,19,18,17,16,15,14,13,12,11,10,9,8,7,6,5,4,3,2,1]
[]
[]
[]
[10,"Frenkl Jiří",null,null,"S",20,19,18,17,16,15,14,13,12,11,10,9,8,7,6,5,4,3,2,1]
[]
[]
[]
[11,"Adámek Bohuslav",null,null,"S",20,19,18,17,16,15,14,13,12,11,10,9,8,7,6,5,4,3,2,1]
[]
[]
[]
[12,"Urban Josef",null,null,"S",20,19,18,17,16,15,14,13,12,11,10,9,8,7,6,5,4,3,2,1]
[]
[]
[]
["Poznámky:"]

{"sheet":"Sk3","index":9,"n_rows":32,"n_cols":37,"rows_kept":32,"hidden":true,"merged":[[1,0,1,36],[2,0,2,36],[3,0,3,36],[5,0,5,1],[5,5,5,8],[5,9,5,34],[5,35,6,35],[5,36,6,36],[6,1,6,3],[6,5,6,34],[7,0,10,0],[7,1,10,3],[7,4,10,4],[7,35,10,35],[7,36,10,36],[8,5,10,5],[8,6,10,6],[8,7,10,7],[8,8,10,8],[8,9,10,9],[8,10,10,10],[8,11,10,11],[8,12,10,12],[8,13,10,13],[8,14,10,14],[8,15,10,15],[8,16,10,16],[8,17,10,17],[8,18,10,18],[8,19,10,19],[8,20,10,20],[8,21,10,21],[8,22,10,22],[8,23,10,23],[8,24,10,24],[11,0,14,0],[11,1,14,3],[11,4,14,4],[11,35,14,35],[11,36,14,36],[12,5,14,5],[12,6,14,6],[12,7,14,7],[12,8,14,8],[12,9,14,9],[12,10,14,10],[12,11,14,11],[12,12,14,12],[12,13,14,13],[12,14,14,14],[12,15,14,15],[12,16,14,16],[12,17,14,17],[12,18,14,18],[12,19,14,19],[12,20,14,20],[12,21,14,21],[12,22,14,22],[12,23,14,23],[12,24,14,24],[15,0,18,0],[15,1,18,3],[15,4,18,4],[15,35,18,35],[15,36,18,36],[16,5,18,5],[16,6,18,6],[16,7,18,7],[16,8,18,8],[16,9,18,9],[16,10,18,10],[16,11,18,11],[16,12,18,12],[16,13,18,13],[16,14,18,14],[16,15,18,15],[16,16,18,16],[16,17,18,17],[16,18,18,18],[16,19,18,19],[16,20,18,20],[16,21,18,21],[16,22,18,22],[16,23,18,23],[16,24,18,24],[19,0,22,0],[19,1,22,3],[19,4,22,4],[19,35,22,35],[19,36,22,36],[20,5,22,5],[20,6,22,6],[20,7,22,7],[20,8,22,8],[20,9,22,9],[20,10,22,10],[20,11,22,11],[20,12,22,12],[20,13,22,13],[20,14,22,14],[20,15,22,15],[20,16,22,16],[20,17,22,17],[20,18,22,18],[20,19,22,19],[20,20,22,20],[20,21,22,21],[20,22,22,22],[20,23,22,23],[20,24,22,24],[23,0,26,0],[23,1,26,3],[23,4,26,4],[23,35,26,35],[23,36,26,36],[24,5,26,5],[24,6,26,6],[24,7,26,7],[24,8,26,8],[24,9,26,9],[24,10,26,10],[24,11,26,11],[24,12,26,12],[24,13,26,13],[24,14,26,14],[24,15,26,15],[24,16,26,16],[24,17,26,17],[24,18,26,18],[24,19,26,19],[24,20,26,20],[24,21,26,21],[24,22,26,22],[24,23,26,23],[24,24,26,24],[27,0,30,0],[27,1,30,3],[27,4,30,4],[27,35,30,35],[27,36,30,36],[28,5,30,5],[28,6,30,6],[28,7,30,7],[28,8,30,8],[28,9,30,9],[28,10,30,10],[28,11,30,11],[28,12,30,12],[28,13,30,13],[28,14,30,14],[28,15,30,15],[28,16,30,16],[28,17,30,17],[28,18,30,18],[28,19,30,19],[28,20,30,20],[28,21,30,21],[28,22,30,22],[28,23,30,23],[28,24,30,24],[31,0,31,4]]}
[]
["POLOŽKOVÝ LIST                                                                                      "]
[{"$f":"Vstup!C2&IF(Vstup!C3<>\"\",\", \"&Vstup!C3,\"\")","v":"Josefovský brokový trojboj, 60 TERČŮ"}]
[{"$f":"Vstup!C4&\", \"&Vstup!C5","v":"SPORTING, 20.03.2022"}]
[]
["Skupina: ",null,3,"Kolo :",1,"Rozhodčí:",{"$nulls":3},"____________________________________________________________________________________________",{"$nulls":25},"∑","Podpis"]
["St. č.","Příjmení, jméno",{"$nulls":3},"Terče"]
[13,"Trepka Jiří",null,null,"S",20,19,18,17,16,15,14,13,12,11,10,9,8,7,6,5,4,3,2,1]
[]
[]
[]
[14,"Dusík Vladimír",null,null,"S",20,19,18,17,16,15,14,13,12,11,10,9,8,7,6,5,4,3,2,1]
[]
[]
[]
[15,"Kotrbáček Václav",null,null,"S",20,19,18,17,16,15,14,13,12,11,10,9,8,7,6,5,4,3,2,1]
[]
[]
[]
[16,"Doležal Jaroslav",null,null,"S",20,19,18,17,16,15,14,13,12,11,10,9,8,7,6,5,4,3,2,1]
[]
[]
[]
[17,"Křepelka Jan",null,null,"S",20,19,18,17,16,15,14,13,12,11,10,9,8,7,6,5,4,3,2,1]
[]
[]
[]
[18,"Bém Josef",null,null,"S",20,19,18,17,16,15,14,13,12,11,10,9,8,7,6,5,4,3,2,1]
[]
[]
[]
["Poznámky:"]

{"sheet":"Sk4","index":10,"n_rows":32,"n_cols":37,"rows_kept":32,"hidden":true,"merged":[[1,0,1,36],[2,0,2,36],[3,0,3,36],[5,0,5,1],[5,5,5,8],[5,9,5,34],[5,35,6,35],[5,36,6,36],[6,1,6,3],[6,5,6,34],[7,0,10,0],[7,1,10,3],[7,4,10,4],[7,35,10,35],[7,36,10,36],[8,5,10,5],[8,6,10,6],[8,7,10,7],[8,8,10,8],[8,9,10,9],[8,10,10,10],[8,11,10,11],[8,12,10,12],[8,13,10,13],[8,14,10,14],[8,15,10,15],[8,16,10,16],[8,17,10,17],[8,18,10,18],[8,19,10,19],[8,20,10,20],[8,21,10,21],[8,22,10,22],[8,23,10,23],[8,24,10,24],[11,0,14,0],[11,1,14,3],[11,4,14,4],[11,35,14,35],[11,36,14,36],[12,5,14,5],[12,6,14,6],[12,7,14,7],[12,8,14,8],[12,9,14,9],[12,10,14,10],[12,11,14,11],[12,12,14,12],[12,13,14,13],[12,14,14,14],[12,15,14,15],[12,16,14,16],[12,17,14,17],[12,18,14,18],[12,19,14,19],[12,20,14,20],[12,21,14,21],[12,22,14,22],[12,23,14,23],[12,24,14,24],[15,0,18,0],[15,1,18,3],[15,4,18,4],[15,35,18,35],[15,36,18,36],[16,5,18,5],[16,6,18,6],[16,7,18,7],[16,8,18,8],[16,9,18,9],[16,10,18,10],[16,11,18,11],[16,12,18,12],[16,13,18,13],[16,14,18,14],[16,15,18,15],[16,16,18,16],[16,17,18,17],[16,18,18,18],[16,19,18,19],[16,20,18,20],[16,21,18,21],[16,22,18,22],[16,23,18,23],[16,24,18,24],[19,0,22,0],[19,1,22,3],[19,4,22,4],[19,35,22,35],[19,36,22,36],[20,5,22,5],[20,6,22,6],[20,7,22,7],[20,8,22,8],[20,9,22,9],[20,10,22,10],[20,11,22,11],[20,12,22,12],[20,13,22,13],[20,14,22,14],[20,15,22,15],[20,16,22,16],[20,17,22,17],[20,18,22,18],[20,19,22,19],[20,20,22,20],[20,21,22,21],[20,22,22,22],[20,23,22,23],[20,24,22,24],[23,0,26,0],[23,1,26,3],[23,4,26,4],[23,35,26,35],[23,36,26,36],[24,5,26,5],[24,6,26,6],[24,7,26,7],[24,8,26,8],[24,9,26,9],[24,10,26,10],[24,11,26,11],[24,12,26,12],[24,13,26,13],[24,14,26,14],[24,15,26,15],[24,16,26,16],[24,17,26,17],[24,18,26,18],[24,19,26,19],[24,20,26,20],[24,21,26,21],[24,22,26,22],[24,23,26,23],[24,24,26,24],[27,0,30,0],[27,1,30,3],[27,4,30,4],[27,35,30,35],[27,36,30,36],[28,5,30,5],[28,6,30,6],[28,7,30,7],[28,8,30,8],[28,9,30,9],[28,10,30,10],[28,11,30,11],[28,12,30,12],[28,13,30,13],[28,14,30,14],[28,15,30,15],[28,16,30,16],[28,17,30,17],[28,18,30,18],[28,19,30,19],[28,20,30,20],[28,21,30,21],[28,22,30,22],[28,23,30,23],[28,24,30,24],[31,0,31,4]]}
[]
["POLOŽKOVÝ LIST                                                                                      "]
[{"$f":"Vstup!C2&IF(Vstup!C3<>\"\",\", \"&Vstup!C3,\"\")","v":"Josefovský brokový trojboj, 60 TERČŮ"}]
[{"$f":"Vstup!C4&\", \"&Vstup!C5","v":"SPORTING, 20.03.2022"}]
[]
["Skupina: ",null,4,"Kolo :",1,"Rozhodčí:",{"$nulls":3},"____________________________________________________________________________________________",{"$nulls":25},"∑","Podpis"]
["St. č.","Příjmení, jméno",null,null,"Kat.","Terče"]
[19,"Čechura Petr",null,null,"S",20,19,18,17,16,15,14,13,12,11,10,9,8,7,6,5,4,3,2,1]
[]
[]
[]
[20,"Čechura Pavel",null,null,"S",20,19,18,17,16,15,14,13,12,11,10,9,8,7,6,5,4,3,2,1]
[]
[]
[]
[21,"Sedláček Jiří",null,null,"S",20,19,18,17,16,15,14,13,12,11,10,9,8,7,6,5,4,3,2,1]
[]
[]
[]
[22,"Hájek Petr",null,null,"S",20,19,18,17,16,15,14,13,12,11,10,9,8,7,6,5,4,3,2,1]
[]
[]
[]
[23,"Volf Jiří",null,null,"S",20,19,18,17,16,15,14,13,12,11,10,9,8,7,6,5,4,3,2,1]
[]
[]
[]
[24,"Navara Josef",null,null,"S",20,19,18,17,16,15,14,13,12,11,10,9,8,7,6,5,4,3,2,1]
[]
[]
[]
["Poznámky:"]

{"sheet":"Sk5","index":11,"n_rows":32,"n_cols":37,"rows_kept":32,"hidden":true,"merged":[[1,0,1,36],[2,0,2,36],[3,0,3,36],[5,0,5,1],[5,5,5,8],[5,9,5,34],[5,35,6,35],[5,36,6,36],[6,1,6,3],[6,5,6,34],[7,0,10,0],[7,1,10,3],[7,4,10,4],[7,35,10,35],[7,36,10,36],[8,5,10,5],[8,6,10,6],[8,7,10,7],[8,8,10,8],[8,9,10,9],[8,10,10,10],[8,11,10,11],[8,12,10,12],[8,13,10,13],[8,14,10,14],[8,15,10,15],[8,16,10,16],[8,17,10,17],[8,18,10,18],[8,19,10,19],[8,20,10,20],[8,21,10,21],[8,22,10,22],[8,23,10,23],[8,24,10,24],[11,0,14,0],[11,1,14,3],[11,4,14,4],[11,35,14,35],[11,36,14,36],[12,5,14,5],[12,6,14,6],[12,7,14,7],[12,8,14,8],[12,9,14,9],[12,10,14,10],[12,11,14,11],[12,12,14,12],[12,13,14,13],[12,14,14,14],[12,15,14,15],[12,16,14,16],[12,17,14,17],[12,18,14,18],[12,19,14,19],[12,20,14,20],[12,21,14,21],[12,22,14,22],[12,23,14,23],[12,24,14,24],[15,0,18,0],[15,1,18,3],[15,4,18,4],[15,35,18,35],[15,36,18,36],[16,5,18,5],[16,6,18,6],[16,7,18,7],[16,8,18,8],[16,9,18,9],[16,10,18,10],[16,11,18,11],[16,12,18,12],[16,13,18,13],[16,14,18,14],[16,15,18,15],[16,16,18,16],[16,17,18,17],[16,18,18,18],[16,19,18,19],[16,20,18,20],[16,21,18,21],[16,22,18,22],[16,23,18,23],[16,24,18,24],[19,0,22,0],[19,1,22,3],[19,4,22,4],[19,35,22,35],[19,36,22,36],[20,5,22,5],[20,6,22,6],[20,7,22,7],[20,8,22,8],[20,9,22,9],[20,10,22,10],[20,11,22,11],[20,12,22,12],[20,13,22,13],[20,14,22,14],[20,15,22,15],[20,16,22,16],[20,17,22,17],[20,18,22,18],[20,19,22,19],[20,20,22,20],[20,21,22,21],[20,22,22,22],[20,23,22,23],[20,24,22,24],[23,0,26,0],[23,1,26,3],[23,4,26,4],[23,35,26,35],[23,36,26,36],[24,5,26,5],[24,6,26,6],[24,7,26,7],[24,8,26,8],[24,9,26,9],[24,10,26,10],[24,11,26,11],[24,12,26,12],[24,13,26,13],[24,14,26,14],[24,15,26,15],[24,16,26,16],[24,17,26,17],[24,18,26,18],[24,19,26,19],[24,20,26,20],[24,21,26,21],[24,22,26,22],[24,23,26,23],[24,24,26,24],[27,0,30,0],[27,1,30,3],[27,4,30,4],[27,35,30,35],[27,36,30,36],[28,5,30,5],[28,6,30,6],[28,7,30,7],[28,8,30,8],[28,9,30,9],[28,10,30,10],[28,11,30,11],[28,12,30,12],[28,13,30,13],[28,14,30,14],[28,15,30,15],[28,16,30,16],[28,17,30,17],[28,18,30,18],[28,19,30,19],[28,20,30,20],[28,21,30,21],[28,22,30,22],[28,23,30,23],[28,24,30,24],[31,0,31,4]]}
[]
["POLOŽKOVÝ LIST                                                                                      "]
[{"$f":"Vstup!C2&IF(Vstup!C3<>\"\",\", \"&Vstup!C3,\"\")","v":"Josefovský brokový trojboj, 60 TERČŮ"}]
[{"$f":"Vstup!C4&\", \"&Vstup!C5","v":"SPORTING, 20.03.2022"}]
[]
["Skupina: ",null,5,"Kolo :",1,"Rozhodčí:",{"$nulls":3},"____________________________________________________________________________________________",{"$nulls":25},"∑","Podpis"]
["St. č.","Příjmení, jméno",null,null,"Kat.","Terče"]
[25,"Šindelář Jan",null,null,"S",20,19,18,17,16,15,14,13,12,11,10,9,8,7,6,5,4,3,2,1]
[]
[]
[]
[26,"Jira Tomáš",null,null,"S",20,19,18,17,16,15,14,13,12,11,10,9,8,7,6,5,4,3,2,1]
[]
[]
[]
[27,"Gorschenek Martin",null,null,"S",20,19,18,17,16,15,14,13,12,11,10,9,8,7,6,5,4,3,2,1]
[]
[]
[]
[28,"Leihs Gustav",null,null,"S",20,19,18,17,16,15,14,13,12,11,10,9,8,7,6,5,4,3,2,1]
[]
[]
[]
[29,"Škrýba Petr",null,null,"S",20,19,18,17,16,15,14,13,12,11,10,9,8,7,6,5,4,3,2,1]
[]
[]
[]
[30,"Růžek Luboš",null,null,"S",20,19,18,17,16,15,14,13,12,11,10,9,8,7,6,5,4,3,2,1]
[]
[]
[]
["Poznámky:"]

{"sheet":"Sk6","index":12,"n_rows":32,"n_cols":37,"rows_kept":32,"hidden":true,"merged":[[1,0,1,36],[2,0,2,36],[3,0,3,36],[5,0,5,1],[5,5,5,8],[5,9,5,34],[5,35,6,35],[5,36,6,36],[6,1,6,3],[6,5,6,34],[7,0,10,0],[7,1,10,3],[7,4,10,4],[7,35,10,35],[7,36,10,36],[8,5,10,5],[8,6,10,6],[8,7,10,7],[8,8,10,8],[8,9,10,9],[8,10,10,10],[8,11,10,11],[8,12,10,12],[8,13,10,13],[8,14,10,14],[8,15,10,15],[8,16,10,16],[8,17,10,17],[8,18,10,18],[8,19,10,19],[8,20,10,20],[8,21,10,21],[8,22,10,22],[8,23,10,23],[8,24,10,24],[11,0,14,0],[11,1,14,3],[11,4,14,4],[11,35,14,35],[11,36,14,36],[12,5,14,5],[12,6,14,6],[12,7,14,7],[12,8,14,8],[12,9,14,9],[12,10,14,10],[12,11,14,11],[12,12,14,12],[12,13,14,13],[12,14,14,14],[12,15,14,15],[12,16,14,16],[12,17,14,17],[12,18,14,18],[12,19,14,19],[12,20,14,20],[12,21,14,21],[12,22,14,22],[12,23,14,23],[12,24,14,24],[15,0,18,0],[15,1,18,3],[15,4,18,4],[15,35,18,35],[15,36,18,36],[16,5,18,5],[16,6,18,6],[16,7,18,7],[16,8,18,8],[16,9,18,9],[16,10,18,10],[16,11,18,11],[16,12,18,12],[16,13,18,13],[16,14,18,14],[16,15,18,15],[16,16,18,16],[16,17,18,17],[16,18,18,18],[16,19,18,19],[16,20,18,20],[16,21,18,21],[16,22,18,22],[16,23,18,23],[16,24,18,24],[19,0,22,0],[19,1,22,3],[19,4,22,4],[19,35,22,35],[19,36,22,36],[20,5,22,5],[20,6,22,6],[20,7,22,7],[20,8,22,8],[20,9,22,9],[20,10,22,10],[20,11,22,11],[20,12,22,12],[20,13,22,13],[20,14,22,14],[20,15,22,15],[20,16,22,16],[20,17,22,17],[20,18,22,18],[20,19,22,19],[20,20,22,20],[20,21,22,21],[20,22,22,22],[20,23,22,23],[20,24,22,24],[23,0,26,0],[23,1,26,3],[23,4,26,4],[23,35,26,35],[23,36,26,36],[24,5,26,5],[24,6,26,6],[24,7,26,7],[24,8,26,8],[24,9,26,9],[24,10,26,10],[24,11,26,11],[24,12,26,12],[24,13,26,13],[24,14,26,14],[24,15,26,15],[24,16,26,16],[24,17,26,17],[24,18,26,18],[24,19,26,19],[24,20,26,20],[24,21,26,21],[24,22,26,22],[24,23,26,23],[24,24,26,24],[27,0,30,0],[27,1,30,3],[27,4,30,4],[27,35,30,35],[27,36,30,36],[28,5,30,5],[28,6,30,6],[28,7,30,7],[28,8,30,8],[28,9,30,9],[28,10,30,10],[28,11,30,11],[28,12,30,12],[28,13,30,13],[28,14,30,14],[28,15,30,15],[28,16,30,16],[28,17,30,17],[28,18,30,18],[28,19,30,19],[28,20,30,20],[28,21,30,21],[28,22,30,22],[28,23,30,23],[28,24,30,24],[31,0,31,4]]}
[]
["POLOŽKOVÝ LIST                                                                                      "]
[{"$f":"Vstup!C2&IF(Vstup!C3<>\"\",\", \"&Vstup!C3,\"\")","v":"Josefovský brokový trojboj, 60 TERČŮ"}]
[{"$f":"Vstup!C4&\", \"&Vstup!C5","v":"SPORTING, 20.03.2022"}]
[]
["Skupina: ",null,6,"Kolo :",1,"Rozhodčí:",{"$nulls":3},"____________________________________________________________________________________________",{"$nulls":25},"∑","Podpis"]
["St. č.","Příjmení, jméno",null,null,"Kat.","Terče"]
[31,"Albl Václav",null,null,"S",20,19,18,17,16,15,14,13,12,11,10,9,8,7,6,5,4,3,2,1]
[]
[]
[]
[32,"Noháček Jaroslav",null,null,"S",20,19,18,17,16,15,14,13,12,11,10,9,8,7,6,5,4,3,2,1]
[]
[]
[]
[33,"Noháček Pavel",null,null,"S",20,19,18,17,16,15,14,13,12,11,10,9,8,7,6,5,4,3,2,1]
[]
[]
[]
[34,"Mach Josef",null,null,"S",20,19,18,17,16,15,14,13,12,11,10,9,8,7,6,5,4,3,2,1]
[]
[]
[]
[35,"Lusk Stanislav",null,null,"S",20,19,18,17,16,15,14,13,12,11,10,9,8,7,6,5,4,3,2,1]
[]
[]
[]
[36,"Mach Jan",null,null,"S",20,19,18,17,16,15,14,13,12,11,10,9,8,7,6,5,4,3,2,1]
[]
[]
[]
["Poznámky:"]

{"sheet":"Sk7","index":13,"n_rows":32,"n_cols":37,"rows_kept":32,"hidden":true,"merged":[[1,0,1,36],[2,0,2,36],[3,0,3,36],[5,0,5,1],[5,5,5,8],[5,9,5,34],[5,35,6,35],[5,36,6,36],[6,1,6,3],[6,5,6,34],[7,0,10,0],[7,1,10,3],[7,4,10,4],[7,35,10,35],[7,36,10,36],[8,5,10,5],[8,6,10,6],[8,7,10,7],[8,8,10,8],[8,9,10,9],[8,10,10,10],[8,11,10,11],[8,12,10,12],[8,13,10,13],[8,14,10,14],[8,15,10,15],[8,16,10,16],[8,17,10,17],[8,18,10,18],[8,19,10,19],[8,20,10,20],[8,21,10,21],[8,22,10,22],[8,23,10,23],[8,24,10,24],[11,0,14,0],[11,1,14,3],[11,4,14,4],[11,35,14,35],[11,36,14,36],[12,5,14,5],[12,6,14,6],[12,7,14,7],[12,8,14,8],[12,9,14,9],[12,10,14,10],[12,11,14,11],[12,12,14,12],[12,13,14,13],[12,14,14,14],[12,15,14,15],[12,16,14,16],[12,17,14,17],[12,18,14,18],[12,19,14,19],[12,20,14,20],[12,21,14,21],[12,22,14,22],[12,23,14,23],[12,24,14,24],[15,0,18,0],[15,1,18,3],[15,4,18,4],[15,35,18,35],[15,36,18,36],[16,5,18,5],[16,6,18,6],[16,7,18,7],[16,8,18,8],[16,9,18,9],[16,10,18,10],[16,11,18,11],[16,12,18,12],[16,13,18,13],[16,14,18,14],[16,15,18,15],[16,16,18,16],[16,17,18,17],[16,18,18,18],[16,19,18,19],[16,20,18,20],[16,21,18,21],[16,22,18,22],[16,23,18,23],[16,24,18,24],[19,0,22,0],[19,1,22,3],[19,4,22,4],[19,35,22,35],[19,36,22,36],[20,5,22,5],[20,6,22,6],[20,7,22,7],[20,8,22,8],[20,9,22,9],[20,10,22,10],[20,11,22,11],[20,12,22,12],[20,13,22,13],[20,14,22,14],[20,15,22,15],[20,16,22,16],[20,17,22,17],[20,18,22,18],[20,19,22,19],[20,20,22,20],[20,21,22,21],[20,22,22,22],[20,23,22,23],[20,24,22,24],[23,0,26,0],[23,1,26,3],[23,4,26,4],[23,35,26,35],[23,36,26,36],[24,5,26,5],[24,6,26,6],[24,7,26,7],[24,8,26,8],[24,9,26,9],[24,10,26,10],[24,11,26,11],[24,12,26,12],[24,13,26,13],[24,14,26,14],[24,15,26,15],[24,16,26,16],[24,17,26,17],[24,18,26,18],[24,19,26,19],[24,20,26,20],[24,21,26,21],[24,22,26,22],[24,23,26,23],[24,24,26,24],[27,0,30,0],[27,1,30,3],[27,4,30,4],[27,35,30,35],[27,36,30,36],[28,5,30,5],[28,6,30,6],[28,7,30,7],[28,8,30,8],[28,9,30,9],[28,10,30,10],[28,11,30,11],[28,12,30,12],[28,13,30,13],[28,14,30,14],[28,15,30,15],[28,16,30,16],[28,17,30,17],[28,18,30,18],[28,19,30,19],[28,20,30,20],[28,21,30,21],[28,22,30,22],[28,23,30,23],[28,24,30,24],[31,0,31,4]]}
[]
["POLOŽKOVÝ LIST                                                                                      "]
[{"$f":"Vstup!C2&IF(Vstup!C3<>\"\",\", \"&Vstup!C3,\"\")","v":"Josefovský brokový trojboj, 60 TERČŮ"}]
[{"$f":"Vstup!C4&\", \"&Vstup!C5","v":"SPORTING, 20.03.2022"}]
[]
["Skupina: ",null,7,"Kolo :",1,"Rozhodčí:",{"$nulls":3},"____________________________________________________________________________________________",{"$nulls":25},"∑","Podpis"]
["St. č.","Příjmení, jméno",null,null,"Kat.","Terče"]
[37,"Hromada Jaroslav",null,null,"S",20,19,18,17,16,15,14,13,12,11,10,9,8,7,6,5,4,3,2,1]
[]
[]
[]
[38,"Racek Petr",null,null,"S",20,19,18,17,16,15,14,13,12,11,10,9,8,7,6,5,4,3,2,1]
[]
[]
[]
[39,"Říha Jiří",null,null,"S",20,19,18,17,16,15,14,13,12,11,10,9,8,7,6,5,4,3,2,1]
[]
[]
[]
[40,"Kočí Radek",null,null,"S",20,19,18,17,16,15,14,13,12,11,10,9,8,7,6,5,4,3,2,1]
[]
[]
[]
[41,"Pechan Josef",null,null,"S",20,19,18,17,16,15,14,13,12,11,10,9,8,7,6,5,4,3,2,1]
[]
[]
[]
[42,"Kučera Václav",null,null,"S",20,19,18,17,16,15,14,13,12,11,10,9,8,7,6,5,4,3,2,1]
[]
[]
[]
["Poznámky:"]

{"sheet":"Sk8","index":14,"n_rows":32,"n_cols":37,"rows_kept":32,"hidden":true,"merged":[[1,0,1,36],[2,0,2,36],[3,0,3,36],[5,0,5,1],[5,5,5,8],[5,9,5,34],[5,35,6,35],[5,36,6,36],[6,1,6,3],[6,5,6,34],[7,0,10,0],[7,1,10,3],[7,4,10,4],[7,35,10,35],[7,36,10,36],[8,5,10,5],[8,6,10,6],[8,7,10,7],[8,8,10,8],[8,9,10,9],[8,10,10,10],[8,11,10,11],[8,12,10,12],[8,13,10,13],[8,14,10,14],[8,15,10,15],[8,16,10,16],[8,17,10,17],[8,18,10,18],[8,19,10,19],[8,20,10,20],[8,21,10,21],[8,22,10,22],[8,23,10,23],[8,24,10,24],[11,0,14,0],[11,1,14,3],[11,4,14,4],[11,35,14,35],[11,36,14,36],[12,5,14,5],[12,6,14,6],[12,7,14,7],[12,8,14,8],[12,9,14,9],[12,10,14,10],[12,11,14,11],[12,12,14,12],[12,13,14,13],[12,14,14,14],[12,15,14,15],[12,16,14,16],[12,17,14,17],[12,18,14,18],[12,19,14,19],[12,20,14,20],[12,21,14,21],[12,22,14,22],[12,23,14,23],[12,24,14,24],[15,0,18,0],[15,1,18,3],[15,4,18,4],[15,35,18,35],[15,36,18,36],[16,5,18,5],[16,6,18,6],[16,7,18,7],[16,8,18,8],[16,9,18,9],[16,10,18,10],[16,11,18,11],[16,12,18,12],[16,13,18,13],[16,14,18,14],[16,15,18,15],[16,16,18,16],[16,17,18,17],[16,18,18,18],[16,19,18,19],[16,20,18,20],[16,21,18,21],[16,22,18,22],[16,23,18,23],[16,24,18,24],[19,0,22,0],[19,1,22,3],[19,4,22,4],[19,35,22,35],[19,36,22,36],[20,5,22,5],[20,6,22,6],[20,7,22,7],[20,8,22,8],[20,9,22,9],[20,10,22,10],[20,11,22,11],[20,12,22,12],[20,13,22,13],[20,14,22,14],[20,15,22,15],[20,16,22,16],[20,17,22,17],[20,18,22,18],[20,19,22,19],[20,20,22,20],[20,21,22,21],[20,22,22,22],[20,23,22,23],[20,24,22,24],[23,0,26,0],[23,1,26,3],[23,4,26,4],[23,35,26,35],[23,36,26,36],[24,5,26,5],[24,6,26,6],[24,7,26,7],[24,8,26,8],[24,9,26,9],[24,10,26,10],[24,11,26,11],[24,12,26,12],[24,13,26,13],[24,14,26,14],[24,15,26,15],[24,16,26,16],[24,17,26,17],[24,18,26,18],[24,19,26,19],[24,20,26,20],[24,21,26,21],[24,22,26,22],[24,23,26,23],[24,24,26,24],[27,0,30,0],[27,1,30,3],[27,4,30,4],[27,35,30,35],[27,36,30,36],[28,5,30,5],[28,6,30,6],[28,7,30,7],[28,8,30,8],[28,9,30,9],[28,10,30,10],[28,11,30,11],[28,12,30,12],[28,13,30,13],[28,14,30,14],[28,15,30,15],[28,16,30,16],[28,17,30,17],[28,18,30,18],[28,19,30,19],[28,20,30,20],[28,21,30,21],[28,22,30,22],[28,23,30,23],[28,24,30,24],[31,0,31,4]]}
[]
["POLOŽKOVÝ LIST                                                                                      "]
[{"$f":"Vstup!C2&IF(Vstup!C3<>\"\",\", \"&Vstup!C3,\"\")","v":"Josefovský brokový trojboj, 60 TERČŮ"}]
[{"$f":"Vstup!C4&\", \"&Vstup!C5","v":"SPORTING, 20.03.2022"}]
[]
["Skupina: ",null,8,"Kolo :",1,"Rozhodčí:",{"$nulls":3},"____________________________________________________________________________________________",{"$nulls":25},"∑","Podpis"]
["St. č.","Příjmení, jméno",null,null,"Kat.","Terče"]
[43,"Štengl Jiří",null,null,"S",20,19,18,17,16,15,14,13,12,11,10,9,8,7,6,5,4,3,2,1]
[]
[]
[]
[44,"Kubík Jindřich",null,null,"S",20,19,18,17,16,15,14,13,12,11,10,9,8,7,6,5,4,3,2,1]
[]
[]
[]
[45,"Vodička Miroslav",null,null,"S",20,19,18,17,16,15,14,13,12,11,10,9,8,7,6,5,4,3,2,1]
[]
[]
[]
[46,"Šindelář Milan",null,null,"S",20,19,18,17,16,15,14,13,12,11,10,9,8,7,6,5,4,3,2,1]
[]
[]
[]
[47,"Förster Karel",null,null,"S",20,19,18,17,16,15,14,13,12,11,10,9,8,7,6,5,4,3,2,1]
[]
[]
[]
[48,"Ulrych Jiří",null,null,"S",20,19,18,17,16,15,14,13,12,11,10,9,8,7,6,5,4,3,2,1]
[]
[]
[]
["Poznámky:"]

{"sheet":"Sk9","index":15,"n_rows":32,"n_cols":37,"rows_kept":32,"merged":[[1,0,1,36],[2,0,2,36],[3,0,3,36],[5,0,5,1],[5,5,5,8],[5,9,5,34],[5,35,6,35],[5,36,6,36],[6,1,6,3],[6,5,6,34],[7,0,10,0],[7,1,10,3],[7,4,10,4],[7,35,10,35],[7,36,10,36],[8,5,10,5],[8,6,10,6],[8,7,10,7],[8,8,10,8],[8,9,10,9],[8,10,10,10],[8,11,10,11],[8,12,10,12],[8,13,10,13],[8,14,10,14],[8,15,10,15],[8,16,10,16],[8,17,10,17],[8,18,10,18],[8,19,10,19],[8,20,10,20],[8,21,10,21],[8,22,10,22],[8,23,10,23],[8,24,10,24],[11,0,14,0],[11,1,14,3],[11,4,14,4],[11,35,14,35],[11,36,14,36],[12,5,14,5],[12,6,14,6],[12,7,14,7],[12,8,14,8],[12,9,14,9],[12,10,14,10],[12,11,14,11],[12,12,14,12],[12,13,14,13],[12,14,14,14],[12,15,14,15],[12,16,14,16],[12,17,14,17],[12,18,14,18],[12,19,14,19],[12,20,14,20],[12,21,14,21],[12,22,14,22],[12,23,14,23],[12,24,14,24],[15,0,18,0],[15,1,18,3],[15,4,18,4],[15,35,18,35],[15,36,18,36],[16,5,18,5],[16,6,18,6],[16,7,18,7],[16,8,18,8],[16,9,18,9],[16,10,18,10],[16,11,18,11],[16,12,18,12],[16,13,18,13],[16,14,18,14],[16,15,18,15],[16,16,18,16],[16,17,18,17],[16,18,18,18],[16,19,18,19],[16,20,18,20],[16,21,18,21],[16,22,18,22],[16,23,18,23],[16,24,18,24],[19,0,22,0],[19,1,22,3],[19,4,22,4],[19,35,22,35],[19,36,22,36],[20,5,22,5],[20,6,22,6],[20,7,22,7],[20,8,22,8],[20,9,22,9],[20,10,22,10],[20,11,22,11],[20,12,22,12],[20,13,22,13],[20,14,22,14],[20,15,22,15],[20,16,22,16],[20,17,22,17],[20,18,22,18],[20,19,22,19],[20,20,22,20],[20,21,22,21],[20,22,22,22],[20,23,22,23],[20,24,22,24],[23,0,26,0],[23,1,26,3],[23,4,26,4],[23,35,26,35],[23,36,26,36],[24,5,26,5],[24,6,26,6],[24,7,26,7],[24,8,26,8],[24,9,26,9],[24,10,26,10],[24,11,26,11],[24,12,26,12],[24,13,26,13],[24,14,26,14],[24,15,26,15],[24,16,26,16],[24,17,26,17],[24,18,26,18],[24,19,26,19],[24,20,26,20],[24,21,26,21],[24,22,26,22],[24,23,26,23],[24,24,26,24],[27,0,30,0],[27,1,30,3],[27,4,30,4],[27,35,30,35],[27,36,30,36],[28,5,30,5],[28,6,30,6],[28,7,30,7],[28,8,30,8],[28,9,30,9],[28,10,30,10],[28,11,30,11],[28,12,30,12],[28,13,30,13],[28,14,30,14],[28,15,30,15],[28,16,30,16],[28,17,30,17],[28,18,30,18],[28,19,30,19],[28,20,30,20],[28,21,30,21],[28,22,30,22],[28,23,30,23],[28,24,30,24],[31,0,31,4]]}
[]
["POLOŽKOVÝ LIST                                                                                      "]
[{"$f":"Vstup!C2&IF(Vstup!C3<>\"\",\", \"&Vstup!C3,\"\")","v":"Josefovský brokový trojboj, 60 TERČŮ"}]
[{"$f":"Vstup!C4&\", \"&Vstup!C5","v":"SPORTING, 20.03.2022"}]
[]
["Skupina: ",null,9,"Kolo :",1,"Rozhodčí:",{"$nulls":3},"____________________________________________________________________________________________",{"$nulls":25},"∑","Podpis"]
["St. č.","Příjmení, jméno",null,null,"Kat.","Terče"]
[49,"Vaněk Matěj",null,null,"S",20,19,18,17,16,15,14,13,12,11,10,9,8,7,6,5,4,3,2,1]
[]
[]
[]
[50,"Noháček Pavel",null,null,"S",20,19,18,17,16,15,14,13,12,11,10,9,8,7,6,5,4,3,2,1]
[]
[]
[]
[51,"Kotrbáček Václav",null,null,"S",20,19,18,17,16,15,14,13,12,11,10,9,8,7,6,5,4,3,2,1]
[]
[]
[]
[52,"Kubík Jindřich",null,null,"S",20,19,18,17,16,15,14,13,12,11,10,9,8,7,6,5,4,3,2,1]
[]
[]
[]
[53,"Čechura Petr",null,null,"S",20,19,18,17,16,15,14,13,12,11,10,9,8,7,6,5,4,3,2,1]
[]
[]
[]
[54,{"$nulls":3},"S",20,19,18,17,16,15,14,13,12,11,10,9,8,7,6,5,4,3,2,1]
[]
[]
[]
["Poznámky:"]

{"sheet":"Sk10","index":16,"n_rows":32,"n_cols":37,"rows_kept":32,"hidden":true,"merged":[[1,0,1,36],[2,0,2,36],[3,0,3,36],[5,0,5,1],[5,5,5,8],[5,9,5,34],[5,35,6,35],[5,36,6,36],[6,1,6,3],[6,5,6,34],[7,0,10,0],[7,1,10,3],[7,4,10,4],[7,35,10,35],[7,36,10,36],[8,5,10,5],[8,6,10,6],[8,7,10,7],[8,8,10,8],[8,9,10,9],[8,10,10,10],[8,11,10,11],[8,12,10,12],[8,13,10,13],[8,14,10,14],[8,15,10,15],[8,16,10,16],[8,17,10,17],[8,18,10,18],[8,19,10,19],[8,20,10,20],[8,21,10,21],[8,22,10,22],[8,23,10,23],[8,24,10,24],[11,0,14,0],[11,1,14,3],[11,4,14,4],[11,35,14,35],[11,36,14,36],[12,5,14,5],[12,6,14,6],[12,7,14,7],[12,8,14,8],[12,9,14,9],[12,10,14,10],[12,11,14,11],[12,12,14,12],[12,13,14,13],[12,14,14,14],[12,15,14,15],[12,16,14,16],[12,17,14,17],[12,18,14,18],[12,19,14,19],[12,20,14,20],[12,21,14,21],[12,22,14,22],[12,23,14,23],[12,24,14,24],[15,0,18,0],[15,1,18,3],[15,4,18,4],[15,35,18,35],[15,36,18,36],[16,5,18,5],[16,6,18,6],[16,7,18,7],[16,8,18,8],[16,9,18,9],[16,10,18,10],[16,11,18,11],[16,12,18,12],[16,13,18,13],[16,14,18,14],[16,15,18,15],[16,16,18,16],[16,17,18,17],[16,18,18,18],[16,19,18,19],[16,20,18,20],[16,21,18,21],[16,22,18,22],[16,23,18,23],[16,24,18,24],[19,0,22,0],[19,1,22,3],[19,4,22,4],[19,35,22,35],[19,36,22,36],[20,5,22,5],[20,6,22,6],[20,7,22,7],[20,8,22,8],[20,9,22,9],[20,10,22,10],[20,11,22,11],[20,12,22,12],[20,13,22,13],[20,14,22,14],[20,15,22,15],[20,16,22,16],[20,17,22,17],[20,18,22,18],[20,19,22,19],[20,20,22,20],[20,21,22,21],[20,22,22,22],[20,23,22,23],[20,24,22,24],[23,0,26,0],[23,1,26,3],[23,4,26,4],[23,35,26,35],[23,36,26,36],[24,5,26,5],[24,6,26,6],[24,7,26,7],[24,8,26,8],[24,9,26,9],[24,10,26,10],[24,11,26,11],[24,12,26,12],[24,13,26,13],[24,14,26,14],[24,15,26,15],[24,16,26,16],[24,17,26,17],[24,18,26,18],[24,19,26,19],[24,20,26,20],[24,21,26,21],[24,22,26,22],[24,23,26,23],[24,24,26,24],[27,0,30,0],[27,1,30,3],[27,4,30,4],[27,35,30,35],[27,36,30,36],[28,5,30,5],[28,6,30,6],[28,7,30,7],[28,8,30,8],[28,9,30,9],[28,10,30,10],[28,11,30,11],[28,12,30,12],[28,13,30,13],[28,14,30,14],[28,15,30,15],[28,16,30,16],[28,17,30,17],[28,18,30,18],[28,19,30,19],[28,20,30,20],[28,21,30,21],[28,22,30,22],[28,23,30,23],[28,24,30,24],[31,0,31,4]]}
[]
["POLOŽKOVÝ LIST                                                                                      "]
[{"$f":"Vstup!C2&IF(Vstup!C3<>\"\",\", \"&Vstup!C3,\"\")","v":"Josefovský brokový trojboj, 60 TERČŮ"}]
[{"$f":"Vstup!C4&\", \"&Vstup!C5","v":"SPORTING, 20.03.2022"}]
[]
["Skupina: ",null,10,"Kolo :",1,"Rozhodčí:",{"$nulls":3},"____________________________________________________________________________________________",{"$nulls":25},"∑","Podpis"]
["St. č.","Příjmení, jméno",null,null,"Kat.","Terče"]
[{"$nulls":4},"S",20,19,18,17,16,15,14,13,12,11,10,9,8,7,6,5,4,3,2,1]
[]
[]
[]
[{"$nulls":4},"S",20,19,18,17,16,15,14,13,12,11,10,9,8,7,6,5,4,3,2,1]
[]
[]
[]
[{"$nulls":4},"S",20,19,18,17,16,15,14,13,12,11,10,9,8,7,6,5,4,3,2,1]
[]
[]
[]
[{"$nulls":4},"S",20,19,18,17,16,15,14,13,12,11,10,9,8,7,6,5,4,3,2,1]
[]
[]
[]
[{"$nulls":4},"S",20,19,18,17,16,15,14,13,12,11,10,9,8,7,6,5,4,3,2,1]
[]
[]
[]
[{"$nulls":4},"S",20,19,18,17,16,15,14,13,12,11,10,9,8,7,6,5,4,3,2,1]
[]
[]
[]
["Poznámky:"]

{"sheet":"Sk11","index":17,"n_rows":32,"n_cols":37,"rows_kept":32,"hidden":true,"merged":[[1,0,1,36],[2,0,2,36],[3,0,3,36],[5,0,5,1],[5,5,5,8],[5,9,5,34],[5,35,6,35],[5,36,6,36],[6,1,6,3],[6,5,6,34],[7,0,10,0],[7,1,10,3],[7,4,10,4],[7,35,10,35],[7,36,10,36],[8,5,10,5],[8,6,10,6],[8,7,10,7],[8,8,10,8],[8,9,10,9],[8,10,10,10],[8,11,10,11],[8,12,10,12],[8,13,10,13],[8,14,10,14],[8,15,10,15],[8,16,10,16],[8,17,10,17],[8,18,10,18],[8,19,10,19],[8,20,10,20],[8,21,10,21],[8,22,10,22],[8,23,10,23],[8,24,10,24],[11,0,14,0],[11,1,14,3],[11,4,14,4],[11,35,14,35],[11,36,14,36],[12,5,14,5],[12,6,14,6],[12,7,14,7],[12,8,14,8],[12,9,14,9],[12,10,14,10],[12,11,14,11],[12,12,14,12],[12,13,14,13],[12,14,14,14],[12,15,14,15],[12,16,14,16],[12,17,14,17],[12,18,14,18],[12,19,14,19],[12,20,14,20],[12,21,14,21],[12,22,14,22],[12,23,14,23],[12,24,14,24],[15,0,18,0],[15,1,18,3],[15,4,18,4],[15,35,18,35],[15,36,18,36],[16,5,18,5],[16,6,18,6],[16,7,18,7],[16,8,18,8],[16,9,18,9],[16,10,18,10],[16,11,18,11],[16,12,18,12],[16,13,18,13],[16,14,18,14],[16,15,18,15],[16,16,18,16],[16,17,18,17],[16,18,18,18],[16,19,18,19],[16,20,18,20],[16,21,18,21],[16,22,18,22],[16,23,18,23],[16,24,18,24],[19,0,22,0],[19,1,22,3],[19,4,22,4],[19,35,22,35],[19,36,22,36],[20,5,22,5],[20,6,22,6],[20,7,22,7],[20,8,22,8],[20,9,22,9],[20,10,22,10],[20,11,22,11],[20,12,22,12],[20,13,22,13],[20,14,22,14],[20,15,22,15],[20,16,22,16],[20,17,22,17],[20,18,22,18],[20,19,22,19],[20,20,22,20],[20,21,22,21],[20,22,22,22],[20,23,22,23],[20,24,22,24],[23,0,26,0],[23,1,26,3],[23,4,26,4],[23,35,26,35],[23,36,26,36],[24,5,26,5],[24,6,26,6],[24,7,26,7],[24,8,26,8],[24,9,26,9],[24,10,26,10],[24,11,26,11],[24,12,26,12],[24,13,26,13],[24,14,26,14],[24,15,26,15],[24,16,26,16],[24,17,26,17],[24,18,26,18],[24,19,26,19],[24,20,26,20],[24,21,26,21],[24,22,26,22],[24,23,26,23],[24,24,26,24],[27,0,30,0],[27,1,30,3],[27,4,30,4],[27,35,30,35],[27,36,30,36],[28,5,30,5],[28,6,30,6],[28,7,30,7],[28,8,30,8],[28,9,30,9],[28,10,30,10],[28,11,30,11],[28,12,30,12],[28,13,30,13],[28,14,30,14],[28,15,30,15],[28,16,30,16],[28,17,30,17],[28,18,30,18],[28,19,30,19],[28,20,30,20],[28,21,30,21],[28,22,30,22],[28,23,30,23],[28,24,30,24],[31,0,31,4]]}
[]
["POLOŽKOVÝ LIST                                                                                      "]
[{"$f":"Vstup!C2&IF(Vstup!C3<>\"\",\", \"&Vstup!C3,\"\")","v":"Josefovský brokový trojboj, 60 TERČŮ"}]
[{"$f":"Vstup!C4&\", \"&Vstup!C5","v":"SPORTING, 20.03.2022"}]
[]
["Skupina: ",null,11,"Kolo :",1,"Rozhodčí:",{"$nulls":3},"____________________________________________________________________________________________",{"$nulls":25},"∑","Podpis"]
["St. č.","Příjmení, jméno",null,null,"Kat.","Terče"]
[61,"Racek Petr",null,null,"  B",20,19,18,17,16,15,14,13,12,11,10,9,8,7,6,5,4,3,2,1]
[]
[]
[]
[62,"Štengl Jiří",null,null,"  A",20,19,18,17,16,15,14,13,12,11,10,9,8,7,6,5,4,3,2,1]
[]
[]
[]
[63,"Kubal Zdeněk",null,null,{"$error":"#N/A"},20,19,18,17,16,15,14,13,12,11,10,9,8,7,6,5,4,3,2,1]
[]
[]
[]
[64,"Hrubý Josef",null,null,{"$error":"#N/A"},20,19,18,17,16,15,14,13,12,11,10,9,8,7,6,5,4,3,2,1]
[]
[]
[]
[65,"Zeman Milan",null,null,{"$error":"#N/A"},20,19,18,17,16,15,14,13,12,11,10,9,8,7,6,5,4,3,2,1]
[]
[]
[]
[66,"Frenkl Jiří",null,null,"       ",20,19,18,17,16,15,14,13,12,11,10,9,8,7,6,5,4,3,2,1]
[]
[]
[]
["Poznámky:"]

{"sheet":"Sk12","index":18,"n_rows":32,"n_cols":37,"rows_kept":32,"hidden":true,"merged":[[1,0,1,36],[2,0,2,36],[3,0,3,36],[5,0,5,1],[5,5,5,8],[5,9,5,34],[5,35,6,35],[5,36,6,36],[6,1,6,3],[6,5,6,34],[7,0,10,0],[7,1,10,3],[7,4,10,4],[7,35,10,35],[7,36,10,36],[8,5,10,5],[8,6,10,6],[8,7,10,7],[8,8,10,8],[8,9,10,9],[8,10,10,10],[8,11,10,11],[8,12,10,12],[8,13,10,13],[8,14,10,14],[8,15,10,15],[8,16,10,16],[8,17,10,17],[8,18,10,18],[8,19,10,19],[8,20,10,20],[8,21,10,21],[8,22,10,22],[8,23,10,23],[8,24,10,24],[11,0,14,0],[11,1,14,3],[11,4,14,4],[11,35,14,35],[11,36,14,36],[12,5,14,5],[12,6,14,6],[12,7,14,7],[12,8,14,8],[12,9,14,9],[12,10,14,10],[12,11,14,11],[12,12,14,12],[12,13,14,13],[12,14,14,14],[12,15,14,15],[12,16,14,16],[12,17,14,17],[12,18,14,18],[12,19,14,19],[12,20,14,20],[12,21,14,21],[12,22,14,22],[12,23,14,23],[12,24,14,24],[15,0,18,0],[15,1,18,3],[15,4,18,4],[15,35,18,35],[15,36,18,36],[16,5,18,5],[16,6,18,6],[16,7,18,7],[16,8,18,8],[16,9,18,9],[16,10,18,10],[16,11,18,11],[16,12,18,12],[16,13,18,13],[16,14,18,14],[16,15,18,15],[16,16,18,16],[16,17,18,17],[16,18,18,18],[16,19,18,19],[16,20,18,20],[16,21,18,21],[16,22,18,22],[16,23,18,23],[16,24,18,24],[19,0,22,0],[19,1,22,3],[19,4,22,4],[19,35,22,35],[19,36,22,36],[20,5,22,5],[20,6,22,6],[20,7,22,7],[20,8,22,8],[20,9,22,9],[20,10,22,10],[20,11,22,11],[20,12,22,12],[20,13,22,13],[20,14,22,14],[20,15,22,15],[20,16,22,16],[20,17,22,17],[20,18,22,18],[20,19,22,19],[20,20,22,20],[20,21,22,21],[20,22,22,22],[20,23,22,23],[20,24,22,24],[23,0,26,0],[23,1,26,3],[23,4,26,4],[23,35,26,35],[23,36,26,36],[24,5,26,5],[24,6,26,6],[24,7,26,7],[24,8,26,8],[24,9,26,9],[24,10,26,10],[24,11,26,11],[24,12,26,12],[24,13,26,13],[24,14,26,14],[24,15,26,15],[24,16,26,16],[24,17,26,17],[24,18,26,18],[24,19,26,19],[24,20,26,20],[24,21,26,21],[24,22,26,22],[24,23,26,23],[24,24,26,24],[27,0,30,0],[27,1,30,3],[27,4,30,4],[27,35,30,35],[27,36,30,36],[28,5,30,5],[28,6,30,6],[28,7,30,7],[28,8,30,8],[28,9,30,9],[28,10,30,10],[28,11,30,11],[28,12,30,12],[28,13,30,13],[28,14,30,14],[28,15,30,15],[28,16,30,16],[28,17,30,17],[28,18,30,18],[28,19,30,19],[28,20,30,20],[28,21,30,21],[28,22,30,22],[28,23,30,23],[28,24,30,24],[31,0,31,4]]}
[]
["POLOŽKOVÝ LIST                                                                                      "]
[{"$f":"Vstup!C2&IF(Vstup!C3<>\"\",\", \"&Vstup!C3,\"\")","v":"Josefovský brokový trojboj, 60 TERČŮ"}]
[{"$f":"Vstup!C4&\", \"&Vstup!C5","v":"SPORTING, 20.03.2022"}]
[]
["Skupina: ",null,12,"Kolo :",1,"Rozhodčí:",{"$nulls":3},"____________________________________________________________________________________________",{"$nulls":25},"∑","Podpis"]
["St. č.","Příjmení, jméno",null,null,"Kat.","Terče"]
[67,{"$nulls":3},{"$error":"#N/A"},20,19,18,17,16,15,14,13,12,11,10,9,8,7,6,5,4,3,2,1]
[]
[]
[]
[68,{"$nulls":3},{"$error":"#N/A"},20,19,18,17,16,15,14,13,12,11,10,9,8,7,6,5,4,3,2,1]
[]
[]
[]
[69,{"$nulls":3},{"$error":"#N/A"},20,19,18,17,16,15,14,13,12,11,10,9,8,7,6,5,4,3,2,1]
[]
[]
[]
[70,{"$nulls":3},{"$error":"#N/A"},20,19,18,17,16,15,14,13,12,11,10,9,8,7,6,5,4,3,2,1]
[]
[]
[]
[71,{"$nulls":3},{"$error":"#N/A"},20,19,18,17,16,15,14,13,12,11,10,9,8,7,6,5,4,3,2,1]
[]
[]
[]
[72,{"$nulls":3},{"$error":"#N/A"},20,19,18,17,16,15,14,13,12,11,10,9,8,7,6,5,4,3,2,1]
[]
[]
[]
["Poznámky:"]

{"sheet":"Sk13","index":19,"n_rows":32,"n_cols":37,"rows_kept":32,"hidden":true,"merged":[[1,0,1,36],[2,0,2,36],[3,0,3,36],[5,0,5,1],[5,5,5,8],[5,9,5,34],[5,35,6,35],[5,36,6,36],[6,1,6,3],[6,5,6,34],[7,0,10,0],[7,1,10,3],[7,4,10,4],[7,35,10,35],[7,36,10,36],[8,5,10,5],[8,6,10,6],[8,7,10,7],[8,8,10,8],[8,9,10,9],[8,10,10,10],[8,11,10,11],[8,12,10,12],[8,13,10,13],[8,14,10,14],[8,15,10,15],[8,16,10,16],[8,17,10,17],[8,18,10,18],[8,19,10,19],[8,20,10,20],[8,21,10,21],[8,22,10,22],[8,23,10,23],[8,24,10,24],[11,0,14,0],[11,1,14,3],[11,4,14,4],[11,35,14,35],[11,36,14,36],[12,5,14,5],[12,6,14,6],[12,7,14,7],[12,8,14,8],[12,9,14,9],[12,10,14,10],[12,11,14,11],[12,12,14,12],[12,13,14,13],[12,14,14,14],[12,15,14,15],[12,16,14,16],[12,17,14,17],[12,18,14,18],[12,19,14,19],[12,20,14,20],[12,21,14,21],[12,22,14,22],[12,23,14,23],[12,24,14,24],[15,0,18,0],[15,1,18,3],[15,4,18,4],[15,35,18,35],[15,36,18,36],[16,5,18,5],[16,6,18,6],[16,7,18,7],[16,8,18,8],[16,9,18,9],[16,10,18,10],[16,11,18,11],[16,12,18,12],[16,13,18,13],[16,14,18,14],[16,15,18,15],[16,16,18,16],[16,17,18,17],[16,18,18,18],[16,19,18,19],[16,20,18,20],[16,21,18,21],[16,22,18,22],[16,23,18,23],[16,24,18,24],[19,0,22,0],[19,1,22,3],[19,4,22,4],[19,35,22,35],[19,36,22,36],[20,5,22,5],[20,6,22,6],[20,7,22,7],[20,8,22,8],[20,9,22,9],[20,10,22,10],[20,11,22,11],[20,12,22,12],[20,13,22,13],[20,14,22,14],[20,15,22,15],[20,16,22,16],[20,17,22,17],[20,18,22,18],[20,19,22,19],[20,20,22,20],[20,21,22,21],[20,22,22,22],[20,23,22,23],[20,24,22,24],[23,0,26,0],[23,1,26,3],[23,4,26,4],[23,35,26,35],[23,36,26,36],[24,5,26,5],[24,6,26,6],[24,7,26,7],[24,8,26,8],[24,9,26,9],[24,10,26,10],[24,11,26,11],[24,12,26,12],[24,13,26,13],[24,14,26,14],[24,15,26,15],[24,16,26,16],[24,17,26,17],[24,18,26,18],[24,19,26,19],[24,20,26,20],[24,21,26,21],[24,22,26,22],[24,23,26,23],[24,24,26,24],[27,0,30,0],[27,1,30,3],[27,4,30,4],[27,35,30,35],[27,36,30,36],[28,5,30,5],[28,6,30,6],[28,7,30,7],[28,8,30,8],[28,9,30,9],[28,10,30,10],[28,11,30,11],[28,12,30,12],[28,13,30,13],[28,14,30,14],[28,15,30,15],[28,16,30,16],[28,17,30,17],[28,18,30,18],[28,19,30,19],[28,20,30,20],[28,21,30,21],[28,22,30,22],[28,23,30,23],[28,24,30,24],[31,0,31,4]]}
[]
["POLOŽKOVÝ LIST                                                                                      "]
[{"$f":"Vstup!C2&IF(Vstup!C3<>\"\",\", \"&Vstup!C3,\"\")","v":"Josefovský brokový trojboj, 60 TERČŮ"}]
[{"$f":"Vstup!C4&\", \"&Vstup!C5","v":"SPORTING, 20.03.2022"}]
[]
["Skupina: ",null,13,"Kolo :",1,"Rozhodčí:",{"$nulls":3},"____________________________________________________________________________________________",{"$nulls":25},"∑","Podpis"]
["St. č.","Příjmení, jméno",null,null,"Kat.","Terče"]
[73,{"$nulls":3},{"$error":"#N/A"},20,19,18,17,16,15,14,13,12,11,10,9,8,7,6,5,4,3,2,1]
[]
[]
[]
[74,{"$nulls":3},{"$error":"#N/A"},20,19,18,17,16,15,14,13,12,11,10,9,8,7,6,5,4,3,2,1]
[]
[]
[]
[75,{"$nulls":3},{"$error":"#N/A"},20,19,18,17,16,15,14,13,12,11,10,9,8,7,6,5,4,3,2,1]
[]
[]
[]
[76,{"$nulls":3},{"$error":"#N/A"},20,19,18,17,16,15,14,13,12,11,10,9,8,7,6,5,4,3,2,1]
[]
[]
[]
[77,{"$nulls":3},{"$error":"#N/A"},20,19,18,17,16,15,14,13,12,11,10,9,8,7,6,5,4,3,2,1]
[]
[]
[]
[78,{"$nulls":3},{"$error":"#N/A"},20,19,18,17,16,15,14,13,12,11,10,9,8,7,6,5,4,3,2,1]
[]
[]
[]
["Poznámky:"]

{"sheet":"Sk14","index":20,"n_rows":32,"n_cols":37,"rows_kept":32,"hidden":true,"merged":[[1,0,1,36],[2,0,2,36],[3,0,3,36],[5,0,5,1],[5,5,5,8],[5,9,5,34],[5,35,6,35],[5,36,6,36],[6,1,6,3],[6,5,6,34],[7,0,10,0],[7,1,10,3],[7,4,10,4],[7,35,10,35],[7,36,10,36],[8,5,10,5],[8,6,10,6],[8,7,10,7],[8,8,10,8],[8,9,10,9],[8,10,10,10],[8,11,10,11],[8,12,10,12],[8,13,10,13],[8,14,10,14],[8,15,10,15],[8,16,10,16],[8,17,10,17],[8,18,10,18],[8,19,10,19],[8,20,10,20],[8,21,10,21],[8,22,10,22],[8,23,10,23],[8,24,10,24],[11,0,14,0],[11,1,14,3],[11,4,14,4],[11,35,14,35],[11,36,14,36],[12,5,14,5],[12,6,14,6],[12,7,14,7],[12,8,14,8],[12,9,14,9],[12,10,14,10],[12,11,14,11],[12,12,14,12],[12,13,14,13],[12,14,14,14],[12,15,14,15],[12,16,14,16],[12,17,14,17],[12,18,14,18],[12,19,14,19],[12,20,14,20],[12,21,14,21],[12,22,14,22],[12,23,14,23],[12,24,14,24],[15,0,18,0],[15,1,18,3],[15,4,18,4],[15,35,18,35],[15,36,18,36],[16,5,18,5],[16,6,18,6],[16,7,18,7],[16,8,18,8],[16,9,18,9],[16,10,18,10],[16,11,18,11],[16,12,18,12],[16,13,18,13],[16,14,18,14],[16,15,18,15],[16,16,18,16],[16,17,18,17],[16,18,18,18],[16,19,18,19],[16,20,18,20],[16,21,18,21],[16,22,18,22],[16,23,18,23],[16,24,18,24],[19,0,22,0],[19,1,22,3],[19,4,22,4],[19,35,22,35],[19,36,22,36],[20,5,22,5],[20,6,22,6],[20,7,22,7],[20,8,22,8],[20,9,22,9],[20,10,22,10],[20,11,22,11],[20,12,22,12],[20,13,22,13],[20,14,22,14],[20,15,22,15],[20,16,22,16],[20,17,22,17],[20,18,22,18],[20,19,22,19],[20,20,22,20],[20,21,22,21],[20,22,22,22],[20,23,22,23],[20,24,22,24],[23,0,26,0],[23,1,26,3],[23,4,26,4],[23,35,26,35],[23,36,26,36],[24,5,26,5],[24,6,26,6],[24,7,26,7],[24,8,26,8],[24,9,26,9],[24,10,26,10],[24,11,26,11],[24,12,26,12],[24,13,26,13],[24,14,26,14],[24,15,26,15],[24,16,26,16],[24,17,26,17],[24,18,26,18],[24,19,26,19],[24,20,26,20],[24,21,26,21],[24,22,26,22],[24,23,26,23],[24,24,26,24],[27,0,30,0],[27,1,30,3],[27,4,30,4],[27,35,30,35],[27,36,30,36],[28,5,30,5],[28,6,30,6],[28,7,30,7],[28,8,30,8],[28,9,30,9],[28,10,30,10],[28,11,30,11],[28,12,30,12],[28,13,30,13],[28,14,30,14],[28,15,30,15],[28,16,30,16],[28,17,30,17],[28,18,30,18],[28,19,30,19],[28,20,30,20],[28,21,30,21],[28,22,30,22],[28,23,30,23],[28,24,30,24],[31,0,31,4]]}
[]
["POLOŽKOVÝ LIST                                                                                      "]
[{"$f":"Vstup!C2&IF(Vstup!C3<>\"\",\", \"&Vstup!C3,\"\")","v":"Josefovský brokový trojboj, 60 TERČŮ"}]
[{"$f":"Vstup!C4&\", \"&Vstup!C5","v":"SPORTING, 20.03.2022"}]
[]
["Skupina: ",null,14,"Kolo :",1,"Rozhodčí:",{"$nulls":3},"____________________________________________________________________________________________",{"$nulls":25},"∑","Podpis"]
["St. č.","Příjmení, jméno",null,null,"Kat.","Terče"]
[79,{"$nulls":3},{"$error":"#N/A"},20,19,18,17,16,15,14,13,12,11,10,9,8,7,6,5,4,3,2,1]
[]
[]
[]
[80,{"$nulls":3},{"$error":"#N/A"},20,19,18,17,16,15,14,13,12,11,10,9,8,7,6,5,4,3,2,1]
[]
[]
[]
[81,{"$nulls":3},{"$error":"#N/A"},20,19,18,17,16,15,14,13,12,11,10,9,8,7,6,5,4,3,2,1]
[]
[]
[]
[82,{"$nulls":3},{"$error":"#N/A"},20,19,18,17,16,15,14,13,12,11,10,9,8,7,6,5,4,3,2,1]
[]
[]
[]
[83,{"$nulls":3},{"$error":"#N/A"},20,19,18,17,16,15,14,13,12,11,10,9,8,7,6,5,4,3,2,1]
[]
[]
[]
[84,{"$nulls":3},{"$error":"#N/A"},20,19,18,17,16,15,14,13,12,11,10,9,8,7,6,5,4,3,2,1]
[]
[]
[]
["Poznámky:"]

{"sheet":"Sk15","index":21,"n_rows":32,"n_cols":37,"rows_kept":32,"hidden":true,"merged":[[1,0,1,36],[2,0,2,36],[3,0,3,36],[5,0,5,1],[5,5,5,8],[5,9,5,34],[5,35,6,35],[5,36,6,36],[6,1,6,3],[6,5,6,34],[7,0,10,0],[7,1,10,3],[7,4,10,4],[7,35,10,35],[7,36,10,36],[8,5,10,5],[8,6,10,6],[8,7,10,7],[8,8,10,8],[8,9,10,9],[8,10,10,10],[8,11,10,11],[8,12,10,12],[8,13,10,13],[8,14,10,14],[8,15,10,15],[8,16,10,16],[8,17,10,17],[8,18,10,18],[8,19,10,19],[8,20,10,20],[8,21,10,21],[8,22,10,22],[8,23,10,23],[8,24,10,24],[11,0,14,0],[11,1,14,3],[11,4,14,4],[11,35,14,35],[11,36,14,36],[12,5,14,5],[12,6,14,6],[12,7,14,7],[12,8,14,8],[12,9,14,9],[12,10,14,10],[12,11,14,11],[12,12,14,12],[12,13,14,13],[12,14,14,14],[12,15,14,15],[12,16,14,16],[12,17,14,17],[12,18,14,18],[12,19,14,19],[12,20,14,20],[12,21,14,21],[12,22,14,22],[12,23,14,23],[12,24,14,24],[15,0,18,0],[15,1,18,3],[15,4,18,4],[15,35,18,35],[15,36,18,36],[16,5,18,5],[16,6,18,6],[16,7,18,7],[16,8,18,8],[16,9,18,9],[16,10,18,10],[16,11,18,11],[16,12,18,12],[16,13,18,13],[16,14,18,14],[16,15,18,15],[16,16,18,16],[16,17,18,17],[16,18,18,18],[16,19,18,19],[16,20,18,20],[16,21,18,21],[16,22,18,22],[16,23,18,23],[16,24,18,24],[19,0,22,0],[19,1,22,3],[19,4,22,4],[19,35,22,35],[19,36,22,36],[20,5,22,5],[20,6,22,6],[20,7,22,7],[20,8,22,8],[20,9,22,9],[20,10,22,10],[20,11,22,11],[20,12,22,12],[20,13,22,13],[20,14,22,14],[20,15,22,15],[20,16,22,16],[20,17,22,17],[20,18,22,18],[20,19,22,19],[20,20,22,20],[20,21,22,21],[20,22,22,22],[20,23,22,23],[20,24,22,24],[23,0,26,0],[23,1,26,3],[23,4,26,4],[23,35,26,35],[23,36,26,36],[24,5,26,5],[24,6,26,6],[24,7,26,7],[24,8,26,8],[24,9,26,9],[24,10,26,10],[24,11,26,11],[24,12,26,12],[24,13,26,13],[24,14,26,14],[24,15,26,15],[24,16,26,16],[24,17,26,17],[24,18,26,18],[24,19,26,19],[24,20,26,20],[24,21,26,21],[24,22,26,22],[24,23,26,23],[24,24,26,24],[27,0,30,0],[27,1,30,3],[27,4,30,4],[27,35,30,35],[27,36,30,36],[28,5,30,5],[28,6,30,6],[28,7,30,7],[28,8,30,8],[28,9,30,9],[28,10,30,10],[28,11,30,11],[28,12,30,12],[28,13,30,13],[28,14,30,14],[28,15,30,15],[28,16,30,16],[28,17,30,17],[28,18,30,18],[28,19,30,19],[28,20,30,20],[28,21,30,21],[28,22,30,22],[28,23,30,23],[28,24,30,24],[31,0,31,4]]}
[]
["POLOŽKOVÝ LIST                                                                                      "]
[{"$f":"Vstup!C2&IF(Vstup!C3<>\"\",\", \"&Vstup!C3,\"\")","v":"Josefovský brokový trojboj, 60 TERČŮ"}]
[{"$f":"Vstup!C4&\", \"&Vstup!C5","v":"SPORTING, 20.03.2022"}]
[]
["Skupina: ",null,15,"Kolo :",8,"Rozhodčí:",{"$nulls":3},"____________________________________________________________________________________________",{"$nulls":25},"∑","Podpis"]
["St. č.","Příjmení, jméno",null,null,"Kat.","Terče"]
[86,"Štengl Jiří",null,null,"A",20,19,18,17,16,15,14,13,12,11,10,9,8,7,6,5,4,3,2,1]
[]
[]
[]
[87,"Zigo Martin",null,null,"A",20,19,18,17,16,15,14,13,12,11,10,9,8,7,6,5,4,3,2,1]
[]
[]
[]
[88,"Špaček Pavel",null,null,"A",20,19,18,17,16,15,14,13,12,11,10,9,8,7,6,5,4,3,2,1]
[]
[]
[]
[89,{"$nulls":3},{"$error":"#N/A"},20,19,18,17,16,15,14,13,12,11,10,9,8,7,6,5,4,3,2,1]
[]
[]
[]
[90,{"$nulls":3},{"$error":"#N/A"},20,19,18,17,16,15,14,13,12,11,10,9,8,7,6,5,4,3,2,1]
[]
[]
[]
[85,"Otáhal Milan",null,null,"V",20,19,18,17,16,15,14,13,12,11,10,9,8,7,6,5,4,3,2,1]
[]
[]
[]
["Poznámky:"]

{"sheet":"Sk16","index":22,"n_rows":32,"n_cols":37,"rows_kept":32,"hidden":true,"merged":[[1,0,1,36],[2,0,2,36],[3,0,3,36],[5,0,5,1],[5,5,5,8],[5,9,5,34],[5,35,6,35],[5,36,6,36],[6,1,6,3],[6,5,6,34],[7,0,10,0],[7,1,10,3],[7,4,10,4],[7,35,10,35],[7,36,10,36],[8,5,10,5],[8,6,10,6],[8,7,10,7],[8,8,10,8],[8,9,10,9],[8,10,10,10],[8,11,10,11],[8,12,10,12],[8,13,10,13],[8,14,10,14],[8,15,10,15],[8,16,10,16],[8,17,10,17],[8,18,10,18],[8,19,10,19],[8,20,10,20],[8,21,10,21],[8,22,10,22],[8,23,10,23],[8,24,10,24],[11,0,14,0],[11,1,14,3],[11,4,14,4],[11,35,14,35],[11,36,14,36],[12,5,14,5],[12,6,14,6],[12,7,14,7],[12,8,14,8],[12,9,14,9],[12,10,14,10],[12,11,14,11],[12,12,14,12],[12,13,14,13],[12,14,14,14],[12,15,14,15],[12,16,14,16],[12,17,14,17],[12,18,14,18],[12,19,14,19],[12,20,14,20],[12,21,14,21],[12,22,14,22],[12,23,14,23],[12,24,14,24],[15,0,18,0],[15,1,18,3],[15,4,18,4],[15,35,18,35],[15,36,18,36],[16,5,18,5],[16,6,18,6],[16,7,18,7],[16,8,18,8],[16,9,18,9],[16,10,18,10],[16,11,18,11],[16,12,18,12],[16,13,18,13],[16,14,18,14],[16,15,18,15],[16,16,18,16],[16,17,18,17],[16,18,18,18],[16,19,18,19],[16,20,18,20],[16,21,18,21],[16,22,18,22],[16,23,18,23],[16,24,18,24],[19,0,22,0],[19,1,22,3],[19,4,22,4],[19,35,22,35],[19,36,22,36],[20,5,22,5],[20,6,22,6],[20,7,22,7],[20,8,22,8],[20,9,22,9],[20,10,22,10],[20,11,22,11],[20,12,22,12],[20,13,22,13],[20,14,22,14],[20,15,22,15],[20,16,22,16],[20,17,22,17],[20,18,22,18],[20,19,22,19],[20,20,22,20],[20,21,22,21],[20,22,22,22],[20,23,22,23],[20,24,22,24],[23,0,26,0],[23,1,26,3],[23,4,26,4],[23,35,26,35],[23,36,26,36],[24,5,26,5],[24,6,26,6],[24,7,26,7],[24,8,26,8],[24,9,26,9],[24,10,26,10],[24,11,26,11],[24,12,26,12],[24,13,26,13],[24,14,26,14],[24,15,26,15],[24,16,26,16],[24,17,26,17],[24,18,26,18],[24,19,26,19],[24,20,26,20],[24,21,26,21],[24,22,26,22],[24,23,26,23],[24,24,26,24],[27,0,30,0],[27,1,30,3],[27,4,30,4],[27,35,30,35],[27,36,30,36],[28,5,30,5],[28,6,30,6],[28,7,30,7],[28,8,30,8],[28,9,30,9],[28,10,30,10],[28,11,30,11],[28,12,30,12],[28,13,30,13],[28,14,30,14],[28,15,30,15],[28,16,30,16],[28,17,30,17],[28,18,30,18],[28,19,30,19],[28,20,30,20],[28,21,30,21],[28,22,30,22],[28,23,30,23],[28,24,30,24],[31,0,31,4]]}
[]
["POLOŽKOVÝ LIST                                                                                      "]
[{"$f":"Vstup!C2&IF(Vstup!C3<>\"\",\", \"&Vstup!C3,\"\")","v":"Josefovský brokový trojboj, 60 TERČŮ"}]
[{"$f":"Vstup!C4&\", \"&Vstup!C5","v":"SPORTING, 20.03.2022"}]
[]
["Skupina: ",null,16,"Kolo :",1,"Rozhodčí:",{"$nulls":3},"____________________________________________________________________________________________",{"$nulls":25},"∑","Podpis"]
["St. č.","Příjmení, jméno",null,null,"Kat.","Terče"]
[91,{"$nulls":3},{"$error":"#N/A"},20,19,18,17,16,15,14,13,12,11,10,9,8,7,6,5,4,3,2,1]
[]
[]
[]
[92,{"$nulls":3},{"$error":"#N/A"},20,19,18,17,16,15,14,13,12,11,10,9,8,7,6,5,4,3,2,1]
[]
[]
[]
[93,{"$nulls":3},{"$error":"#N/A"},20,19,18,17,16,15,14,13,12,11,10,9,8,7,6,5,4,3,2,1]
[]
[]
[]
[94,{"$nulls":3},{"$error":"#N/A"},20,19,18,17,16,15,14,13,12,11,10,9,8,7,6,5,4,3,2,1]
[]
[]
[]
[95,{"$nulls":3},{"$error":"#N/A"},20,19,18,17,16,15,14,13,12,11,10,9,8,7,6,5,4,3,2,1]
[]
[]
[]
[96,{"$nulls":3},{"$error":"#N/A"},20,19,18,17,16,15,14,13,12,11,10,9,8,7,6,5,4,3,2,1]
[]
[]
[]
["Poznámky:"]

{"sheet":"Sk17","index":23,"n_rows":32,"n_cols":37,"rows_kept":32,"hidden":true,"merged":[[1,0,1,36],[2,0,2,36],[3,0,3,36],[5,0,5,1],[5,5,5,8],[5,9,5,34],[5,35,6,35],[5,36,6,36],[6,1,6,3],[6,5,6,34],[7,0,10,0],[7,1,10,3],[7,4,10,4],[7,35,10,35],[7,36,10,36],[8,5,10,5],[8,6,10,6],[8,7,10,7],[8,8,10,8],[8,9,10,9],[8,10,10,10],[8,11,10,11],[8,12,10,12],[8,13,10,13],[8,14,10,14],[8,15,10,15],[8,16,10,16],[8,17,10,17],[8,18,10,18],[8,19,10,19],[8,20,10,20],[8,21,10,21],[8,22,10,22],[8,23,10,23],[8,24,10,24],[11,0,14,0],[11,1,14,3],[11,4,14,4],[11,35,14,35],[11,36,14,36],[12,5,14,5],[12,6,14,6],[12,7,14,7],[12,8,14,8],[12,9,14,9],[12,10,14,10],[12,11,14,11],[12,12,14,12],[12,13,14,13],[12,14,14,14],[12,15,14,15],[12,16,14,16],[12,17,14,17],[12,18,14,18],[12,19,14,19],[12,20,14,20],[12,21,14,21],[12,22,14,22],[12,23,14,23],[12,24,14,24],[15,0,18,0],[15,1,18,3],[15,4,18,4],[15,35,18,35],[15,36,18,36],[16,5,18,5],[16,6,18,6],[16,7,18,7],[16,8,18,8],[16,9,18,9],[16,10,18,10],[16,11,18,11],[16,12,18,12],[16,13,18,13],[16,14,18,14],[16,15,18,15],[16,16,18,16],[16,17,18,17],[16,18,18,18],[16,19,18,19],[16,20,18,20],[16,21,18,21],[16,22,18,22],[16,23,18,23],[16,24,18,24],[19,0,22,0],[19,1,22,3],[19,4,22,4],[19,35,22,35],[19,36,22,36],[20,5,22,5],[20,6,22,6],[20,7,22,7],[20,8,22,8],[20,9,22,9],[20,10,22,10],[20,11,22,11],[20,12,22,12],[20,13,22,13],[20,14,22,14],[20,15,22,15],[20,16,22,16],[20,17,22,17],[20,18,22,18],[20,19,22,19],[20,20,22,20],[20,21,22,21],[20,22,22,22],[20,23,22,23],[20,24,22,24],[23,0,26,0],[23,1,26,3],[23,4,26,4],[23,35,26,35],[23,36,26,36],[24,5,26,5],[24,6,26,6],[24,7,26,7],[24,8,26,8],[24,9,26,9],[24,10,26,10],[24,11,26,11],[24,12,26,12],[24,13,26,13],[24,14,26,14],[24,15,26,15],[24,16,26,16],[24,17,26,17],[24,18,26,18],[24,19,26,19],[24,20,26,20],[24,21,26,21],[24,22,26,22],[24,23,26,23],[24,24,26,24],[27,0,30,0],[27,1,30,3],[27,4,30,4],[27,35,30,35],[27,36,30,36],[28,5,30,5],[28,6,30,6],[28,7,30,7],[28,8,30,8],[28,9,30,9],[28,10,30,10],[28,11,30,11],[28,12,30,12],[28,13,30,13],[28,14,30,14],[28,15,30,15],[28,16,30,16],[28,17,30,17],[28,18,30,18],[28,19,30,19],[28,20,30,20],[28,21,30,21],[28,22,30,22],[28,23,30,23],[28,24,30,24],[31,0,31,4]]}
[]
["POLOŽKOVÝ LIST                                                                                      "]
[{"$f":"Vstup!C2&IF(Vstup!C3<>\"\",\", \"&Vstup!C3,\"\")","v":"Josefovský brokový trojboj, 60 TERČŮ"}]
[{"$f":"Vstup!C4&\", \"&Vstup!C5","v":"SPORTING, 20.03.2022"}]
[]
["Skupina: ",null,17,"Kolo :",1,"Rozhodčí:",{"$nulls":3},"____________________________________________________________________________________________",{"$nulls":25},"∑","Podpis"]
["St. č.","Příjmení, jméno",null,null,"Kat.","Terče"]
[97,{"$nulls":3},{"$error":"#N/A"},20,19,18,17,16,15,14,13,12,11,10,9,8,7,6,5,4,3,2,1]
[]
[]
[]
[98,{"$nulls":3},{"$error":"#N/A"},20,19,18,17,16,15,14,13,12,11,10,9,8,7,6,5,4,3,2,1]
[]
[]
[]
[99,{"$nulls":3},{"$error":"#N/A"},20,19,18,17,16,15,14,13,12,11,10,9,8,7,6,5,4,3,2,1]
[]
[]
[]
[100,{"$nulls":3},{"$error":"#N/A"},20,19,18,17,16,15,14,13,12,11,10,9,8,7,6,5,4,3,2,1]
[]
[]
[]
[101,{"$nulls":3},{"$error":"#N/A"},20,19,18,17,16,15,14,13,12,11,10,9,8,7,6,5,4,3,2,1]
[]
[]
[]
[102,{"$nulls":3},{"$error":"#N/A"},20,19,18,17,16,15,14,13,12,11,10,9,8,7,6,5,4,3,2,1]
[]
[]
[]
["Poznámky:"]

{"sheet":"Sk18","index":24,"n_rows":32,"n_cols":37,"rows_kept":32,"hidden":true,"merged":[[1,0,1,36],[2,0,2,36],[3,0,3,36],[5,0,5,1],[5,5,5,8],[5,9,5,34],[5,35,6,35],[5,36,6,36],[6,1,6,3],[6,5,6,34],[7,0,10,0],[7,1,10,3],[7,4,10,4],[7,35,10,35],[7,36,10,36],[8,5,10,5],[8,6,10,6],[8,7,10,7],[8,8,10,8],[8,9,10,9],[8,10,10,10],[8,11,10,11],[8,12,10,12],[8,13,10,13],[8,14,10,14],[8,15,10,15],[8,16,10,16],[8,17,10,17],[8,18,10,18],[8,19,10,19],[8,20,10,20],[8,21,10,21],[8,22,10,22],[8,23,10,23],[8,24,10,24],[11,0,14,0],[11,1,14,3],[11,4,14,4],[11,35,14,35],[11,36,14,36],[12,5,14,5],[12,6,14,6],[12,7,14,7],[12,8,14,8],[12,9,14,9],[12,10,14,10],[12,11,14,11],[12,12,14,12],[12,13,14,13],[12,14,14,14],[12,15,14,15],[12,16,14,16],[12,17,14,17],[12,18,14,18],[12,19,14,19],[12,20,14,20],[12,21,14,21],[12,22,14,22],[12,23,14,23],[12,24,14,24],[15,0,18,0],[15,1,18,3],[15,4,18,4],[15,35,18,35],[15,36,18,36],[16,5,18,5],[16,6,18,6],[16,7,18,7],[16,8,18,8],[16,9,18,9],[16,10,18,10],[16,11,18,11],[16,12,18,12],[16,13,18,13],[16,14,18,14],[16,15,18,15],[16,16,18,16],[16,17,18,17],[16,18,18,18],[16,19,18,19],[16,20,18,20],[16,21,18,21],[16,22,18,22],[16,23,18,23],[16,24,18,24],[19,0,22,0],[19,1,22,3],[19,4,22,4],[19,35,22,35],[19,36,22,36],[20,5,22,5],[20,6,22,6],[20,7,22,7],[20,8,22,8],[20,9,22,9],[20,10,22,10],[20,11,22,11],[20,12,22,12],[20,13,22,13],[20,14,22,14],[20,15,22,15],[20,16,22,16],[20,17,22,17],[20,18,22,18],[20,19,22,19],[20,20,22,20],[20,21,22,21],[20,22,22,22],[20,23,22,23],[20,24,22,24],[23,0,26,0],[23,1,26,3],[23,4,26,4],[23,35,26,35],[23,36,26,36],[24,5,26,5],[24,6,26,6],[24,7,26,7],[24,8,26,8],[24,9,26,9],[24,10,26,10],[24,11,26,11],[24,12,26,12],[24,13,26,13],[24,14,26,14],[24,15,26,15],[24,16,26,16],[24,17,26,17],[24,18,26,18],[24,19,26,19],[24,20,26,20],[24,21,26,21],[24,22,26,22],[24,23,26,23],[24,24,26,24],[27,0,30,0],[27,1,30,3],[27,4,30,4],[27,35,30,35],[27,36,30,36],[28,5,30,5],[28,6,30,6],[28,7,30,7],[28,8,30,8],[28,9,30,9],[28,10,30,10],[28,11,30,11],[28,12,30,12],[28,13,30,13],[28,14,30,14],[28,15,30,15],[28,16,30,16],[28,17,30,17],[28,18,30,18],[28,19,30,19],[28,20,30,20],[28,21,30,21],[28,22,30,22],[28,23,30,23],[28,24,30,24],[31,0,31,4]]}
[]
["POLOŽKOVÝ LIST                                                                                      "]
[{"$f":"Vstup!C2&IF(Vstup!C3<>\"\",\", \"&Vstup!C3,\"\")","v":"Josefovský brokový trojboj, 60 TERČŮ"}]
[{"$f":"Vstup!C4&\", \"&Vstup!C5","v":"SPORTING, 20.03.2022"}]
[]
["Skupina: ",null,18,"Kolo :",1,"Rozhodčí:",{"$nulls":3},"____________________________________________________________________________________________",{"$nulls":25},"∑","Podpis"]
["St. č.","Příjmení, jméno",null,null,"Kat.","Terče"]
[103,{"$nulls":3},{"$error":"#N/A"},20,19,18,17,16,15,14,13,12,11,10,9,8,7,6,5,4,3,2,1]
[]
[]
[]
[104,{"$nulls":3},{"$error":"#N/A"},20,19,18,17,16,15,14,13,12,11,10,9,8,7,6,5,4,3,2,1]
[]
[]
[]
[105,{"$nulls":3},{"$error":"#N/A"},20,19,18,17,16,15,14,13,12,11,10,9,8,7,6,5,4,3,2,1]
[]
[]
[]
[106,{"$nulls":3},{"$error":"#N/A"},20,19,18,17,16,15,14,13,12,11,10,9,8,7,6,5,4,3,2,1]
[]
[]
[]
[107,{"$nulls":3},{"$error":"#N/A"},20,19,18,17,16,15,14,13,12,11,10,9,8,7,6,5,4,3,2,1]
[]
[]
[]
[108,{"$nulls":3},{"$error":"#N/A"},20,19,18,17,16,15,14,13,12,11,10,9,8,7,6,5,4,3,2,1]
[]
[]
[]
["Poznámky:"]

{"sheet":"Sk19","index":25,"n_rows":32,"n_cols":37,"rows_kept":32,"hidden":true,"merged":[[1,0,1,36],[2,0,2,36],[3,0,3,36],[5,0,5,1],[5,5,5,8],[5,9,5,34],[5,35,6,35],[5,36,6,36],[6,1,6,3],[6,5,6,34],[7,0,10,0],[7,1,10,3],[7,4,10,4],[7,35,10,35],[7,36,10,36],[8,5,10,5],[8,6,10,6],[8,7,10,7],[8,8,10,8],[8,9,10,9],[8,10,10,10],[8,11,10,11],[8,12,10,12],[8,13,10,13],[8,14,10,14],[8,15,10,15],[8,16,10,16],[8,17,10,17],[8,18,10,18],[8,19,10,19],[8,20,10,20],[8,21,10,21],[8,22,10,22],[8,23,10,23],[8,24,10,24],[11,0,14,0],[11,1,14,3],[11,4,14,4],[11,35,14,35],[11,36,14,36],[12,5,14,5],[12,6,14,6],[12,7,14,7],[12,8,14,8],[12,9,14,9],[12,10,14,10],[12,11,14,11],[12,12,14,12],[12,13,14,13],[12,14,14,14],[12,15,14,15],[12,16,14,16],[12,17,14,17],[12,18,14,18],[12,19,14,19],[12,20,14,20],[12,21,14,21],[12,22,14,22],[12,23,14,23],[12,24,14,24],[15,0,18,0],[15,1,18,3],[15,4,18,4],[15,35,18,35],[15,36,18,36],[16,5,18,5],[16,6,18,6],[16,7,18,7],[16,8,18,8],[16,9,18,9],[16,10,18,10],[16,11,18,11],[16,12,18,12],[16,13,18,13],[16,14,18,14],[16,15,18,15],[16,16,18,16],[16,17,18,17],[16,18,18,18],[16,19,18,19],[16,20,18,20],[16,21,18,21],[16,22,18,22],[16,23,18,23],[16,24,18,24],[19,0,22,0],[19,1,22,3],[19,4,22,4],[19,35,22,35],[19,36,22,36],[20,5,22,5],[20,6,22,6],[20,7,22,7],[20,8,22,8],[20,9,22,9],[20,10,22,10],[20,11,22,11],[20,12,22,12],[20,13,22,13],[20,14,22,14],[20,15,22,15],[20,16,22,16],[20,17,22,17],[20,18,22,18],[20,19,22,19],[20,20,22,20],[20,21,22,21],[20,22,22,22],[20,23,22,23],[20,24,22,24],[23,0,26,0],[23,1,26,3],[23,4,26,4],[23,35,26,35],[23,36,26,36],[24,5,26,5],[24,6,26,6],[24,7,26,7],[24,8,26,8],[24,9,26,9],[24,10,26,10],[24,11,26,11],[24,12,26,12],[24,13,26,13],[24,14,26,14],[24,15,26,15],[24,16,26,16],[24,17,26,17],[24,18,26,18],[24,19,26,19],[24,20,26,20],[24,21,26,21],[24,22,26,22],[24,23,26,23],[24,24,26,24],[27,0,30,0],[27,1,30,3],[27,4,30,4],[27,35,30,35],[27,36,30,36],[28,5,30,5],[28,6,30,6],[28,7,30,7],[28,8,30,8],[28,9,30,9],[28,10,30,10],[28,11,30,11],[28,12,30,12],[28,13,30,13],[28,14,30,14],[28,15,30,15],[28,16,30,16],[28,17,30,17],[28,18,30,18],[28,19,30,19],[28,20,30,20],[28,21,30,21],[28,22,30,22],[28,23,30,23],[28,24,30,24],[31,0,31,4]]}
[]
["POLOŽKOVÝ LIST                                                                                      "]
[{"$f":"Vstup!C2&IF(Vstup!C3<>\"\",\", \"&Vstup!C3,\"\")","v":"Josefovský brokový trojboj, 60 TERČŮ"}]
[{"$f":"Vstup!C4&\", \"&Vstup!C5","v":"SPORTING, 20.03.2022"}]
[]
["Skupina: ",null,19,"Kolo :",1,"Rozhodčí:",{"$nulls":3},"____________________________________________________________________________________________",{"$nulls":25},"∑","Podpis"]
["St. č.","Příjmení, jméno",null,null,"Kat.","Terče"]
[109,{"$nulls":3},{"$error":"#N/A"},20,19,18,17,16,15,14,13,12,11,10,9,8,7,6,5,4,3,2,1]
[]
[]
[]
[110,{"$nulls":3},{"$error":"#N/A"},20,19,18,17,16,15,14,13,12,11,10,9,8,7,6,5,4,3,2,1]
[]
[]
[]
[111,{"$nulls":3},{"$error":"#N/A"},20,19,18,17,16,15,14,13,12,11,10,9,8,7,6,5,4,3,2,1]
[]
[]
[]
[112,{"$nulls":3},{"$error":"#N/A"},20,19,18,17,16,15,14,13,12,11,10,9,8,7,6,5,4,3,2,1]
[]
[]
[]
[113,{"$nulls":3},{"$error":"#N/A"},20,19,18,17,16,15,14,13,12,11,10,9,8,7,6,5,4,3,2,1]
[]
[]
[]
[114,{"$nulls":3},{"$error":"#N/A"},20,19,18,17,16,15,14,13,12,11,10,9,8,7,6,5,4,3,2,1]
[]
[]
[]
["Poznámky:"]

{"sheet":"Sk20","index":26,"n_rows":32,"n_cols":37,"rows_kept":32,"hidden":true,"merged":[[1,0,1,36],[2,0,2,36],[3,0,3,36],[5,0,5,1],[5,5,5,8],[5,9,5,34],[5,35,6,35],[5,36,6,36],[6,1,6,3],[6,5,6,34],[7,0,10,0],[7,1,10,3],[7,4,10,4],[7,35,10,35],[7,36,10,36],[8,5,10,5],[8,6,10,6],[8,7,10,7],[8,8,10,8],[8,9,10,9],[8,10,10,10],[8,11,10,11],[8,12,10,12],[8,13,10,13],[8,14,10,14],[8,15,10,15],[8,16,10,16],[8,17,10,17],[8,18,10,18],[8,19,10,19],[8,20,10,20],[8,21,10,21],[8,22,10,22],[8,23,10,23],[8,24,10,24],[11,0,14,0],[11,1,14,3],[11,4,14,4],[11,35,14,35],[11,36,14,36],[12,5,14,5],[12,6,14,6],[12,7,14,7],[12,8,14,8],[12,9,14,9],[12,10,14,10],[12,11,14,11],[12,12,14,12],[12,13,14,13],[12,14,14,14],[12,15,14,15],[12,16,14,16],[12,17,14,17],[12,18,14,18],[12,19,14,19],[12,20,14,20],[12,21,14,21],[12,22,14,22],[12,23,14,23],[12,24,14,24],[15,0,18,0],[15,1,18,3],[15,4,18,4],[15,35,18,35],[15,36,18,36],[16,5,18,5],[16,6,18,6],[16,7,18,7],[16,8,18,8],[16,9,18,9],[16,10,18,10],[16,11,18,11],[16,12,18,12],[16,13,18,13],[16,14,18,14],[16,15,18,15],[16,16,18,16],[16,17,18,17],[16,18,18,18],[16,19,18,19],[16,20,18,20],[16,21,18,21],[16,22,18,22],[16,23,18,23],[16,24,18,24],[19,0,22,0],[19,1,22,3],[19,4,22,4],[19,35,22,35],[19,36,22,36],[20,5,22,5],[20,6,22,6],[20,7,22,7],[20,8,22,8],[20,9,22,9],[20,10,22,10],[20,11,22,11],[20,12,22,12],[20,13,22,13],[20,14,22,14],[20,15,22,15],[20,16,22,16],[20,17,22,17],[20,18,22,18],[20,19,22,19],[20,20,22,20],[20,21,22,21],[20,22,22,22],[20,23,22,23],[20,24,22,24],[23,0,26,0],[23,1,26,3],[23,4,26,4],[23,35,26,35],[23,36,26,36],[24,5,26,5],[24,6,26,6],[24,7,26,7],[24,8,26,8],[24,9,26,9],[24,10,26,10],[24,11,26,11],[24,12,26,12],[24,13,26,13],[24,14,26,14],[24,15,26,15],[24,16,26,16],[24,17,26,17],[24,18,26,18],[24,19,26,19],[24,20,26,20],[24,21,26,21],[24,22,26,22],[24,23,26,23],[24,24,26,24],[27,0,30,0],[27,1,30,3],[27,4,30,4],[27,35,30,35],[27,36,30,36],[28,5,30,5],[28,6,30,6],[28,7,30,7],[28,8,30,8],[28,9,30,9],[28,10,30,10],[28,11,30,11],[28,12,30,12],[28,13,30,13],[28,14,30,14],[28,15,30,15],[28,16,30,16],[28,17,30,17],[28,18,30,18],[28,19,30,19],[28,20,30,20],[28,21,30,21],[28,22,30,22],[28,23,30,23],[28,24,30,24],[31,0,31,4]]}
[]
["POLOŽKOVÝ LIST                                                                                      "]
[{"$f":"Vstup!C2&IF(Vstup!C3<>\"\",\", \"&Vstup!C3,\"\")","v":"Josefovský brokový trojboj, 60 TERČŮ"}]
[{"$f":"Vstup!C4&\", \"&Vstup!C5","v":"SPORTING, 20.03.2022"}]
[]
["Skupina: ",null,20,"Kolo :",1,"Rozhodčí:",{"$nulls":3},"____________________________________________________________________________________________",{"$nulls":25},"∑","Podpis"]
["St. č.","Příjmení, jméno",null,null,"Kat.","Terče"]
[115,{"$nulls":3},{"$error":"#N/A"},20,19,18,17,16,15,14,13,12,11,10,9,8,7,6,5,4,3,2,1]
[]
[]
[]
[116,{"$nulls":3},{"$error":"#N/A"},20,19,18,17,16,15,14,13,12,11,10,9,8,7,6,5,4,3,2,1]
[]
[]
[]
[117,{"$nulls":3},{"$error":"#N/A"},20,19,18,17,16,15,14,13,12,11,10,9,8,7,6,5,4,3,2,1]
[]
[]
[]
[118,{"$nulls":3},{"$error":"#N/A"},20,19,18,17,16,15,14,13,12,11,10,9,8,7,6,5,4,3,2,1]
[]
[]
[]
[119,{"$nulls":3},{"$error":"#N/A"},20,19,18,17,16,15,14,13,12,11,10,9,8,7,6,5,4,3,2,1]
[]
[]
[]
[120,{"$nulls":3},{"$error":"#N/A"},20,19,18,17,16,15,14,13,12,11,10,9,8,7,6,5,4,3,2,1]
[]
[]
[]
["Poznámky:"]

{"sheet":"ASAT","index":27,"n_rows":424,"n_cols":28,"rows_kept":424,"hidden":true,"merged":[[0,3,0,27],[1,3,1,7],[1,23,3,23],[1,24,3,24],[1,25,3,25],[1,26,3,26],[1,27,3,27],[2,3,3,3],[2,4,3,4],[2,5,3,5],[2,6,3,6],[2,7,3,7]]}
[{"$nulls":3},"K A T E G O R I E  A S A T  2 0 1 3"]
[{"$nulls":8},"Ústaleč CS160","Ústaleč LP150","Vráž LP100","Písek ČMMJ CS100","Ústaleč LP150","Brno CS150","Ústaleč CS150","Bzenec LP200","Ústaleč LP200","Písek LP120","Š. Dvory CS200","Ústaleč LP150","Dnešice LP150","Ústaleč LP160","Vráž LP100","Počet absol. závodů","Celkový počet terčů","Celkový počet zásahů","Průměr","Kategorie"]
[{"$nulls":3},"Přijmeni","Jméno",null,"Kat","Datum narození","25.3.","7.4.","22.4.","29.4.","8.5.","19.5.","2.6.","16.-17.6.","5.-6.7.","21.7.","4.-5.8.","11.8.","2.9.","15.9.","6.10."]
[{"$nulls":8},160,150,100,100,150,150,150,200,200,120,200,150,150,160,100]
[{"$f":"D5&\" \"&E5&F5","v":"Čech Petr"},{"$f":"AB5","v":"J"},null,"Čech","Petr",null,"J",{"$nulls":4},79,{"$nulls":11},{"$f":"COUNTIF(I5:W5,\">0\")","v":1},{"$f":"IF(I5,$I$4) +IF(J5,$J$4) + IF(K5,$K$4) +IF(L5,$L$4) +IF(M5,$M$4) +IF(N5,$N$4) +IF(O5,$O$4) +IF(P5,$P$4) +IF(Q5,$Q$4) +IF(R5,$R$4) +IF(S5,$S$4) +IF(T5,$T$4) +IF(U5,$U$4) +IF(V5,$V$4) +IF(W5,$W$4)","v":100},{"$f":"SUM(I5:W5)","v":79},{"$f":"IF(Y5=0,0,Z5/Y5)","v":{"v":0.79,"d":"79.0%"}},"J"]
[{"$f":"D6&\" \"&E6&F6","v":"Chocholatý Libor"},{"$f":"AB6","v":"J"},null,"Chocholatý","Libor",null,"J",{"$nulls":4},78,{"$nulls":11},1,100,78,{"v":0.78,"d":"78.0%"},"J"]
["Hřebec Jan ml.","J",null,"Hřebec","Jan"," ml.","J",null,117,94,78,75,null,97,107,141,136,null,165,113,101,null,66,12,1810,1290,{"v":0.712707182320442,"d":"71.3%"},"J"]
["Kopáček Radim","J",null,"Kopáček","Radim",null,"J",{"$nulls":4},82,{"$nulls":5},81,{"$nulls":4},62,3,320,225,{"v":0.703125,"d":"70.3%"},"J"]
["Divíšek Martin ml.","J",null,"Divíšek","Martin"," ml.","J",null,98,97,null,65,72,null,99,null,null,81,138,103,102,null,83,10,1430,938,{"v":0.6559440559440559,"d":"65.6%"},"J"]
["Vaněk Matěj","J",null,"Vaněk","Matěj",null,"J",null,121,null,null,65,91,{"$nulls":3},132,{"$nulls":3},84,null,null,5,760,493,{"v":0.6486842105263158,"d":"64.9%"},"J"]
["Linhart Filip","J",null,"Linhart","Filip",null,"J",{"$nulls":8},128,{"$nulls":6},62,2,300,190,{"v":0.6333333333333333,"d":"63.3%"},"J"]
["Korčák Daniel","J",null,"Korčák","Daniel",null,"J",{"$nulls":4},63,{"$nulls":11},1,100,63,{"v":0.63,"d":"63.0%"},"J"]
["Čechura Miroslav","J",null,"Čechura","Miroslav",null,"J",null,91,82,{"$nulls":13},2,310,173,{"v":0.5580645161290323,"d":"55.8%"},"J"]
["Šindelář Jiří ml.","J",null,"Šindelář","Jiří"," ml.","J",{"$nulls":13},81,null,null,1,150,81,{"v":0.54,"d":"54.0%"},"J"]
["Můčka Michal","J",null,"Můčka","Michal",null,"J",{"$nulls":3},53,{"$nulls":5},107,{"$nulls":3},74,null,62,4,550,296,{"v":0.5381818181818182,"d":"53.8%"},"J"]
["Ferkl Jan ml.","J",null,"Ferkl","Jan"," ml.","J","1994-11-22",{"$nulls":15},0,0,0,{"v":0,"d":"0.0%"},"J"]
["Mikula Petr","J",null,"Mikula","Petr",null,"J",{"$nulls":16},0,0,0,{"v":0,"d":"0.0%"},"J"]
["Štenglová Michaela","Ž",null,"Štenglová","Michaela",null,"Ž",null,null,77,69,67,null,null,103,144,129,64,null,null,91,95,58,10,1430,897,{"v":0.6272727272727273,"d":"62.7%"},"Ž"]
["Urie Zuzana","Ž",null,"Urie","Zuzana",null,"Ž",{"$nulls":3},57,{"$nulls":6},64,{"$nulls":4},70,3,320,191,{"v":0.596875,"d":"59.7%"},"Ž"]
["Staňková Eva","Ž",null,"Staňková","Eva",null,"Ž",{"$nulls":4},59,{"$nulls":4},118,{"$nulls":6},2,300,177,{"v":0.59,"d":"59.0%"},"Ž"]
["Bajtlová Helena","Ž",null,"Bajtlová","Helena",null,"Ž",{"$nulls":3},52,{"$nulls":12},1,100,52,{"v":0.52,"d":"52.0%"},"Ž"]
["Hýnová Šárka","Ž",null,"Hýnová","Šárka",null,"Ž",null,61,{"$nulls":14},1,160,61,{"v":0.38125,"d":"38.1%"},"Ž"]
["Krejzová Vlasta","Ž",null,"Krejzová","Vlasta",null,"Ž","1959-06-27",{"$nulls":15},0,0,0,{"v":0,"d":"0.0%"},"Ž"]
["Víchová Anna","Ž",null,"Víchová","Anna",null,"Ž",{"$nulls":16},0,0,0,{"v":0,"d":"0.0%"},"Ž"]
["Wlodarczyk Remigiusz","A",null,"Wlodarczyk","Remigiusz",null,"S",{"$nulls":7},137,{"$nulls":8},1,150,137,{"v":0.9133333333333333,"d":"91.3%"},"A"]
["Zvolánek Petr","A",null,"Zvolánek","Petr",null,"S","1969-12-16",{"$nulls":11},137,{"$nulls":3},1,150,137,{"v":0.9133333333333333,"d":"91.3%"},"A"]
["Kořínek Jindřich","A",null,"Kořínek","Jindřich",null,"S","1960-04-05",{"$nulls":3},89,{"$nulls":11},1,100,89,{"v":0.89,"d":"89.0%"},"A"]
["Mrhálek Karel","A",null,"Mrhálek","Karel",null,"S","1960-06-27",{"$nulls":3},88,{"$nulls":11},1,100,88,{"v":0.88,"d":"88.0%"},"A"]
["Špaček Pavel","A",null,"Špaček","Pavel",null,"S",{"$nulls":3},87,85,{"$nulls":3},183,null,null,184,null,111,null,null,5,750,650,{"v":0.8666666666666667,"d":"86.7%"},"A"]
["Zázvorka Pavel","A",null,"Zázvorka","Pavel",null,"S","1962-10-05",148,126,90,95,121,null,142,null,174,101,null,null,118,124,86,11,1540,1325,{"v":0.8603896103896104,"d":"86.0%"},"A"]
["Rybín Milan","A",null,"Rybín","Milan",null,"S","1967-09-11",147,113,null,84,119,null,138,173,170,104,187,125,116,133,89,13,1990,1698,{"v":0.8532663316582915,"d":"85.3%"},"A"]
["Lyczykowski Kryzstof","A",null,"Lyczykowski","Kryzstof",null,"S",{"$nulls":6},127,{"$nulls":9},1,150,127,{"v":0.8466666666666667,"d":"84.7%"},"A"]
["Činčera Přemysl","A",null,"Činčera","Přemysl",null,"S","1963-10-02",140,124,90,89,116,null,143,null,168,96,null,132,118,121,92,12,1690,1429,{"v":0.8455621301775148,"d":"84.6%"},"A"]
["Můčka Igor","A",null,"Můčka","Igor",null,"S","1967-12-11",null,null,96,85,{"$nulls":3},174,159,{"$nulls":3},115,null,81,6,850,710,{"v":0.8352941176470589,"d":"83.5%"},"A"]
["Plucinski Marcin","A",null,"Plucinski","Marcin",null,"S",{"$nulls":6},125,{"$nulls":9},1,150,125,{"v":0.8333333333333334,"d":"83.3%"},"A"]
["Michálek Lubomír","A",null,"Michálek","Lubomír",null,"S","1967-03-10",139,125,null,null,108,119,129,176,152,101,186,null,null,128,null,10,1640,1363,{"v":0.8310975609756097,"d":"83.1%"},"A"]
["Halouzka Benedikt","A",null,"Halouzka","Benedikt",null,"S","1964-04-08",132,null,85,{"$nulls":11},81,3,360,298,{"v":0.8277777777777777,"d":"82.8%"},"A"]
["Kaminski Marcin","A",null,"Kaminski","Marcin",null,"S",{"$nulls":6},124,{"$nulls":9},1,150,124,{"v":0.8266666666666667,"d":"82.7%"},"A"]
["Divíšek Martin","A",null,"Divíšek","Martin",null,"S","1968-08-27",136,105,87,88,118,null,127,172,161,98,179,121,117,132,86,14,2090,1727,{"v":0.8263157894736842,"d":"82.6%"},"A"]
["Jankovský Jakub","A",null,"Jankovský","Jakub",null,"S","1992-02-02",null,110,86,78,null,130,{"$nulls":3},101,{"$nulls":5},5,620,505,{"v":0.8145161290322581,"d":"81.5%"},"A"]
["Jankovský Miroslav","A",null,"Jankovský","Miroslav",null,"S","1963-11-22",null,111,86,81,null,118,{"$nulls":3},99,174,122,null,null,79,8,1070,870,{"v":0.8130841121495327,"d":"81.3%"},"A"]
["Salaj Josef","A",null,"Salaj","Josef",null,"S","1962-07-05",null,null,82,{"$nulls":4},163,150,{"$nulls":3},126,null,87,5,750,608,{"v":0.8106666666666666,"d":"81.1%"},"A"]
["Někoranec Igor","A",null,"Někoranec","Igor",null,"S",{"$nulls":15},81,1,100,81,{"v":0.81,"d":"81.0%"},"A"]
["Škanta Marek","A",null,"Škanta","Marek",null,"S","1973-01-31",131,108,null,86,null,124,126,null,null,89,null,128,{"$nulls":3},7,980,792,{"v":0.8081632653061225,"d":"80.8%"},"A"]
["Hřebec Jan","A",null,"Hřebec","Jan",null,"S",null,131,115,89,78,114,117,124,171,153,86,171,121,116,130,92,15,2240,1808,{"v":0.8071428571428572,"d":"80.7%"},"A"]
["Němeček Josef","A",null,"Němeček","Josef",null,"S","1971-01-30",{"$nulls":5},121,{"$nulls":9},1,150,121,{"v":0.8066666666666666,"d":"80.7%"},"A"]
["Vaňáč Václav","A",null,"Vaňáč","Václav",null,"S","1961-01-18",129,null,83,89,113,null,132,null,155,94,{"$nulls":3},123,82,9,1240,1000,{"v":0.8064516129032258,"d":"80.6%"},"A"]
["Hruška Pavel","A",null,"Hruška","Pavel",null,"S","1961-04-23",{"$nulls":3},82,{"$nulls":3},155,null,null,164,{"$nulls":4},3,500,401,{"v":0.802,"d":"80.2%"},"A"]
["Šlechta Martin","A",null,"Šlechta","Martin",null,"S","1978-02-09",{"$nulls":3},78,null,null,121,{"$nulls":8},2,250,199,{"v":0.796,"d":"79.6%"},"A"]
["Stanislav Tomáš","A",null,"Stanislav","Tomáš",null,"S","1971-02-26",null,null,88,{"$nulls":4},165,158,{"$nulls":3},114,122,76,6,910,723,{"v":0.7945054945054945,"d":"79.5%"},"A"]
["Hondl František","A",null,"Hondl","František",null,"S","1979-07-09",null,112,83,{"$nulls":5},163,96,null,null,115,null,null,5,720,569,{"v":0.7902777777777777,"d":"79.0%"},"A"]
["Straka Ladislav ml.","A",null,"Straka","Ladislav"," ml.","S","1981-04-17",null,null,86,{"$nulls":6},87,{"$nulls":4},78,3,320,251,{"v":0.784375,"d":"78.4%"},"A"]
["Štengl Jiří","A",null,"Štengl","Jiří",null,"S","1969-08-31",119,114,79,79,109,null,132,165,161,96,null,null,116,108,84,12,1740,1362,{"v":0.7827586206896552,"d":"78.3%"},"A"]
["Komárek Josef","A",null,"Komárek","Josef",null,"S","1972-04-02",null,109,{"$nulls":3},106,131,167,155,85,168,null,null,116,81,9,1430,1118,{"v":0.7818181818181819,"d":"78.2%"},"A"]
["Vlček Martin","A",null,"Vlček","Martin",null,"S",{"$nulls":3},78,{"$nulls":12},1,100,78,{"v":0.78,"d":"78.0%"},"A"]
["Štícha Lubomír","A",null,"Štícha","Lubomír",null,"S",null,128,110,89,82,108,108,132,null,148,92,157,115,111,128,81,14,2040,1589,{"v":0.778921568627451,"d":"77.9%"},"A"]
["Kaprálek Michal","A",null,"Kaprálek","Michal",null,"S","1974-05-20",null,null,76,{"$nulls":6},90,{"$nulls":4},83,3,320,249,{"v":0.778125,"d":"77.8%"},"A"]
["Tomeček Karel","A",null,"Tomeček","Karel",null,"S","1965-07-09",{"$nulls":7},157,{"$nulls":6},76,2,300,233,{"v":0.7766666666666666,"d":"77.7%"},"A"]
["Černošek Milan","A",null,"Černošek","Milan",null,"S","1964-05-13",115,102,79,79,115,126,null,154,148,null,171,{"$nulls":3},83,10,1510,1172,{"v":0.776158940397351,"d":"77.6%"},"A"]
["Zigo Martin","A",null,"Zigo","Martin",null,"S","1971-12-29",{"$nulls":3},74,{"$nulls":3},157,{"$nulls":7},2,300,231,{"v":0.77,"d":"77.0%"},"A"]
["Pacal Antonín","A",null,"Pacal","Antonín",null,"S","1972-01-10",null,null,75,{"$nulls":11},79,2,200,154,{"v":0.77,"d":"77.0%"},"A"]
["Lengyel Jan","A",null,"Lengyel","Jan",null,"S","1988-07-24",119,110,82,null,114,116,null,null,160,null,null,114,null,null,78,8,1160,893,{"v":0.7698275862068965,"d":"77.0%"},"A"]
["Halouzka Lukáš","A",null,"Halouzka","Lukáš",null,"S",{"$nulls":16},0,0,0,{"v":0,"d":"0.0%"},"A"]
["Jarolím Zdeněk","A",null,"Jarolím","Zdeněk",null,"S",{"$nulls":16},0,0,0,{"v":0,"d":"0.0%"},"A"]
["Kobes Jan","A",null,"Kobes","Jan",null,"S","1973-07-17",{"$nulls":15},0,0,0,{"v":0,"d":"0.0%"},"A"]
["Kroupa Roman","A",null,"Kroupa","Roman",null,"S",{"$nulls":16},0,0,0,{"v":0,"d":"0.0%"},"A"]
["Musil Zdeněk","A",null,"Musil","Zdeněk",null,"S","1972-08-23",{"$nulls":15},0,0,0,{"v":0,"d":"0.0%"},"A"]
["Pápeš Milan","A",null,"Pápeš","Milan",null,"S","1970-03-13",{"$nulls":15},0,0,0,{"v":0,"d":"0.0%"},"A"]
["Pluczinski Marcin","A",null,"Pluczinski","Marcin",null,"S",{"$nulls":16},{"$f":"COUNTIF(I69:W69,\">0\")","v":0},{"$f":"IF(I69,$I$4) +IF(J69,$J$4) + IF(K69,$K$4) +IF(L69,$L$4) +IF(M69,$M$4) +IF(N69,$N$4) +IF(O69,$O$4) +IF(P69,$P$4) +IF(Q69,$Q$4) +IF(R69,$R$4) +IF(S69,$S$4) +IF(T69,$T$4) +IF(U69,$U$4) +IF(V69,$V$4) +IF(W69,$W$4)","v":0},{"$f":"SUM(I69:W69)","v":0},{"$f":"IF(Y69=0,0,Z69/Y69)","v":{"v":0,"d":"0.0%"}},"A"]
[{"$f":"D70&\" \"&E70&F70","v":"Podsedník Ladislav"},{"$f":"AB70","v":"A"},null,"Podsedník","Ladislav",null,"S",{"$nulls":16},0,0,0,{"v":0,"d":"0.0%"},"A"]
["Vranka Petr","A",null,"Vranka","Petr",null,"S",{"$nulls":16},0,0,0,{"v":0,"d":"0.0%"},"A"]
["Vrzáň Josef ml.","A",null,"Vrzáň","Josef"," ml.","S","1978-06-23",{"$nulls":15},0,0,0,{"v":0,"d":"0.0%"},"A"]
["Jiráček Zdeněk","B",null,"Jiráček","Zdeněk",null,"S","1958-01-07",{"$nulls":10},162,{"$nulls":3},68,2,300,230,{"v":0.7666666666666667,"d":"76.7%"},"B"]
["Pučálka Karel","B",null,"Pučálka","Karel",null,"S","1975-09-14",null,null,80,82,null,110,{"$nulls":4},155,{"$nulls":3},68,5,650,495,{"v":0.7615384615384615,"d":"76.2%"},"B"]
["Mácha Karel","B",null,"Mácha","Karel",null,"S","1968-10-25",null,null,78,78,{"$nulls":3},153,null,87,{"$nulls":5},4,520,396,{"v":0.7615384615384615,"d":"76.2%"},"B"]
["Čechura Martin","B",null,"Čechura","Martin",null,"S","1966-08-05",123,105,null,null,118,{"$nulls":6},123,null,117,null,5,770,586,{"v":0.7610389610389611,"d":"76.1%"},"B"]
["Honz Petr","B",null,"Honz","Petr",null,"S","1965-08-25",121,114,81,75,102,null,121,null,151,96,null,110,110,120,84,12,1690,1285,{"v":0.7603550295857988,"d":"76.0%"},"B"]
["Rykr Eduard","B",null,"Rykr","Eduard",null,"S","1962-01-28",null,null,76,{"$nulls":12},1,100,76,{"v":0.76,"d":"76.0%"},"B"]
["Vrbas Josef","B",null,"Vrbas","Josef",null,"S","1962-09-16",null,null,76,{"$nulls":12},1,100,76,{"v":0.76,"d":"76.0%"},"B"]
["Chaloupský Zdeněk","B",null,"Chaloupský","Zdeněk",null,"S",{"$nulls":4},76,{"$nulls":11},1,100,76,{"v":0.76,"d":"76.0%"},"B"]
["Dočkal Jiří","B",null,"Dočkal","Jiří",null,"S",{"$nulls":4},80,{"$nulls":10},71,2,200,151,{"v":0.755,"d":"75.5%"},"B"]
["Mateiczek Marek","B",null,"Mateiczek","Marek",null,"S",{"$nulls":6},113,{"$nulls":9},1,150,113,{"v":0.7533333333333333,"d":"75.3%"},"B"]
["Novák Libor","B",null,"Novák","Libor",null,"S","1975-05-23",null,112,null,null,110,{"$nulls":9},79,3,400,301,{"v":0.7525,"d":"75.3%"},"B"]
["Vaněk Roman","B",null,"Vaněk","Roman",null,"S","1972-02-24",120,98,81,78,99,null,124,null,150,91,null,129,114,109,null,11,1590,1193,{"v":0.7503144654088051,"d":"75.0%"},"B"]
["Kraus Josef","B",null,"Kraus","Josef",null,"S",{"$nulls":4},75,{"$nulls":11},1,100,75,{"v":0.75,"d":"75.0%"},"B"]
["Molnár Anton","B",null,"Molnár","Anton",null,"S",{"$nulls":3},71,{"$nulls":6},92,{"$nulls":4},76,3,320,239,{"v":0.746875,"d":"74.7%"},"B"]
["Staněk Tomáš","B",null,"Staněk","Tomáš",null,"S","1976-05-29",null,121,60,86,{"$nulls":3},135,158,{"$nulls":6},5,750,560,{"v":0.7466666666666667,"d":"74.7%"},"B"]
["Spanilý Ivo","B",null,"Spanilý","Ivo",null,"S","1969-04-27",null,null,73,{"$nulls":11},76,2,200,149,{"v":0.745,"d":"74.5%"},"B"]
["Sochor Jiří","B",null,"Sochor","Jiří",null,"S","1965-09-19",{"$nulls":7},149,{"$nulls":7},1,200,149,{"v":0.745,"d":"74.5%"},"B"]
["Borák Ondřej","B",null,"Borák","Ondřej",null,"S","1982-09-17",null,108,null,78,{"$nulls":11},2,250,186,{"v":0.744,"d":"74.4%"},"B"]
["Mocek Michal","B",null,"Mocek","Michal",null,"S","1977-06-21",{"$nulls":3},77,{"$nulls":8},109,null,null,2,250,186,{"v":0.744,"d":"74.4%"},"B"]
["Bělík Michal","B",null,"Bělík","Michal",null,"S","1977-08-16",null,null,74,{"$nulls":12},1,100,74,{"v":0.74,"d":"74.0%"},"B"]
["Chrudimský Petr","B",null,"Chrudimský","Petr",null,"S","1970-08-05",{"$nulls":3},74,{"$nulls":11},1,100,74,{"v":0.74,"d":"74.0%"},"B"]
["Koloc Martin","B",null,"Koloc","Martin",null,"S","1961-07-10",null,null,85,{"$nulls":6},80,160,115,100,109,76,7,980,725,{"v":0.7397959183673469,"d":"74.0%"},"B"]
["Fojt Martin","B",null,"Fojt","Martin",null,"S","1979-09-10",null,null,77,{"$nulls":11},70,2,200,147,{"v":0.735,"d":"73.5%"},"B"]
["Husar Vladimír","B",null,"Husar","Vladimír",null,"S","1973-03-13",123,100,77,83,101,{"$nulls":4},82,null,118,104,117,78,10,1340,983,{"v":0.7335820895522388,"d":"73.4%"},"B"]
["Ušatý Miroslav","B",null,"Ušatý","Miroslav",null,"S","1970-03-13",{"$nulls":3},73,{"$nulls":11},1,100,73,{"v":0.73,"d":"73.0%"},"B"]
["Lengyel Ivan","B",null,"Lengyel","Ivan",null,"S","1961-10-24",null,null,75,null,104,108,{"$nulls":3},87,null,114,{"$nulls":3},5,670,488,{"v":0.7283582089552239,"d":"72.8%"},"B"]
["Kadlec Miroslav","B",null,"Kadlec","Miroslav",null,"S","1983-10-06",{"$nulls":9},87,{"$nulls":5},1,120,87,{"v":0.725,"d":"72.5%"},"B"]
["Lengyel Jiří","B",null,"Lengyel","Jiří",null,"S","1961-10-24",null,102,85,null,99,112,{"$nulls":3},87,null,null,104,null,77,7,920,666,{"v":0.7239130434782609,"d":"72.4%"},"B"]
["Kyliánek Petr","B",null,"Kyliánek","Petr",null,"S","1971-05-11",{"$nulls":3},75,110,{"$nulls":4},82,{"$nulls":5},3,370,267,{"v":0.7216216216216216,"d":"72.2%"},"B"]
["Potůček Jaroslav","B",null,"Potůček","Jaroslav",null,"S","1974-10-18",null,null,72,{"$nulls":3},111,null,null,74,null,114,null,null,76,5,620,447,{"v":0.7209677419354839,"d":"72.1%"},"B"]
["Staněk Karel","B",null,"Staněk","Karel",null,"S","1981-04-13",null,93,null,83,{"$nulls":4},148,{"$nulls":6},3,450,324,{"v":0.72,"d":"72.0%"},"B"]
["Šrom Petr","B",null,"Šrom","Petr",null,"S",{"$nulls":4},72,{"$nulls":11},1,100,72,{"v":0.72,"d":"72.0%"},"B"]
["Vala Jiří","B",null,"Vala","Jiří",null,"S",{"$nulls":3},72,{"$nulls":12},1,100,72,{"v":0.72,"d":"72.0%"},"B"]
["Sokola Bronislav","B",null,"Sokola","Bronislav",null,"S","1966-06-19",null,null,76,{"$nulls":4},149,{"$nulls":4},97,null,73,4,550,395,{"v":0.7181818181818181,"d":"71.8%"},"B"]
["Hertl Igor","B",null,"Hertl","Igor",null,"S",{"$nulls":5},103,111,null,null,145,92,162,null,92,102,null,7,1130,807,{"v":0.7141592920353982,"d":"71.4%"},"B"]
["Mikulka Peter","B",null,"Mikulka","Peter",null,"S",null,122,null,73,76,99,100,123,149,129,83,156,null,96,102,74,13,1940,1382,{"v":0.7123711340206186,"d":"71.2%"},"B"]
["Petrůj Zdeněk","B",null,"Petrůj","Zdeněk",null,"S",{"$nulls":4},71,{"$nulls":11},1,100,71,{"v":0.71,"d":"71.0%"},"B"]
["Kotrc Karel","B",null,"Kotrc","Karel",null,"S","1960-12-10",{"$nulls":3},73,{"$nulls":5},83,{"$nulls":5},2,220,156,{"v":0.7090909090909091,"d":"70.9%"},"B"]
["Škrna Jiří","B",null,"Škrna","Jiří",null,"S",{"$nulls":10},85,{"$nulls":5},1,120,85,{"v":0.7083333333333334,"d":"70.8%"},"B"]
["Jedros Witold","B",null,"Jedros","Witold",null,"S",{"$nulls":7},106,{"$nulls":8},1,150,106,{"v":0.7066666666666667,"d":"70.7%"},"B"]
["Volf  Jan","B",null,"Volf ","Jan",null,"S",{"$nulls":8},141,{"$nulls":7},1,200,141,{"v":0.705,"d":"70.5%"},"B"]
["Steiner Jan","B",null,"Steiner","Jan",null,"S","1971-03-11",{"$nulls":4},103,{"$nulls":4},87,{"$nulls":5},2,270,190,{"v":0.7037037037037037,"d":"70.4%"},"B"]
["Žofka Josef","B",null,"Žofka","Josef",null,"S",null,null,102,{"$nulls":4},100,{"$nulls":4},108,null,117,null,4,610,427,{"v":0.7,"d":"70.0%"},"B"]
["Pulicar Jaroslav","B",null,"Pulicar","Jaroslav",null,"S",{"$nulls":3},66,74,{"$nulls":11},2,200,140,{"v":0.7,"d":"70.0%"},"B"]
["Cieplik Waldemar","B",null,"Cieplik","Waldemar",null,"S",{"$nulls":7},105,{"$nulls":8},1,150,105,{"v":0.7,"d":"70.0%"},"B"]
["Hanuš Jan","B",null,"Hanuš","Jan",null,"S","1970-03-13",{"$nulls":9},84,{"$nulls":5},1,120,84,{"v":0.7,"d":"70.0%"},"B"]
["Musel Jan","B",null,"Musel","Jan",null,"S","1970-03-13",{"$nulls":9},81,null,null,107,null,null,2,270,188,{"v":0.6962962962962963,"d":"69.6%"},"B"]
["Neuvirt Martin","B",null,"Neuvirt","Martin",null,"S","1978-08-08",99,84,null,54,102,null,119,null,151,null,158,115,104,111,65,11,1670,1162,{"v":0.6958083832335329,"d":"69.6%"},"B"]
["Kopáček Pavel","B",null,"Kopáček","Pavel",null,"S",{"$nulls":4},78,{"$nulls":5},74,{"$nulls":4},70,3,320,222,{"v":0.69375,"d":"69.4%"},"B"]
["Vostárek Jindřich","B",null,"Vostárek","Jindřich",null,"S",null,111,{"$nulls":14},1,160,111,{"v":0.69375,"d":"69.4%"},"B"]
["Divíšek Tomáš","B",null,"Divíšek","Tomáš",null,"S","1973-02-26",{"$nulls":12},104,null,null,1,150,104,{"v":0.6933333333333334,"d":"69.3%"},"B"]
["Hlaváček Václav","B",null,"Hlaváček","Václav",null,"S","1975-07-21",null,null,69,{"$nulls":12},1,100,69,{"v":0.69,"d":"69.0%"},"B"]
["Forster Gustav","B",null,"Forster","Gustav",null,"S",{"$nulls":3},69,{"$nulls":12},1,100,69,{"v":0.69,"d":"69.0%"},"B"]
["Krázel Stanislav","B",null,"Krázel","Stanislav",null,"S",{"$nulls":3},69,{"$nulls":12},1,100,69,{"v":0.69,"d":"69.0%"},"B"]
["Poupě Jaroslav","B",null,"Poupě","Jaroslav",null,"S",{"$nulls":3},69,{"$nulls":12},1,100,69,{"v":0.69,"d":"69.0%"},"B"]
["Čech Pavel","B",null,"Čech","Pavel",null,"S","1976-02-24",null,null,69,{"$nulls":12},1,100,69,{"v":0.69,"d":"69.0%"},"B"]
["Hanuš Jan","B",null,"Hanuš","Jan",null,"S",{"$nulls":13},103,null,null,1,150,103,{"v":0.6866666666666666,"d":"68.7%"},"B"]
["Málek Vlastimil","B",null,"Málek","Vlastimil",null,"S",null,null,100,78,null,93,{"$nulls":8},113,null,4,560,384,{"v":0.6857142857142857,"d":"68.6%"},"B"]
["Klement Petr","B",null,"Klement","Petr",null,"S",{"$nulls":3},65,{"$nulls":11},72,2,200,137,{"v":0.685,"d":"68.5%"},"B"]
["Vranka David","B",null,"Vranka","David",null,"S",{"$nulls":3},78,null,null,103,{"$nulls":8},57,3,350,238,{"v":0.68,"d":"68.0%"},"B"]
["Lebloch Vladimír","B",null,"Lebloch","Vladimír",null,"S",{"$nulls":15},68,{"$f":"COUNTIF(I133:W133,\">0\")","v":1},{"$f":"IF(I133,$I$4) +IF(J133,$J$4) + IF(K133,$K$4) +IF(L133,$L$4) +IF(M133,$M$4) +IF(N133,$N$4) +IF(O133,$O$4) +IF(P133,$P$4) +IF(Q133,$Q$4) +IF(R133,$R$4) +IF(S133,$S$4) +IF(T133,$T$4) +IF(U133,$U$4) +IF(V133,$V$4) +IF(W133,$W$4)","v":100},{"$f":"SUM(I133:W133)","v":68},{"$f":"IF(Y133=0,0,Z133/Y133)","v":{"v":0.68,"d":"68.0%"}},"B"]
[{"$f":"D134&\" \"&E134&F134","v":"Vrzáň Josef"},{"$f":"AB134","v":"B"},null,"Vrzáň","Josef",null,"S",{"$nulls":13},102,null,null,1,150,102,{"v":0.68,"d":"68.0%"},"B"]
["Prokop Jiří","B",null,"Prokop","Jiří",null,"S",{"$nulls":3},71,{"$nulls":6},87,null,null,88,105,77,5,630,428,{"v":0.6793650793650794,"d":"67.9%"},"B"]
["Vavrečka Michal","B",null,"Vavrečka","Michal",null,"S",{"$nulls":4},70,null,100,{"$nulls":6},101,null,67,4,500,338,{"v":0.676,"d":"67.6%"},"B"]
["Buda Dušan","B",null,"Buda","Dušan",null,"S",{"$nulls":15},67,1,100,67,{"v":0.67,"d":"67.0%"},"B"]
["Hnízdil Milan","B",null,"Hnízdil","Milan",null,"S","1957-03-04",{"$nulls":14},67,1,100,67,{"v":0.67,"d":"67.0%"},"B"]
["Frnoch Milan","B",null,"Frnoch","Milan",null,"S","1958-01-14",{"$nulls":3},67,{"$nulls":11},1,100,67,{"v":0.67,"d":"67.0%"},"B"]
["Němec Vít","B",null,"Němec","Vít",null,"S",null,null,98,61,{"$nulls":5},137,null,null,110,null,103,null,5,760,509,{"v":0.6697368421052632,"d":"67.0%"},"B"]
["Babický Jiří","B",null,"Babický","Jiří",null,"S","1966-04-10",{"$nulls":15},0,0,0,{"v":0,"d":"0.0%"},"B"]
["Bejček Václav ml.","B",null,"Bejček","Václav"," ml.","S",{"$nulls":16},0,0,0,{"v":0,"d":"0.0%"},"B"]
["Beneš Jan","B",null,"Beneš","Jan",null,"S","1968-12-05",{"$nulls":15},0,0,0,{"v":0,"d":"0.0%"},"B"]
["Červenka Zbyněk","B",null,"Červenka","Zbyněk",null,"S","1988-04-28",{"$nulls":15},0,0,0,{"v":0,"d":"0.0%"},"B"]
["Čuda Milan","B",null,"Čuda","Milan",null,"S","1974-01-23",{"$nulls":15},0,0,0,{"v":0,"d":"0.0%"},"B"]
["Hrouda Josef","B",null,"Hrouda","Josef",null,"S","1970-03-14",{"$nulls":15},0,0,0,{"v":0,"d":"0.0%"},"B"]
["Kaiser Vladimír","B",null,"Kaiser","Vladimír",null,"S",{"$nulls":16},0,0,0,{"v":0,"d":"0.0%"},"B"]
["Kodeš Václav","B",null,"Kodeš","Václav",null,"S","1962-06-11",{"$nulls":15},0,0,0,{"v":0,"d":"0.0%"},"B"]
["Krejza Jan","B",null,"Krejza","Jan",null,"S","1985-08-14",{"$nulls":15},0,0,0,{"v":0,"d":"0.0%"},"B"]
["Kytlica Vilém","B",null,"Kytlica","Vilém",null,"S",{"$nulls":16},0,0,0,{"v":0,"d":"0.0%"},"B"]
["Liška Vladislav","B",null,"Liška","Vladislav",null,"S",{"$nulls":16},0,0,0,{"v":0,"d":"0.0%"},"B"]
["Mach Jan","B",null,"Mach","Jan",null,"S",{"$nulls":16},0,0,0,{"v":0,"d":"0.0%"},"B"]
["Maruška Jaromír","B",null,"Maruška","Jaromír",null,"S","1976-08-12",{"$nulls":15},0,0,0,{"v":0,"d":"0.0%"},"B"]
["Minář Jaroslav","B",null,"Minář","Jaroslav",null,"S",{"$nulls":16},0,0,0,{"v":0,"d":"0.0%"},"B"]
["Mládek Jan","B",null,"Mládek","Jan",null,"S",{"$nulls":16},0,0,0,{"v":0,"d":"0.0%"},"B"]
["Nesiba Josef","B",null,"Nesiba","Josef",null,"S","1967-03-05",{"$nulls":15},0,0,0,{"v":0,"d":"0.0%"},"B"]
["Neuman Miloslav","B",null,"Neuman","Miloslav",null,"S","1982-03-16",{"$nulls":15},0,0,0,{"v":0,"d":"0.0%"},"B"]
["Ornst Milan","B",null,"Ornst","Milan",null,"S","1960-07-02",{"$nulls":15},0,0,0,{"v":0,"d":"0.0%"},"B"]
["Pandula  Ivan","B",null,"Pandula ","Ivan",null,"S",{"$nulls":16},0,0,0,{"v":0,"d":"0.0%"},"B"]
["Pospíšil Stanislav","B",null,"Pospíšil","Stanislav",null,"S",{"$nulls":16},0,0,0,{"v":0,"d":"0.0%"},"B"]
["Racek Petr","B",null,"Racek","Petr",null,"S",{"$nulls":16},0,0,0,{"v":0,"d":"0.0%"},"B"]
["Stránský Lukáš","B",null,"Stránský","Lukáš",null,"S",{"$nulls":16},0,0,0,{"v":0,"d":"0.0%"},"B"]
["Svoboda Vít","B",null,"Svoboda","Vít",null,"S",{"$nulls":16},0,0,0,{"v":0,"d":"0.0%"},"B"]
["Sysel Tomáš","B",null,"Sysel","Tomáš",null,"S",{"$nulls":16},0,0,0,{"v":0,"d":"0.0%"},"B"]
["Šílený Josef","B",null,"Šílený","Josef",null,"S",{"$nulls":16},0,0,0,{"v":0,"d":"0.0%"},"B"]
["Šindelář Milan","B",null,"Šindelář","Milan",null,"S","1962-10-17",{"$nulls":15},0,0,0,{"v":0,"d":"0.0%"},"B"]
["Tůma Martin","B",null,"Tůma","Martin",null,"S",{"$nulls":16},0,0,0,{"v":0,"d":"0.0%"},"B"]
["Valapka Peter","B",null,"Valapka","Peter",null,"S","1961-11-14",{"$nulls":15},0,0,0,{"v":0,"d":"0.0%"},"B"]
["Zíta Ladislav","B",null,"Zíta","Ladislav",null,"S",{"$nulls":16},0,0,0,{"v":0,"d":"0.0%"},"B"]
["Žák Josef","B",null,"Žák","Josef",null,"S",{"$nulls":16},0,0,0,{"v":0,"d":"0.0%"},"B"]
["Pražák Petr","C",null,"Pražák","Petr",null,"S","1983-05-15",{"$nulls":3},70,{"$nulls":8},97,null,null,2,250,167,{"v":0.668,"d":"66.8%"},"C"]
["Kaiser Vladimír","C",null,"Kaiser","Vladimír",null,"S",{"$nulls":10},80,{"$nulls":5},1,120,80,{"v":0.6666666666666666,"d":"66.7%"},"C"]
["Hertl Rastislav","C",null,"Hertl","Rastislav",null,"S",{"$nulls":6},101,null,134,{"$nulls":4},97,null,null,3,500,332,{"v":0.664,"d":"66.4%"},"C"]
["Kašpar Jiří","C",null,"Kašpar","Jiří",null,"S","1965-06-16",{"$nulls":12},96,null,70,2,250,166,{"v":0.664,"d":"66.4%"},"C"]
["Němec Tomáš","C",null,"Němec","Tomáš",null,"S",null,99,{"$nulls":3},109,null,105,null,135,70,null,98,{"$nulls":3},6,930,616,{"v":0.6623655913978495,"d":"66.2%"},"C"]
["Hýna Roman","C",null,"Hýna","Roman",null,"S",null,97,90,null,null,92,null,99,{"$nulls":4},101,null,120,null,6,920,599,{"v":0.6510869565217391,"d":"65.1%"},"C"]
["Čech Antonín","C",null,"Čech","Antonín",null,"S",{"$nulls":4},65,{"$nulls":11},1,100,65,{"v":0.65,"d":"65.0%"},"C"]
["Gregor Aleš","C",null,"Gregor","Aleš",null,"S","1964-07-29",null,null,70,null,null,96,null,141,null,81,null,null,86,null,58,6,820,532,{"v":0.6487804878048781,"d":"64.9%"},"C"]
["Vranák Martin","C",null,"Vranák","Martin",null,"S",null,103,82,61,null,91,null,114,140,107,null,null,103,93,104,76,11,1670,1074,{"v":0.6431137724550898,"d":"64.3%"},"C"]
["Červenka Jaroslav","C",null,"Červenka","Jaroslav",null,"S",{"$nulls":4},68,{"$nulls":8},92,null,null,2,250,160,{"v":0.64,"d":"64.0%"},"C"]
["Kirchner Milan","C",null,"Kirchner","Milan",null,"S","1966-11-11",{"$nulls":12},96,null,null,1,150,96,{"v":0.64,"d":"64.0%"},"C"]
["Walter Michael","C",null,"Walter","Michael",null,"S",{"$nulls":15},64,1,100,64,{"v":0.64,"d":"64.0%"},"C"]
["Vícha Jakub","C",null,"Vícha","Jakub",null,"S",null,113,{"$nulls":6},117,{"$nulls":7},2,360,230,{"v":0.6388888888888888,"d":"63.9%"},"C"]
["Matoušek Václav","C",null,"Matoušek","Václav",null,"S","1959-08-12",null,null,64,{"$nulls":9},95,null,null,2,250,159,{"v":0.636,"d":"63.6%"},"C"]
["Kolacia Pavel","C",null,"Kolacia","Pavel",null,"S",{"$nulls":8},127,{"$nulls":7},1,200,127,{"v":0.635,"d":"63.5%"},"C"]
["Černý Bohuslav","C",null,"Černý","Bohuslav",null,"S","1966-08-22",{"$nulls":12},95,null,null,1,150,95,{"v":0.6333333333333333,"d":"63.3%"},"C"]
["Hosnedl Pavel","C",null,"Hosnedl","Pavel",null,"S",{"$nulls":13},95,null,null,1,150,95,{"v":0.6333333333333333,"d":"63.3%"},"C"]
["Pospíšil Lubomír","C",null,"Pospíšil","Lubomír",null,"S",{"$nulls":6},95,{"$nulls":9},1,150,95,{"v":0.6333333333333333,"d":"63.3%"},"C"]
["Vrňák Libor","C",null,"Vrňák","Libor",null,"S",{"$nulls":15},63,1,100,63,{"v":0.63,"d":"63.0%"},"C"]
["Hoštička Eduard","C",null,"Hoštička","Eduard",null,"S","1974-03-29",107,91,{"$nulls":3},87,null,null,116,51,150,113,94,90,69,10,1540,968,{"v":0.6285714285714286,"d":"62.9%"},"C"]
["Rataj Václav","C",null,"Rataj","Václav",null,"S",null,92,84,null,null,83,null,116,{"$nulls":4},104,null,98,null,6,920,577,{"v":0.6271739130434782,"d":"62.7%"},"C"]
["Weiss Josef","C",null,"Weiss","Josef",null,"S","1962-08-19",null,80,{"$nulls":5},118,null,82,145,103,80,102,60,8,1230,770,{"v":0.6260162601626016,"d":"62.6%"},"C"]
["Zborník Karel","C",null,"Zborník","Karel",null,"S","1969-03-05",null,null,71,55,{"$nulls":8},93,null,null,3,350,219,{"v":0.6257142857142857,"d":"62.6%"},"C"]
["Kureš Jan","C",null,"Kureš","Jan",null,"S",{"$nulls":3},63,{"$nulls":8},93,null,null,62,3,350,218,{"v":0.6228571428571429,"d":"62.3%"},"C"]
["Korál Petr","C",null,"Korál","Petr",null,"S","1974-01-16",107,91,null,59,85,82,91,124,121,75,134,105,99,93,null,13,2040,1266,{"v":0.6205882352941177,"d":"62.1%"},"C"]
["Rykr Eduard ml.","C",null,"Rykr","Eduard"," ml.","S","1989-10-09",null,null,62,{"$nulls":12},1,100,62,{"v":0.62,"d":"62.0%"},"C"]
["Hlušička Martin","C",null,"Hlušička","Martin",null,"S",{"$nulls":4},62,{"$nulls":11},{"$f":"COUNTIF(I197:W197,\">0\")","v":1},{"$f":"IF(I197,$I$4) +IF(J197,$J$4) + IF(K197,$K$4) +IF(L197,$L$4) +IF(M197,$M$4) +IF(N197,$N$4) +IF(O197,$O$4) +IF(P197,$P$4) +IF(Q197,$Q$4) +IF(R197,$R$4) +IF(S197,$S$4) +IF(T197,$T$4) +IF(U197,$U$4) +IF(V197,$V$4) +IF(W197,$W$4)","v":100},{"$f":"SUM(I197:W197)","v":62},{"$f":"IF(Y197=0,0,Z197/Y197)","v":{"v":0.62,"d":"62.0%"}},"C"]
[{"$f":"D198&\" \"&E198&F198","v":"Mareš Petr"},{"$f":"AB198","v":"C"},null,"Mareš","Petr",null,"S",{"$nulls":13},93,null,null,1,150,93,{"v":0.62,"d":"62.0%"},"C"]
["Sahula Vlastimil","C",null,"Sahula","Vlastimil",null,"S","1967-02-15",null,84,62,{"$nulls":6},69,null,99,null,null,67,5,620,381,{"v":0.614516129032258,"d":"61.5%"},"C"]
["Backa Lukáš","C",null,"Backa","Lukáš",null,"S",{"$nulls":15},61,1,100,61,{"v":0.61,"d":"61.0%"},"C"]
["Vent Lubomír","C",null,"Vent","Lubomír",null,"S",{"$nulls":15},61,1,100,61,{"v":0.61,"d":"61.0%"},"C"]
["Štěrba Vladimír ml.","C",null,"Štěrba","Vladimír"," ml.","S",null,91,null,70,null,null,79,null,null,128,{"$nulls":5},65,5,710,433,{"v":0.6098591549295774,"d":"61.0%"},"C"]
["Hildprandt Jan","C",null,"Hildprandt","Jan",null,"S",{"$nulls":3},70,null,83,{"$nulls":9},59,3,350,212,{"v":0.6057142857142858,"d":"60.6%"},"C"]
["Horák František","C",null,"Horák","František",null,"S",{"$nulls":3},56,65,{"$nulls":11},2,200,121,{"v":0.605,"d":"60.5%"},"C"]
["Filippi Marcel","C",null,"Filippi","Marcel",null,"S","1972-11-12",null,null,59,{"$nulls":4},121,{"$nulls":4},83,null,69,4,550,332,{"v":0.6036363636363636,"d":"60.4%"},"C"]
["Šimánek Martin","C",null,"Šimánek","Martin",null,"S",{"$nulls":10},72,{"$nulls":5},1,120,72,{"v":0.6,"d":"60.0%"},"C"]
["Škripek Vladimír","C",null,"Škripek","Vladimír",null,"S",{"$nulls":15},60,1,100,60,{"v":0.6,"d":"60.0%"},"C"]
["Brabec Václav","C",null,"Brabec","Václav",null,"S","1960-07-06",null,99,null,null,85,{"$nulls":7},85,null,null,3,450,269,{"v":0.5977777777777777,"d":"59.8%"},"C"]
["Grabowi Adam","C",null,"Grabowi","Adam",null,"S",{"$nulls":6},89,{"$nulls":9},1,150,89,{"v":0.5933333333333334,"d":"59.3%"},"C"]
["Nosek Tomáš","C",null,"Nosek","Tomáš",null,"S","1981-07-20",null,97,51,{"$nulls":12},2,250,148,{"v":0.592,"d":"59.2%"},"C"]
["Loula Jaroslav","C",null,"Loula","Jaroslav",null,"S",{"$nulls":3},59,{"$nulls":12},1,100,59,{"v":0.59,"d":"59.0%"},"C"]
["Stejskal Miroslav","C",null,"Stejskal","Miroslav",null,"S",{"$nulls":15},59,1,100,59,{"v":0.59,"d":"59.0%"},"C"]
["Mrázek Lubomír","C",null,"Mrázek","Lubomír",null,"S",{"$nulls":5},79,{"$nulls":4},83,{"$nulls":3},88,60,4,530,310,{"v":0.5849056603773585,"d":"58.5%"},"C"]
["Čírtek Bohumil","C",null,"Čírtek","Bohumil",null,"S",{"$nulls":15},58,1,100,58,{"v":0.58,"d":"58.0%"},"C"]
["Greš Marek","C",null,"Greš","Marek",null,"S","1974-11-06",null,null,58,{"$nulls":12},1,100,58,{"v":0.58,"d":"58.0%"},"C"]
["Jirků Milan","C",null,"Jirků","Milan",null,"S",{"$nulls":4},58,{"$nulls":11},1,100,58,{"v":0.58,"d":"58.0%"},"C"]
["Pacák Miroslav","C",null,"Pacák","Miroslav",null,"S",{"$nulls":13},86,null,null,1,150,86,{"v":0.5733333333333334,"d":"57.3%"},"C"]
["Uher Petr","C",null,"Uher","Petr",null,"S",null,78,null,57,null,84,{"$nulls":4},60,121,98,null,null,63,7,980,561,{"v":0.5724489795918367,"d":"57.2%"},"C"]
["Hájek David","C",null,"Hájek","David",null,"S",{"$nulls":10},68,null,85,89,88,59,5,680,389,{"v":0.5720588235294117,"d":"57.2%"},"C"]
["Strnad Josef","C",null,"Strnad","Josef",null,"S",{"$nulls":3},64,null,79,{"$nulls":10},2,250,143,{"v":0.572,"d":"57.2%"},"C"]
["Jindříšek Pavel","C",null,"Jindříšek","Pavel",null,"S",{"$nulls":15},57,1,100,57,{"v":0.57,"d":"57.0%"},"C"]
["Dolanský Jan","C",null,"Dolanský","Jan",null,"S","1968-04-04",null,81,63,62,null,73,{"$nulls":3},64,null,93,{"$nulls":3},6,770,436,{"v":0.5662337662337662,"d":"56.6%"},"C"]
["Soukal František","C",null,"Soukal","František",null,"S",{"$nulls":10},63,{"$nulls":4},61,2,220,124,{"v":0.5636363636363636,"d":"56.4%"},"C"]
["Martin Josef","C",null,"Martin","Josef",null,"S",{"$nulls":13},84,null,null,1,150,84,{"v":0.56,"d":"56.0%"},"C"]
["Racek Petr","C",null,"Racek","Petr",null,"S",{"$nulls":13},84,null,null,1,150,84,{"v":0.56,"d":"56.0%"},"C"]
["Sobotka Jiří","C",null,"Sobotka","Jiří",null,"S",{"$nulls":15},56,1,100,56,{"v":0.56,"d":"56.0%"},"C"]
["Tarek Martin","C",null,"Tarek","Martin",null,"S",{"$nulls":6},80,null,110,null,73,{"$nulls":5},3,470,263,{"v":0.5595744680851064,"d":"56.0%"},"C"]
["Hejduk Josef","C",null,"Hejduk","Josef",null,"S",{"$nulls":10},67,{"$nulls":5},1,120,67,{"v":0.5583333333333333,"d":"55.8%"},"C"]
["Vazač Václav","C",null,"Vazač","Václav",null,"S",{"$nulls":10},67,{"$nulls":5},1,120,67,{"v":0.5583333333333333,"d":"55.8%"},"C"]
["Šottl Jaroslav","C",null,"Šottl","Jaroslav",null,"S",{"$nulls":8},111,{"$nulls":7},1,200,111,{"v":0.555,"d":"55.5%"},"C"]
["Nosek Miloš","C",null,"Nosek","Miloš",null,"S",{"$nulls":15},55,1,100,55,{"v":0.55,"d":"55.0%"},"C"]
["Masaryk Boris","C",null,"Masaryk","Boris",null,"S",{"$nulls":6},80,null,111,{"$nulls":4},83,null,null,3,500,274,{"v":0.548,"d":"54.8%"},"C"]
["Tureček Václav","C",null,"Tureček","Václav",null,"S",{"$nulls":13},82,null,null,1,150,82,{"v":0.5466666666666666,"d":"54.7%"},"C"]
["Kiriakovský Alexej","C",null,"Kiriakovský","Alexej",null,"S",{"$nulls":3},53,{"$nulls":11},56,2,200,109,{"v":0.545,"d":"54.5%"},"C"]
["Hedvik Jaromír","C",null,"Hedvik","Jaromír",null,"S",{"$nulls":3},50,62,60,87,{"$nulls":3},64,{"$nulls":4},69,6,720,392,{"v":0.5444444444444444,"d":"54.4%"},"C"]
["Kaiser Vladimír ml.","C",null,"Kaiser","Vladimír"," ml.","S",{"$nulls":10},65,{"$nulls":5},1,120,65,{"v":0.5416666666666666,"d":"54.2%"},"C"]
["Majer Milan","C",null,"Majer","Milan",null,"S",{"$nulls":10},65,{"$nulls":5},1,120,65,{"v":0.5416666666666666,"d":"54.2%"},"C"]
["Fejkl Pavel","C",null,"Fejkl","Pavel",null,"S",{"$nulls":15},54,1,100,54,{"v":0.54,"d":"54.0%"},"C"]
["Petera Adam","C",null,"Petera","Adam",null,"S",{"$nulls":15},54,1,100,54,{"v":0.54,"d":"54.0%"},"C"]
["Havlík Aleš","C",null,"Havlík","Aleš",null,"S",null,82,73,null,59,73,null,85,{"$nulls":4},91,null,81,null,7,1020,544,{"v":0.5333333333333333,"d":"53.3%"},"C"]
["Němec Jan","C",null,"Němec","Jan",null,"S",{"$nulls":12},80,{"$nulls":3},1,150,80,{"v":0.5333333333333333,"d":"53.3%"},"C"]
["Kozák Josef","C",null,"Kozák","Josef",null,"S",{"$nulls":5},78,{"$nulls":10},1,150,78,{"v":0.52,"d":"52.0%"},"C"]
["Šmatlák Martin","C",null,"Šmatlák","Martin",null,"S",{"$nulls":15},52,1,100,52,{"v":0.52,"d":"52.0%"},"C"]
["Nosek Ivo","C",null,"Nosek","Ivo",null,"S","1960-10-06",null,null,51,{"$nulls":12},1,100,51,{"v":0.51,"d":"51.0%"},"C"]
["Tuček Karel","C",null,"Tuček","Karel",null,"S",{"$nulls":15},51,1,100,51,{"v":0.51,"d":"51.0%"},"C"]
["Staněk Josef","C",null,"Staněk","Josef",null,"S","1970-03-13",{"$nulls":3},50,{"$nulls":11},1,100,50,{"v":0.5,"d":"50.0%"},"C"]
["Houska Petr","C",null,"Houska","Petr",null,"S",{"$nulls":10},59,{"$nulls":5},1,120,59,{"v":0.49166666666666664,"d":"49.2%"},"C"]
["Čumpl Zdeněk","C",null,"Čumpl","Zdeněk",null,"S",{"$nulls":15},48,1,100,48,{"v":0.48,"d":"48.0%"},"C"]
["Šindelář Jiří","C",null,"Šindelář","Jiří",null,"S",{"$nulls":13},72,null,null,1,150,72,{"v":0.48,"d":"48.0%"},"C"]
["Zavadski Kryzstof","C",null,"Zavadski","Kryzstof",null,"S",{"$nulls":6},72,{"$nulls":9},1,150,72,{"v":0.48,"d":"48.0%"},"C"]
["Kaiser Josef","C",null,"Kaiser","Josef",null,"S",{"$nulls":10},57,{"$nulls":5},1,120,57,{"v":0.475,"d":"47.5%"},"C"]
["Jeníček Jiří","C",null,"Jeníček","Jiří",null,"S",null,84,63,{"$nulls":13},2,310,147,{"v":0.47419354838709676,"d":"47.4%"},"C"]
["Hanus Marcel","C",null,"Hanus","Marcel",null,"S",{"$nulls":6},71,{"$nulls":9},1,150,71,{"v":0.47333333333333333,"d":"47.3%"},"C"]
["Smeták Milan","C",null,"Smeták","Milan",null,"S",{"$nulls":15},47,1,100,47,{"v":0.47,"d":"47.0%"},"C"]
["Žáček Jiří","C",null,"Žáček","Jiří",null,"S",{"$nulls":15},47,1,100,47,{"v":0.47,"d":"47.0%"},"C"]
["Bečvář Lukáš","C",null,"Bečvář","Lukáš",null,"S",{"$nulls":10},53,{"$nulls":5},1,120,53,{"v":0.44166666666666665,"d":"44.2%"},"C"]
["Ulrych Jiří","C",null,"Ulrych","Jiří",null,"S",{"$nulls":13},66,null,null,1,150,66,{"v":0.44,"d":"44.0%"},"C"]
["Stanke Petr","C",null,"Stanke","Petr",null,"S",{"$nulls":9},87,{"$nulls":6},1,200,87,{"v":0.435,"d":"43.5%"},"C"]
["Svoboda Petr","C",null,"Svoboda","Petr",null,"S",{"$nulls":3},43,{"$nulls":12},1,100,43,{"v":0.43,"d":"43.0%"},"C"]
["Sabin Milan","C",null,"Sabin","Milan",null,"S",{"$nulls":6},67,null,83,{"$nulls":7},2,350,150,{"v":0.42857142857142855,"d":"42.9%"},"C"]
["Boháč Vítězslav","C",null,"Boháč","Vítězslav",null,"S",{"$nulls":4},42,{"$nulls":11},{"$f":"COUNTIF(I261:W261,\">0\")","v":1},{"$f":"IF(I261,$I$4) +IF(J261,$J$4) + IF(K261,$K$4) +IF(L261,$L$4) +IF(M261,$M$4) +IF(N261,$N$4) +IF(O261,$O$4) +IF(P261,$P$4) +IF(Q261,$Q$4) +IF(R261,$R$4) +IF(S261,$S$4) +IF(T261,$T$4) +IF(U261,$U$4) +IF(V261,$V$4) +IF(W261,$W$4)","v":100},{"$f":"SUM(I261:W261)","v":42},{"$f":"IF(Y261=0,0,Z261/Y261)","v":{"v":0.42,"d":"42.0%"}},"C"]
[{"$f":"D262&\" \"&E262&F262","v":"Červinčák Libor"},{"$f":"AB262","v":"C"},null,"Červinčák","Libor",null,"S",{"$nulls":10},49,{"$nulls":5},1,120,49,{"v":0.4083333333333333,"d":"40.8%"},"C"]
["Geisler Vladimír","C",null,"Geisler","Vladimír",null,"S",{"$nulls":3},39,{"$nulls":12},1,100,39,{"v":0.39,"d":"39.0%"},"C"]
["Stejskal Petr","C",null,"Stejskal","Petr",null,"S",{"$nulls":10},49,null,65,50,59,null,4,580,223,{"v":0.38448275862068965,"d":"38.4%"},"C"]
["Novák Zdeněk","C",null,"Novák","Zdeněk",null,"S",null,67,52,{"$nulls":13},2,310,119,{"v":0.38387096774193546,"d":"38.4%"},"C"]
["Žáček Oldřich","C",null,"Žáček","Oldřich",null,"S",null,59,{"$nulls":3},60,{"$nulls":10},2,310,119,{"v":0.38387096774193546,"d":"38.4%"},"C"]
["Soukup Pavel","C",null,"Soukup","Pavel",null,"S",{"$nulls":15},38,1,100,38,{"v":0.38,"d":"38.0%"},"C"]
["Straka Tomáš","C",null,"Straka","Tomáš",null,"S",null,51,{"$nulls":4},62,{"$nulls":9},2,310,113,{"v":0.36451612903225805,"d":"36.5%"},"C"]
["Pelcman Zdeněk","C",null,"Pelcman","Zdeněk",null,"S",{"$nulls":5},51,{"$nulls":10},1,150,51,{"v":0.34,"d":"34.0%"},"C"]
["Jelínek Aleš","C",null,"Jelínek","Aleš",null,"S",{"$nulls":10},39,{"$nulls":4},35,2,220,74,{"v":0.33636363636363636,"d":"33.6%"},"C"]
["Hollman Petr","C",null,"Hollman","Petr",null,"S",{"$nulls":15},31,1,100,31,{"v":0.31,"d":"31.0%"},"C"]
["Bártl Lukáš","C",null,"Bártl","Lukáš",null,"S",{"$nulls":16},0,0,0,{"v":0,"d":"0.0%"},"C"]
["Bělohlavý Tomáš","C",null,"Bělohlavý","Tomáš",null,"S",{"$nulls":16},0,0,0,{"v":0,"d":"0.0%"},"C"]
["Bláha Milan","C",null,"Bláha","Milan",null,"S",{"$nulls":16},0,0,0,{"v":0,"d":"0.0%"},"C"]
["Blicha Jozef","C",null,"Blicha","Jozef",null,"S",{"$nulls":16},0,0,0,{"v":0,"d":"0.0%"},"C"]
["Breicha Luděk","C",null,"Breicha","Luděk",null,"S",{"$nulls":16},0,0,0,{"v":0,"d":"0.0%"},"C"]
["Burda Zdeněk","C",null,"Burda","Zdeněk",null,"S",{"$nulls":16},0,0,0,{"v":0,"d":"0.0%"},"C"]
["Dohnal Andrej","C",null,"Dohnal","Andrej",null,"S",{"$nulls":16},0,0,0,{"v":0,"d":"0.0%"},"C"]
["Dostál Jaroslav","C",null,"Dostál","Jaroslav",null,"S",{"$nulls":16},0,0,0,{"v":0,"d":"0.0%"},"C"]
["Dostál Michal","C",null,"Dostál","Michal",null,"S","1961-06-06",{"$nulls":15},0,0,0,{"v":0,"d":"0.0%"},"C"]
["Drahokoupil Jiří","C",null,"Drahokoupil","Jiří",null,"S",{"$nulls":16},0,0,0,{"v":0,"d":"0.0%"},"C"]
["Dřímal Jaromír","C",null,"Dřímal","Jaromír",null,"S","1966-04-10",{"$nulls":15},0,0,0,{"v":0,"d":"0.0%"},"C"]
["Duchoň Jakub","C",null,"Duchoň","Jakub",null,"S","1981-05-14",{"$nulls":15},0,0,0,{"v":0,"d":"0.0%"},"C"]
["Dušánek Vladimír","C",null,"Dušánek","Vladimír",null,"S","1961-09-26",{"$nulls":15},0,0,0,{"v":0,"d":"0.0%"},"C"]
["Ferkl Jan","C",null,"Ferkl","Jan",null,"S","1964-01-13",{"$nulls":15},0,0,0,{"v":0,"d":"0.0%"},"C"]
["Fiala Jan","C",null,"Fiala","Jan",null,"S",{"$nulls":16},0,0,0,{"v":0,"d":"0.0%"},"C"]
["Gerger Jan","C",null,"Gerger","Jan",null,"S",{"$nulls":16},0,0,0,{"v":0,"d":"0.0%"},"C"]
["Gežo Josef","C",null,"Gežo","Josef",null,"S",{"$nulls":16},0,0,0,{"v":0,"d":"0.0%"},"C"]
["Hejnyš Miroslav","C",null,"Hejnyš","Miroslav",null,"S",{"$nulls":16},0,0,0,{"v":0,"d":"0.0%"},"C"]
["Henzelín Václav","C",null,"Henzelín","Václav",null,"S","1971-06-17",{"$nulls":15},0,0,0,{"v":0,"d":"0.0%"},"C"]
["Hodek Oskar","C",null,"Hodek","Oskar",null,"S",{"$nulls":16},0,0,0,{"v":0,"d":"0.0%"},"C"]
["Hrouda Miroslav","C",null,"Hrouda","Miroslav",null,"S",{"$nulls":16},0,0,0,{"v":0,"d":"0.0%"},"C"]
["Joska František","C",null,"Joska","František",null,"S",{"$nulls":16},0,0,0,{"v":0,"d":"0.0%"},"C"]
["Jurek Martin","C",null,"Jurek","Martin",null,"S",{"$nulls":16},0,0,0,{"v":0,"d":"0.0%"},"C"]
["Knaizl Tomáš","C",null,"Knaizl","Tomáš",null,"S",{"$nulls":16},0,0,0,{"v":0,"d":"0.0%"},"C"]
["Kodeš Ondřej","C",null,"Kodeš","Ondřej",null,"S",{"$nulls":16},0,0,0,{"v":0,"d":"0.0%"},"C"]
["Kopečný Josef","C",null,"Kopečný","Josef",null,"S","1968-01-10",{"$nulls":15},0,0,0,{"v":0,"d":"0.0%"},"C"]
["Korman Petr","C",null,"Korman","Petr",null,"S",{"$nulls":16},0,0,0,{"v":0,"d":"0.0%"},"C"]
["Koťátko Jaroslav","C",null,"Koťátko","Jaroslav",null,"S","1970-03-13",{"$nulls":15},0,0,0,{"v":0,"d":"0.0%"},"C"]
["Kratochvíl Vladimír","C",null,"Kratochvíl","Vladimír",null,"S","1961-07-10",{"$nulls":15},0,0,0,{"v":0,"d":"0.0%"},"C"]
["Krška Jan","C",null,"Krška","Jan",null,"S","1972-05-07",{"$nulls":15},0,0,0,{"v":0,"d":"0.0%"},"C"]
["Kupka Přemysl","C",null,"Kupka","Přemysl",null,"S","1979-07-16",{"$nulls":15},0,0,0,{"v":0,"d":"0.0%"},"C"]
["Láska Robert","C",null,"Láska","Robert",null,"S",{"$nulls":16},0,0,0,{"v":0,"d":"0.0%"},"C"]
["Lokvenc Ilja","C",null,"Lokvenc","Ilja",null,"S","1962-07-01",{"$nulls":15},0,0,0,{"v":0,"d":"0.0%"},"C"]
["Luňáček Libor","C",null,"Luňáček","Libor",null,"S",{"$nulls":16},0,0,0,{"v":0,"d":"0.0%"},"C"]
["Maxa Milan","C",null,"Maxa","Milan",null,"S",{"$nulls":16},0,0,0,{"v":0,"d":"0.0%"},"C"]
["Miler Vlastimil","C",null,"Miler","Vlastimil",null,"S",{"$nulls":16},0,0,0,{"v":0,"d":"0.0%"},"C"]
["Minich Tomáš","C",null,"Minich","Tomáš",null,"S",{"$nulls":16},0,0,0,{"v":0,"d":"0.0%"},"C"]
["Novák Radek","C",null,"Novák","Radek",null,"S","1976-04-05",{"$nulls":15},0,0,0,{"v":0,"d":"0.0%"},"C"]
["Novotný Václav","C",null,"Novotný","Václav",null,"S","1967-12-13",{"$nulls":15},0,0,0,{"v":0,"d":"0.0%"},"C"]
["Otáhal František","C",null,"Otáhal","František",null,"S","1970-03-13",{"$nulls":15},0,0,0,{"v":0,"d":"0.0%"},"C"]
["Oubram Zdeněk","C",null,"Oubram","Zdeněk",null,"S",{"$nulls":16},0,0,0,{"v":0,"d":"0.0%"},"C"]
["Pavlíček Martin","C",null,"Pavlíček","Martin",null,"S",{"$nulls":16},0,0,0,{"v":0,"d":"0.0%"},"C"]
["Peluha Antonín","C",null,"Peluha","Antonín",null,"S","1964-07-17",{"$nulls":15},0,0,0,{"v":0,"d":"0.0%"},"C"]
["Peroutka Karel","C",null,"Peroutka","Karel",null,"S","1960-03-02",{"$nulls":15},0,0,0,{"v":0,"d":"0.0%"},"C"]
["Pešek Josef","C",null,"Pešek","Josef",null,"S","1958-03-23",{"$nulls":15},0,0,0,{"v":0,"d":"0.0%"},"C"]
["Petr Roman","C",null,"Petr","Roman",null,"S","1973-06-30",{"$nulls":15},0,0,0,{"v":0,"d":"0.0%"},"C"]
["Polcar Vojtěch","C",null,"Polcar","Vojtěch",null,"S","1970-03-13",{"$nulls":15},0,0,0,{"v":0,"d":"0.0%"},"C"]
["Pražák Jan","C",null,"Pražák","Jan",null,"S","1981-09-13",{"$nulls":15},0,0,0,{"v":0,"d":"0.0%"},"C"]
["Provázek Rudolf","C",null,"Provázek","Rudolf",null,"S","1960-10-05",{"$nulls":15},0,0,0,{"v":0,"d":"0.0%"},"C"]
["Rampas Václav","C",null,"Rampas","Václav",null,"S",{"$nulls":16},0,0,0,{"v":0,"d":"0.0%"},"C"]
["Rampula Pavel","C",null,"Rampula","Pavel",null,"S","1970-03-13",{"$nulls":15},0,0,0,{"v":0,"d":"0.0%"},"C"]
["Říha Josef","C",null,"Říha","Josef",null,"S",{"$nulls":16},0,0,0,{"v":0,"d":"0.0%"},"C"]
["Sedláček Jiří","C",null,"Sedláček","Jiří",null,"S",{"$nulls":16},0,0,0,{"v":0,"d":"0.0%"},"C"]
["Sedlák Martin","C",null,"Sedlák","Martin",null,"S",{"$nulls":16},{"$f":"COUNTIF(I325:W325,\">0\")","v":0},{"$f":"IF(I325,$I$4) +IF(J325,$J$4) + IF(K325,$K$4) +IF(L325,$L$4) +IF(M325,$M$4) +IF(N325,$N$4) +IF(O325,$O$4) +IF(P325,$P$4) +IF(Q325,$Q$4) +IF(R325,$R$4) +IF(S325,$S$4) +IF(T325,$T$4) +IF(U325,$U$4) +IF(V325,$V$4) +IF(W325,$W$4)","v":0},{"$f":"SUM(I325:W325)","v":0},{"$f":"IF(Y325=0,0,Z325/Y325)","v":{"v":0,"d":"0.0%"}},"C"]
[{"$f":"D326&\" \"&E326&F326","v":"Sehnal Martin"},{"$f":"AB326","v":"C"},null,"Sehnal","Martin",null,"S","1978-05-04",{"$nulls":15},0,0,0,{"v":0,"d":"0.0%"},"C"]
["Schmied Jaroslav","C",null,"Schmied","Jaroslav",null,"S","1960-10-08",{"$nulls":15},0,0,0,{"v":0,"d":"0.0%"},"C"]
["Slovák Zdeněk","C",null,"Slovák","Zdeněk",null,"S",{"$nulls":16},0,0,0,{"v":0,"d":"0.0%"},"C"]
["Smejkal Milan","C",null,"Smejkal","Milan",null,"S",{"$nulls":16},0,0,0,{"v":0,"d":"0.0%"},"C"]
["Smolka Přemysl","C",null,"Smolka","Přemysl",null,"S","1988-07-03",{"$nulls":15},0,0,0,{"v":0,"d":"0.0%"},"C"]
["Sobotka Libor","C",null,"Sobotka","Libor",null,"S",{"$nulls":16},0,0,0,{"v":0,"d":"0.0%"},"C"]
["Staněk  Tomáš","C",null,"Staněk ","Tomáš",null,"S","1979-08-23",{"$nulls":15},0,0,0,{"v":0,"d":"0.0%"},"C"]
["Stejskal Martin","C",null,"Stejskal","Martin",null,"S",{"$nulls":16},0,0,0,{"v":0,"d":"0.0%"},"C"]
["Steklý Zdeněk","C",null,"Steklý","Zdeněk",null,"S",{"$nulls":16},0,0,0,{"v":0,"d":"0.0%"},"C"]
["Střítecký Martin","C",null,"Střítecký","Martin",null,"S",{"$nulls":16},0,0,0,{"v":0,"d":"0.0%"},"C"]
["Suchý Petr","C",null,"Suchý","Petr",null,"S",{"$nulls":16},0,0,0,{"v":0,"d":"0.0%"},"C"]
["Světlík Karel","C",null,"Světlík","Karel",null,"S","1975-10-25",{"$nulls":15},0,0,0,{"v":0,"d":"0.0%"},"C"]
["Šimánek Jaroslav","C",null,"Šimánek","Jaroslav",null,"S","1958-05-08",{"$nulls":15},0,0,0,{"v":0,"d":"0.0%"},"C"]
["Škarvada Zdeněk","C",null,"Škarvada","Zdeněk",null,"S",{"$nulls":16},0,0,0,{"v":0,"d":"0.0%"},"C"]
["Šťastný Stanislav","C",null,"Šťastný","Stanislav",null,"S",{"$nulls":16},0,0,0,{"v":0,"d":"0.0%"},"C"]
["Švára Ondřej","C",null,"Švára","Ondřej",null,"S","1958-01-24",{"$nulls":15},0,0,0,{"v":0,"d":"0.0%"},"C"]
["Švec Miloslav","C",null,"Švec","Miloslav",null,"S",{"$nulls":16},0,0,0,{"v":0,"d":"0.0%"},"C"]
["Trefný Jan","C",null,"Trefný","Jan",null,"S","1981-06-03",{"$nulls":15},0,0,0,{"v":0,"d":"0.0%"},"C"]
["Trepka Jiří","C",null,"Trepka","Jiří",null,"S",{"$nulls":16},0,0,0,{"v":0,"d":"0.0%"},"C"]
["Vágner Lukáš","C",null,"Vágner","Lukáš",null,"S","1987-04-10",{"$nulls":15},0,0,0,{"v":0,"d":"0.0%"},"C"]
["Valchař Petr","C",null,"Valchař","Petr",null,"S",{"$nulls":16},0,0,0,{"v":0,"d":"0.0%"},"C"]
["Vejmalka Milan","C",null,"Vejmalka","Milan",null,"S",{"$nulls":16},0,0,0,{"v":0,"d":"0.0%"},"C"]
["Veselý František","C",null,"Veselý","František",null,"S",{"$nulls":16},0,0,0,{"v":0,"d":"0.0%"},"C"]
["Vítek Jiří","C",null,"Vítek","Jiří",null,"S",{"$nulls":16},0,0,0,{"v":0,"d":"0.0%"},"C"]
["Vlk Vladimír","C",null,"Vlk","Vladimír",null,"S",{"$nulls":16},0,0,0,{"v":0,"d":"0.0%"},"C"]
["Vokál Jan","C",null,"Vokál","Jan",null,"S","1968-01-25",{"$nulls":15},0,0,0,{"v":0,"d":"0.0%"},"C"]
["Vrátník Václav","C",null,"Vrátník","Václav",null,"S","1963-01-20",{"$nulls":15},0,0,0,{"v":0,"d":"0.0%"},"C"]
["Zamazal Radek","C",null,"Zamazal","Radek",null,"S",{"$nulls":16},0,0,0,{"v":0,"d":"0.0%"},"C"]
["Žid Milan","C",null,"Žid","Milan",null,"S",{"$nulls":16},0,0,0,{"v":0,"d":"0.0%"},"C"]
["Tomeček Jakub","C",null,"Tomeček","Jakub",null,"S","1991-05-23",{"$nulls":15},0,0,0,{"v":0,"d":"0.0%"},"C"]
["Uher Jaromír","V",null,"Uher","Jaromír",null,"V","1956-09-20",120,null,85,88,114,123,126,165,162,null,161,124,117,127,84,13,1970,{"$f":"SUM(I356:W356)","v":1596},{"v":0.8101522842639594,"d":"81.0%"},"V"]
["Buksa Jan","V",null,"Buksa","Jan",null,"V","1955-02-01",{"$nulls":3},85,null,119,null,null,156,{"$nulls":3},117,null,82,5,700,559,{"v":0.7985714285714286,"d":"79.9%"},"V"]
["Otáhal Milan","V",null,"Otáhal","Milan",null,"V","1948-03-01",null,null,83,78,{"$nulls":3},161,145,93,172,null,108,null,82,8,1170,922,{"v":0.788034188034188,"d":"78.8%"},"V"]
["Vágner Josef","V",null,"Vágner","Josef",null,"V","1954-10-25",{"$nulls":5},113,{"$nulls":9},1,150,113,{"v":0.7533333333333333,"d":"75.3%"},"V"]
["Bastl Václav","V",null,"Bastl","Václav",null,"V",{"$nulls":4},75,{"$nulls":11},1,100,75,{"v":0.75,"d":"75.0%"},"V"]
["Pražák František","V",null,"Pražák","František",null,"V","1953-01-16",{"$nulls":3},84,{"$nulls":8},103,null,null,2,250,187,{"v":0.748,"d":"74.8%"},"V"]
["Hauk Pavel","V",null,"Hauk","Pavel",null,"V","1950-01-14",{"$nulls":3},75,{"$nulls":3},148,{"$nulls":7},2,300,223,{"v":0.7433333333333333,"d":"74.3%"},"V"]
["Hnilička Milan","V",null,"Hnilička","Milan",null,"V","1950-03-20",null,null,74,81,null,109,{"$nulls":3},82,null,null,101,null,null,5,620,447,{"v":0.7209677419354839,"d":"72.1%"},"V"]
["Návrátil Bedřich","V",null,"Návrátil","Bedřich",null,"V",null,114,107,null,81,92,null,115,null,147,90,149,null,104,100,81,11,1640,1180,{"v":0.7195121951219512,"d":"72.0%"},"V"]
["Říha Milan","V",null,"Říha","Milan",null,"V","1955-10-17",{"$nulls":3},82,93,{"$nulls":4},84,{"$nulls":5},3,370,259,{"v":0.7,"d":"70.0%"},"V"]
["Hůda Jan","V",null,"Hůda","Jan",null,"V","1952-05-11",{"$nulls":8},126,null,146,110,null,110,null,4,710,492,{"v":0.6929577464788732,"d":"69.3%"},"V"]
["Pospíšil Stanislav","V",null,"Pospíšil","Stanislav",null,"V",{"$nulls":8},138,{"$nulls":7},1,200,138,{"v":0.69,"d":"69.0%"},"V"]
["Hanzlík Václav","V",null,"Hanzlík","Václav",null,"V","1952-04-30",120,94,null,76,94,null,104,{"$nulls":8},5,710,488,{"v":0.6873239436619718,"d":"68.7%"},"V"]
["Brouček Ladislav","V",null,"Brouček","Ladislav",null,"V","1948-11-06",null,null,82,{"$nulls":4},139,123,{"$nulls":3},96,null,74,5,750,514,{"v":0.6853333333333333,"d":"68.5%"},"V"]
["Streit Vlastislav","V",null,"Streit","Vlastislav",null,"V","1950-04-15",null,null,69,{"$nulls":4},134,{"$nulls":6},68,3,400,271,{"v":0.6775,"d":"67.8%"},"V"]
["Horvath  Jozef","V",null,"Horvath ","Jozef",null,"V",{"$nulls":8},135,{"$nulls":7},1,200,135,{"v":0.675,"d":"67.5%"},"V"]
["Vadlejch Josef","V",null,"Vadlejch","Josef",null,"V","1955-04-20",112,84,null,68,82,null,122,null,125,73,157,103,97,110,73,12,1790,1206,{"v":0.6737430167597765,"d":"67.4%"},"V"]
["Paur Milan","V",null,"Paur","Milan",null,"V","1955-11-01",108,94,64,66,null,null,114,null,132,69,null,110,null,109,70,10,1390,936,{"v":0.6733812949640288,"d":"67.3%"},"V"]
["Tóth Ladislav","V",null,"Tóth","Ladislav",null,"V","1949-03-10",null,94,76,66,108,94,null,147,141,null,138,93,89,109,62,12,1810,1217,{"v":0.6723756906077348,"d":"67.2%"},"V"]
["Staněk Jan","V",null,"Staněk","Jan",null,"V","1955-11-08",null,105,78,62,null,null,113,null,null,70,143,102,null,92,62,9,1230,827,{"v":0.6723577235772358,"d":"67.2%"},"V"]
["Průšek Miroslav","V",null,"Průšek","Miroslav",null,"V","1955-09-22",null,null,67,{"$nulls":12},1,100,67,{"v":0.67,"d":"67.0%"},"V"]
["Rozumek Josef","V",null,"Rozumek","Josef",null,"V","1955-01-28",{"$nulls":7},130,{"$nulls":6},65,2,300,195,{"v":0.65,"d":"65.0%"},"V"]
["Jelínek Jiří","V",null,"Jelínek","Jiří",null,"V","1952-09-23",null,null,59,75,null,88,null,137,132,{"$nulls":3},86,null,66,7,1000,643,{"v":0.643,"d":"64.3%"},"V"]
["Hrouda Jaroslav","V",null,"Hrouda","Jaroslav",null,"V","1948-02-07",null,null,73,59,{"$nulls":4},119,{"$nulls":5},68,4,500,319,{"v":0.638,"d":"63.8%"},"V"]
["Mandl Friedrich","V",null,"Mandl","Friedrich",null,"V",null,108,91,null,null,86,null,109,null,116,null,null,104,null,91,null,7,1120,705,{"v":0.6294642857142857,"d":"62.9%"},"V"]
["Kubíček Karel","V",null,"Kubíček","Karel",null,"V","1951-02-24",{"$nulls":7},125,{"$nulls":7},1,200,125,{"v":0.625,"d":"62.5%"},"V"]
["Ďurík Jaroslav","V",null,"Ďurík","Jaroslav",null,"V",{"$nulls":15},60,1,100,60,{"v":0.6,"d":"60.0%"},"V"]
["Semanský Jaromír","V",null,"Semanský","Jaromír",null,"V",{"$nulls":5},65,null,null,135,{"$nulls":4},94,null,null,3,500,294,{"v":0.588,"d":"58.8%"},"V"]
["Janda Jiří","V",null,"Janda","Jiří",null,"V","1950-01-13",null,null,65,{"$nulls":6},62,null,null,87,null,null,3,370,214,{"v":0.5783783783783784,"d":"57.8%"},"V"]
["Straka Ladislav","V",null,"Straka","Ladislav",null,"V","1950-01-08",null,null,61,{"$nulls":6},63,{"$nulls":5},2,220,124,{"v":0.5636363636363636,"d":"56.4%"},"V"]
["Moravčík Vlastimil","V",null,"Moravčík","Vlastimil",null,"V",{"$nulls":3},59,{"$nulls":11},53,2,200,112,{"v":0.56,"d":"56.0%"},"V"]
["Strnad Vladislav","V",null,"Strnad","Vladislav",null,"V",{"$nulls":3},56,{"$nulls":12},1,100,56,{"v":0.56,"d":"56.0%"},"V"]
["Havel František","V",null,"Havel","František",null,"V","1948-08-09",null,null,55,{"$nulls":12},1,100,{"$f":"SUM(I388:W388)","v":55},{"v":0.55,"d":"55.0%"},"V"]
["Řezníček Vilém","V",null,"Řezníček","Vilém",null,"V",null,67,86,67,null,77,null,84,104,99,null,null,98,82,74,56,{"$f":"COUNTIF(I389:W389,\">0\")","v":11},{"$f":"IF(I389,$I$4) +IF(J389,$J$4) + IF(K389,$K$4) +IF(L389,$L$4) +IF(M389,$M$4) +IF(N389,$N$4) +IF(O389,$O$4) +IF(P389,$P$4) +IF(Q389,$Q$4) +IF(R389,$R$4) +IF(S389,$S$4) +IF(T389,$T$4) +IF(U389,$U$4) +IF(V389,$V$4) +IF(W389,$W$4)","v":1670},894,{"$f":"IF(Y389=0,0,Z389/Y389)","v":{"v":0.5353293413173653,"d":"53.5%"}},"V"]
[{"$f":"D390&\" \"&E390&F390","v":"Smutný Jaroslav"},{"$f":"AB390","v":"V"},null,"Smutný","Jaroslav",null,"V",{"$nulls":13},78,null,null,1,150,78,{"v":0.52,"d":"52.0%"},"V"]
["Konečný Jan","V",null,"Konečný","Jan",null,"V",{"$nulls":8},103,{"$nulls":7},1,200,103,{"v":0.515,"d":"51.5%"},"V"]
["Vícha Miroslav","V",null,"Vícha","Miroslav",null,"V","1956-09-14",80,{"$nulls":14},1,160,80,{"v":0.5,"d":"50.0%"},"V"]
["Jíra Ladislav","V",null,"Jíra","Ladislav",null,"V",{"$nulls":3},49,{"$nulls":12},1,100,49,{"v":0.49,"d":"49.0%"},"V"]
["Jirotka Jiří","V",null,"Jirotka","Jiří",null,"V",{"$nulls":4},49,{"$nulls":11},1,100,49,{"v":0.49,"d":"49.0%"},"V"]
["Sivčák Miroslav","V",null,"Sivčák","Miroslav",null,"V",{"$nulls":15},44,1,100,44,{"v":0.44,"d":"44.0%"},"V"]
["Štěrba Vladimír","V",null,"Štěrba","Vladimír",null,"V",{"$nulls":3},50,null,null,59,{"$nulls":9},2,250,109,{"v":0.436,"d":"43.6%"},"V"]
["Ryšavý Miroslav","V",null,"Ryšavý","Miroslav",null,"V","1953-09-24",{"$nulls":14},40,1,100,40,{"v":0.4,"d":"40.0%"},"V"]
["Lokaj Zdeněk","V",null,"Lokaj","Zdeněk",null,"V","1956-07-21",{"$nulls":9},41,{"$nulls":5},1,120,41,{"v":0.3416666666666667,"d":"34.2%"},"V"]
["Bašta Václav","V",null,"Bašta","Václav",null,"V","1956-10-18",{"$nulls":15},0,0,0,{"v":0,"d":"0.0%"},"V"]
["Bejček Václav","V",null,"Bejček","Václav",null,"V",{"$nulls":16},0,0,0,{"v":0,"d":"0.0%"},"V"]
["Krejza Jan","V",null,"Krejza","Jan",null,"V","1955-11-10",{"$nulls":15},0,0,0,{"v":0,"d":"0.0%"},"V"]
["Kučera Josef","V",null,"Kučera","Josef",null,"V","1953-12-03",{"$nulls":15},0,0,0,{"v":0,"d":"0.0%"},"V"]
["Moravec Jaroslav","V",null,"Moravec","Jaroslav",null,"V",{"$nulls":16},0,0,0,{"v":0,"d":"0.0%"},"V"]
["Mostecký Jiří","V",null,"Mostecký","Jiří",null,"V","1956-05-06",{"$nulls":15},0,0,0,{"v":0,"d":"0.0%"},"V"]
["Mraček Jan","V",null,"Mraček","Jan",null,"V","1954-12-19",{"$nulls":15},0,0,0,{"v":0,"d":"0.0%"},"V"]
["Petr Jan","V",null,"Petr","Jan",null,"V",{"$nulls":16},0,0,0,{"v":0,"d":"0.0%"},"V"]
["Prachař Jan","V",null,"Prachař","Jan",null,"V","1952-02-05",{"$nulls":15},0,0,0,{"v":0,"d":"0.0%"},"V"]
["Půža  Václav","V",null,"Půža ","Václav",null,"V",{"$nulls":16},0,0,0,{"v":0,"d":"0.0%"},"V"]
["Rychnovský Petr","V",null,"Rychnovský","Petr",null,"V",{"$nulls":16},0,0,0,{"v":0,"d":"0.0%"},"V"]
["Stavinoha Čestmír","V",null,"Stavinoha","Čestmír",null,"V",{"$nulls":16},0,0,0,{"v":0,"d":"0.0%"},"V"]
["Svozil Stanislav","V",null,"Svozil","Stanislav",null,"V","1952-11-22",{"$nulls":15},0,0,0,{"v":0,"d":"0.0%"},"V"]
["Šimáček  Pavel","V",null,"Šimáček ","Pavel",null,"V",{"$nulls":16},0,0,0,{"v":0,"d":"0.0%"},"V"]
["Šimčík Bohumil","V",null,"Šimčík","Bohumil",null,"V","1955-11-03",{"$nulls":15},0,0,0,{"v":0,"d":"0.0%"},"V"]
["Šprinc Jindřich","V",null,"Šprinc","Jindřich",null,"V",{"$nulls":16},0,0,0,{"v":0,"d":"0.0%"},"V"]
["Vymětal Josef","V",null,"Vymětal","Josef",null,"V","1950-05-23",{"$nulls":15},0,0,0,{"v":0,"d":"0.0%"},"V"]
["Kubík Jindřich","SV",null,"Kubík","Jindřich",null,"SV","1947-03-07",null,null,77,79,{"$nulls":10},72,3,300,228,{"v":0.76,"d":"76.0%"},"SV"]
["Bicera Štěpán","SV",null,"Bicera","Štěpán",null,"SV","1946-09-17",null,null,67,69,{"$nulls":11},2,200,136,{"v":0.68,"d":"68.0%"},"SV"]
["Elšlégr Josef","SV",null,"Elšlégr","Josef",null,"SV","1938-01-29",null,null,71,{"$nulls":6},77,{"$nulls":5},2,220,148,{"v":0.6727272727272727,"d":"67.3%"},"SV"]
["Goll Jan","SV",null,"Goll","Jan",null,"SV","1943-05-07",{"$nulls":12},100,null,null,1,150,100,{"v":0.6666666666666666,"d":"66.7%"},"SV"]
["Kučera Václav","SV",null,"Kučera","Václav",null,"SV","1945-08-04",{"$nulls":3},65,{"$nulls":11},1,100,65,{"v":0.65,"d":"65.0%"},"SV"]
["Neuvirt Václav","SV",null,"Neuvirt","Václav",null,"SV","1944-07-28",108,87,67,66,83,null,109,null,125,77,152,99,94,88,66,13,1890,1221,{"v":0.6460317460317461,"d":"64.6%"},"SV"]
["Kupka Ondřej","SV",null,"Kupka","Ondřej",null,"SV","1944-09-10",{"$nulls":10},128,{"$nulls":4},1,200,128,{"v":0.64,"d":"64.0%"},"SV"]
["Jánošík Fedor","SV",null,"Jánošík","Fedor",null,"SV","1944-01-01",{"$nulls":15},0,0,0,{"v":0,"d":"0.0%"},"SV"]
["Petr František","SV",null,"Petr","František",null,"SV","1944-12-19",{"$nulls":15},0,0,0,{"v":0,"d":"0.0%"},"SV"]

{"sheet":"Data","index":28,"n_rows":3001,"n_cols":27,"rows_kept":3001,"hidden":true,"merged":[[1,2,1,3]]}
["Druhy závodů :","Počet terčů v položce","Počet střelišť celkem :",3]
["SPORTING",20,"Názvy linií / střelišť"]
["COMPAK SPORTING",25,"Linie / střeliště č. 1 :","Vysoká věž"]
["TRAP",40,"Linie / střeliště č. 2 :","Trap"]
["DOUBLE TRAP",50,"Linie / střeliště č. 3 :","Zajíc"]
["SKEET",80,"Linie / střeliště č. 4 :"]
["LOVECKÉ KOLO",null,"Linie / střeliště č. 5 :"]
[null,null,"Linie / střeliště č. 6 :"]
[null,null,"Linie / střeliště č. 7 :"]
[null,null,"Linie / střeliště č. 8 :"]
[null,null,"Linie / střeliště č. 9 :"]
[null,null,"Linie / střeliště č. 10 :"]
[null,null,"Linie / střeliště č. 11 :"]
["Počet střelců :",{"$f":"120-COUNTBLANK(Vstup!C9:C128)","v":48},"Linie / střeliště č. 12 :"]
[null,null,"Linie / střeliště č. 13 :"]
["Název závodu :","Josefovský brokový trojboj","Linie / střeliště č. 14 :"]
["Počet terčů :",60,"Linie / střeliště č. 15 :"]
["Počet terčů v položce :",20,"Linie / střeliště č. 16 :"]
["Druh závodu :","SPORTING"]
["Datum :","20.03.2022"]
{"$rows_empty":2978}
[{"$nulls":25},"Datum :",{"$f":"NOW()","v":"2022-03-20T14:51:09.560"}]
[{"$nulls":25},"Datum expirace :","2013-07-15"]
[{"$nulls":26},{"$f":"IF(AA3000<AA2999,0,1)","v":0}]

{"sheet":"PolList","index":29,"n_rows":308,"n_cols":31,"rows_kept":308,"hidden":true,"merged":[[28,1,30,1],[28,2,30,2],[28,3,30,3],[28,4,30,4],[28,5,30,5],[28,6,30,6],[28,7,30,7],[28,8,30,8],[28,9,30,9],[28,10,30,10],[28,15,30,15],[28,16,30,16],[28,17,30,17],[28,18,30,18],[28,19,30,19],[28,20,30,20],[28,23,30,23],[28,24,30,24],[28,25,30,25],[32,5,34,5],[32,6,34,6],[32,7,34,7],[32,8,34,8],[32,9,34,9],[32,10,34,10],[32,11,34,11],[32,12,34,12],[32,17,34,17],[32,18,34,18],[32,19,34,19],[32,20,34,20],[32,21,34,21],[32,22,34,22],[32,25,34,25],[36,1,38,1],[36,2,38,2],[36,3,38,3],[36,4,38,4],[36,5,38,5],[36,6,38,6],[36,7,38,7],[36,8,38,8],[36,9,38,9],[36,10,38,10],[36,11,38,11],[36,12,38,12],[36,13,38,13],[36,14,38,14],[36,19,38,19],[36,20,38,20],[36,21,38,21],[36,22,38,22],[36,23,38,23],[36,24,38,24],[36,25,38,25],[40,1,42,1],[40,2,42,2],[40,3,42,3],[40,4,42,4],[40,5,42,5],[40,6,42,6],[40,7,42,7],[40,8,42,8],[40,9,42,9],[40,10,42,10],[40,11,42,11],[40,12,42,12],[40,13,42,13],[40,14,42,14],[40,21,42,21],[40,22,42,22],[40,23,42,23],[40,24,42,24],[40,25,42,25],[44,1,46,1],[44,2,46,2],[44,3,46,3],[44,4,46,4],[44,5,46,5],[44,6,46,6],[44,7,46,7],[44,8,46,8],[44,9,46,9],[44,10,46,10],[44,11,46,11],[44,12,46,12],[44,13,46,13],[44,14,46,14],[44,15,46,15],[44,16,46,16],[44,23,46,23],[44,24,46,24],[44,25,46,25],[48,1,50,1],[48,2,50,2],[48,3,50,3],[48,4,50,4],[48,5,50,5],[48,6,50,6],[48,7,50,7],[48,8,50,8],[48,9,50,9],[48,10,50,10],[48,11,50,11],[48,12,50,12],[48,13,50,13],[48,14,50,14],[48,15,50,15],[48,16,50,16],[48,17,50,17],[48,18,50,18],[48,19,50,19],[48,20,50,20],[48,21,50,21],[48,22,50,22],[48,23,50,23],[48,24,50,24],[48,25,50,25],[131,1,131,4],[131,5,131,8],[131,9,131,12],[131,13,131,16],[131,17,131,20],[131,21,134,24],[133,1,134,1],[133,2,134,2],[133,3,134,3],[133,4,134,4],[133,5,134,5],[133,6,134,6],[133,7,134,7],[133,8,134,8],[133,9,134,9],[133,10,134,10],[133,11,134,11],[133,12,134,12],[133,13,134,13],[133,14,134,14],[133,15,134,15],[133,16,134,16],[133,17,134,17],[133,18,134,18],[133,19,134,19],[133,20,134,20],[135,1,135,4],[135,5,135,8],[135,9,135,12],[135,13,135,16],[135,17,138,20],[135,21,135,24],[137,1,138,1],[137,2,138,2],[137,3,138,3],[137,4,138,4],[137,5,138,5],[137,6,138,6],[137,7,138,7],[137,8,138,8],[137,9,138,9],[137,10,138,10],[137,11,138,11],[137,12,138,12],[137,13,138,13],[137,14,138,14],[137,15,138,15],[137,16,138,16],[137,21,138,21],[137,22,138,22],[137,23,138,23],[137,24,138,24],[139,1,139,4],[139,5,139,8],[139,9,139,12],[139,13,142,16],[139,17,139,20],[139,21,139,24],[141,1,142,1],[141,2,142,2],[141,3,142,3],[141,4,142,4],[141,5,142,5],[141,6,142,6],[141,7,142,7],[141,8,142,8],[141,9,142,9],[141,10,142,10],[141,11,142,11],[141,12,142,12],[141,17,142,17],[141,18,142,18],[141,19,142,19],[141,20,142,20],[141,21,142,21],[141,22,142,22],[141,23,142,23],[141,24,142,24],[143,1,143,4],[143,5,143,8],[143,9,146,12],[143,13,143,16],[143,17,143,20],[143,21,143,24],[145,1,146,1],[145,2,146,2],[145,3,146,3],[145,4,146,4],[145,5,146,5],[145,6,146,6],[145,7,146,7],[145,8,146,8],[145,13,146,13],[145,14,146,14],[145,15,146,15],[145,16,146,16],[145,17,146,17],[145,18,146,18],[145,19,146,19],[145,20,146,20],[145,21,146,21],[145,22,146,22],[145,23,146,23],[145,24,146,24],[147,1,147,4],[147,5,150,8],[147,9,147,12],[147,13,147,16],[147,17,147,20],[147,21,147,24],[149,1,150,1],[149,2,150,2],[149,3,150,3],[149,4,150,4],[149,9,150,9],[149,10,150,10],[149,11,150,11],[149,12,150,12],[149,13,150,13],[149,14,150,14],[149,15,150,15],[149,16,150,16],[149,17,150,17],[149,18,150,18],[149,19,150,19],[149,20,150,20],[149,21,150,21],[149,22,150,22],[149,23,150,23],[149,24,150,24],[151,1,154,4],[151,5,151,8],[151,9,151,12],[151,13,151,16],[151,17,151,20],[151,21,151,24],[153,5,154,5],[153,6,154,6],[153,7,154,7],[153,8,154,8],[153,9,154,9],[153,10,154,10],[153,11,154,11],[153,12,154,12],[153,13,154,13],[153,14,154,14],[153,15,154,15],[153,16,154,16],[153,17,154,17],[153,18,154,18],[153,19,154,19],[153,20,154,20],[153,21,154,21],[153,22,154,22],[153,23,154,23],[153,24,154,24],[157,1,157,5],[157,6,157,10],[157,11,157,15],[157,16,157,20],[157,21,157,25],[157,26,160,30],[159,1,160,1],[159,2,160,2],[159,3,160,3],[159,4,160,4],[159,5,160,5],[159,6,160,6],[159,7,160,7],[159,8,160,8],[159,9,160,9],[159,10,160,10],[159,11,160,11],[159,12,160,12],[159,13,160,13],[159,14,160,14],[159,15,160,15],[159,16,160,16],[159,17,160,17],[159,18,160,18],[159,19,160,19],[159,20,160,20],[159,21,160,21],[159,22,160,22],[159,23,160,23],[159,24,160,24],[159,25,160,25],[161,1,161,5],[161,6,161,10],[161,11,161,15],[161,16,161,20],[161,21,164,25],[161,26,161,30],[163,1,164,1],[163,2,164,2],[163,3,164,3],[163,4,164,4],[163,5,164,5],[163,6,164,6],[163,7,164,7],[163,8,164,8],[163,9,164,9],[163,10,164,10],[163,11,164,11],[163,12,164,12],[163,13,164,13],[163,14,164,14],[163,15,164,15],[163,16,164,16],[163,17,164,17],[163,18,164,18],[163,19,164,19],[163,20,164,20],[163,26,164,26],[163,27,164,27],[163,28,164,28],[163,29,164,29],[163,30,164,30],[165,1,165,5],[165,6,165,10],[165,11,165,15],[165,16,168,20],[165,21,165,25],[165,26,165,30],[167,1,168,1],[167,2,168,2],[167,3,168,3],[167,4,168,4],[167,5,168,5],[167,6,168,6],[167,7,168,7],[167,8,168,8],[167,9,168,9],[167,10,168,10],[167,11,168,11],[167,12,168,12],[167,13,168,13],[167,14,168,14],[167,15,168,15],[167,21,168,21],[167,22,168,22],[167,23,168,23],[167,24,168,24],[167,25,168,25],[167,26,168,26],[167,27,168,27],[167,28,168,28],[167,29,168,29],[167,30,168,30],[169,1,169,5],[169,6,169,10],[169,11,172,15],[169,16,169,20],[169,21,169,25],[169,26,169,30],[171,1,172,1],[171,2,172,2],[171,3,172,3],[171,4,172,4],[171,5,172,5],[171,6,172,6],[171,7,172,7],[171,8,172,8],[171,9,172,9],[171,10,172,10],[171,16,172,16],[171,17,172,17],[171,18,172,18],[171,19,172,19],[171,20,172,20],[171,21,172,21],[171,22,172,22],[171,23,172,23],[171,24,172,24],[171,25,172,25],[171,26,172,26],[171,27,172,27],[171,28,172,28],[171,29,172,29],[171,30,172,30],[173,1,173,5],[173,6,176,10],[173,11,173,15],[173,16,173,20],[173,21,173,25],[173,26,173,30],[175,1,176,1],[175,2,176,2],[175,3,176,3],[175,4,176,4],[175,5,176,5],[175,11,176,11],[175,12,176,12],[175,13,176,13],[175,14,176,14],[175,15,176,15],[175,16,176,16],[175,17,176,17],[175,18,176,18],[175,19,176,19],[175,20,176,20],[175,21,176,21],[175,22,176,22],[175,23,176,23],[175,24,176,24],[175,25,176,25],[175,26,176,26],[175,27,176,27],[175,28,176,28],[175,29,176,29],[175,30,176,30],[177,1,180,5],[177,6,177,10],[177,11,177,15],[177,16,177,20],[177,21,177,25],[177,26,177,30],[179,6,180,6],[179,7,180,7],[179,8,180,8],[179,9,180,9],[179,10,180,10],[179,11,180,11],[179,12,180,12],[179,13,180,13],[179,14,180,14],[179,15,180,15],[179,16,180,16],[179,17,180,17],[179,18,180,18],[179,19,180,19],[179,20,180,20],[179,21,180,21],[179,22,180,22],[179,23,180,23],[179,24,180,24],[179,25,180,25],[179,26,180,26],[179,27,180,27],[179,28,180,28],[179,29,180,29],[179,30,180,30],[184,1,186,1],[184,2,186,2],[184,3,186,3],[184,4,186,4],[184,5,186,5],[184,6,186,6],[184,7,186,7],[184,8,186,8],[184,9,186,9],[184,10,186,10],[184,11,186,11],[184,12,186,12],[184,13,186,13],[184,14,186,14],[184,15,186,15],[184,16,186,16],[184,17,186,17],[184,18,186,18],[184,19,186,19],[184,20,186,20],[184,21,186,21],[184,22,186,22],[184,23,186,23],[184,24,186,24],[184,25,186,25],[188,1,190,1],[188,2,190,2],[188,3,190,3],[188,4,190,4],[188,5,190,5],[188,6,190,6],[188,7,190,7],[188,8,190,8],[188,9,190,9],[188,10,190,10],[188,11,190,11],[188,12,190,12],[188,13,190,13],[188,14,190,14],[188,15,190,15],[188,16,190,16],[188,17,190,17],[188,18,190,18],[188,19,190,19],[188,20,190,20],[188,21,190,21],[188,22,190,22],[188,23,190,23],[188,24,190,24],[188,25,190,25],[192,1,194,1],[192,2,194,2],[192,3,194,3],[192,4,194,4],[192,5,194,5],[192,6,194,6],[192,7,194,7],[192,8,194,8],[192,9,194,9],[192,10,194,10],[192,11,194,11],[192,12,194,12],[192,13,194,13],[192,14,194,14],[192,15,194,15],[192,16,194,16],[192,17,194,17],[192,18,194,18],[192,19,194,19],[192,20,194,20],[192,21,194,21],[192,22,194,22],[192,23,194,23],[192,24,194,24],[192,25,194,25],[196,1,198,1],[196,2,198,2],[196,3,198,3],[196,4,198,4],[196,5,198,5],[196,6,198,6],[196,7,198,7],[196,8,198,8],[196,9,198,9],[196,10,198,10],[196,11,198,11],[196,12,198,12],[196,13,198,13],[196,14,198,14],[196,15,198,15],[196,16,198,16],[196,17,198,17],[196,18,198,18],[196,19,198,19],[196,20,198,20],[196,21,198,21],[196,22,198,22],[196,23,198,23],[196,24,198,24],[196,25,198,25],[200,1,202,1],[200,2,202,2],[200,3,202,3],[200,4,202,4],[200,5,202,5],[200,6,202,6],[200,7,202,7],[200,8,202,8],[200,9,202,9],[200,10,202,10],[200,11,202,11],[200,12,202,12],[200,13,202,13],[200,14,202,14],[200,15,202,15],[200,16,202,16],[200,17,202,17],[200,18,202,18],[200,19,202,19],[200,20,202,20],[200,21,202,21],[200,22,202,22],[200,23,202,23],[200,24,202,24],[200,25,202,25],[204,1,206,1],[204,2,206,2],[204,3,206,3],[204,4,206,4],[204,5,206,5],[204,6,206,6],[204,7,206,7],[204,8,206,8],[204,9,206,9],[204,10,206,10],[204,11,206,11],[204,12,206,12],[204,13,206,13],[204,14,206,14],[204,15,206,15],[204,16,206,16],[204,17,206,17],[204,18,206,18],[204,19,206,19],[204,20,206,20],[204,21,206,21],[204,22,206,22],[204,23,206,23],[204,24,206,24],[204,25,206,25],[210,1,212,1],[210,2,212,2],[210,3,212,3],[210,4,212,4],[210,5,212,5],[210,6,212,6],[210,7,212,7],[210,8,212,8],[210,9,212,9],[210,10,212,10],[210,11,212,11],[210,12,212,12],[210,13,212,13],[210,14,212,14],[210,15,212,15],[210,16,212,16],[210,17,212,17],[210,18,212,18],[210,19,212,19],[210,20,212,20],[214,1,216,1],[214,2,216,2],[214,3,216,3],[214,4,216,4],[214,5,216,5],[214,6,216,6],[214,7,216,7],[214,8,216,8],[214,9,216,9],[214,10,216,10],[214,11,216,11],[214,12,216,12],[214,13,216,13],[214,14,216,14],[214,15,216,15],[214,16,216,16],[214,17,216,17],[214,18,216,18],[214,19,216,19],[214,20,216,20],[218,1,220,1],[218,2,220,2],[218,3,220,3],[218,4,220,4],[218,5,220,5],[218,6,220,6],[218,7,220,7],[218,8,220,8],[218,9,220,9],[218,10,220,10],[218,11,220,11],[218,12,220,12],[218,13,220,13],[218,14,220,14],[218,15,220,15],[218,16,220,16],[218,17,220,17],[218,18,220,18],[218,19,220,19],[218,20,220,20],[222,1,224,1],[222,2,224,2],[222,3,224,3],[222,4,224,4],[222,5,224,5],[222,6,224,6],[222,7,224,7],[222,8,224,8],[222,9,224,9],[222,10,224,10],[222,11,224,11],[222,12,224,12],[222,13,224,13],[222,14,224,14],[222,15,224,15],[222,16,224,16],[222,17,224,17],[222,18,224,18],[222,19,224,19],[222,20,224,20],[226,1,228,1],[226,2,228,2],[226,3,228,3],[226,4,228,4],[226,5,228,5],[226,6,228,6],[226,7,228,7],[226,8,228,8],[226,9,228,9],[226,10,228,10],[226,11,228,11],[226,12,228,12],[226,13,228,13],[226,14,228,14],[226,15,228,15],[226,16,228,16],[226,17,228,17],[226,18,228,18],[226,19,228,19],[226,20,228,20],[230,1,232,1],[230,2,232,2],[230,3,232,3],[230,4,232,4],[230,5,232,5],[230,6,232,6],[230,7,232,7],[230,8,232,8],[230,9,232,9],[230,10,232,10],[230,11,232,11],[230,12,232,12],[230,13,232,13],[230,14,232,14],[230,15,232,15],[230,16,232,16],[230,17,232,17],[230,18,232,18],[230,19,232,19],[230,20,232,20],[262,1,264,1],[262,2,264,2],[262,3,264,3],[262,4,264,4],[262,5,264,5],[262,6,264,6],[262,7,264,7],[262,8,264,8],[262,9,264,9],[262,10,264,10],[262,11,264,11],[262,12,264,12],[262,13,264,13],[262,14,264,14],[262,15,264,15],[262,16,264,16],[262,17,264,17],[262,18,264,18],[262,19,264,19],[262,20,264,20],[266,1,268,1],[266,2,268,2],[266,3,268,3],[266,4,268,4],[266,5,268,5],[266,6,268,6],[266,7,268,7],[266,8,268,8],[266,9,268,9],[266,10,268,10],[266,11,268,11],[266,12,268,12],[266,13,268,13],[266,14,268,14],[266,15,268,15],[266,16,268,16],[266,17,268,17],[266,18,268,18],[266,19,268,19],[266,20,268,20],[270,1,272,1],[270,2,272,2],[270,3,272,3],[270,4,272,4],[270,5,272,5],[270,6,272,6],[270,7,272,7],[270,8,272,8],[270,9,272,9],[270,10,272,10],[270,11,272,11],[270,12,272,12],[270,13,272,13],[270,14,272,14],[270,15,272,15],[270,16,272,16],[270,17,272,17],[270,18,272,18],[270,19,272,19],[270,20,272,20],[274,1,276,1],[274,2,276,2],[274,3,276,3],[274,4,276,4],[274,5,276,5],[274,6,276,6],[274,7,276,7],[274,8,276,8],[274,9,276,9],[274,10,276,10],[274,11,276,11],[274,12,276,12],[274,13,276,13],[274,14,276,14],[274,15,276,15],[274,16,276,16],[274,17,276,17],[274,18,276,18],[274,19,276,19],[274,20,276,20],[278,1,280,1],[278,2,280,2],[278,3,280,3],[278,4,280,4],[278,5,280,5],[278,6,280,6],[278,7,280,7],[278,8,280,8],[278,9,280,9],[278,10,280,10],[278,11,280,11],[278,12,280,12],[278,13,280,13],[278,14,280,14],[278,15,280,15],[278,16,280,16],[278,17,280,17],[278,18,280,18],[278,19,280,19],[278,20,280,20],[282,1,284,1],[282,2,284,2],[282,3,284,3],[282,4,284,4],[282,5,284,5],[282,6,284,6],[282,7,284,7],[282,8,284,8],[282,9,284,9],[282,10,284,10],[282,11,284,11],[282,12,284,12],[282,13,284,13],[282,14,284,14],[282,15,284,15],[282,16,284,16],[282,17,284,17],[282,18,284,18],[282,19,284,19],[282,20,284,20],[288,1,290,1],[288,2,290,2],[288,3,290,3],[288,4,290,4],[288,5,290,5],[288,6,290,6],[288,7,290,7],[288,8,290,8],[288,9,290,9],[288,10,290,10],[288,11,290,11],[288,12,290,12],[288,13,290,13],[288,14,290,14],[288,15,290,15],[288,16,290,16],[288,17,290,17],[288,18,290,18],[288,19,290,19],[288,20,290,20],[288,21,290,21],[288,22,290,22],[288,23,290,23],[288,24,290,24],[288,25,290,25],[292,1,294,1],[292,2,294,2],[292,3,294,3],[292,4,294,4],[292,5,294,5],[292,6,294,6],[292,7,294,7],[292,8,294,8],[292,9,294,9],[292,10,294,10],[292,11,294,11],[292,12,294,12],[292,13,294,13],[292,14,294,14],[292,15,294,15],[292,16,294,16],[292,17,294,17],[292,18,294,18],[292,19,294,19],[292,20,294,20],[292,21,294,21],[292,22,294,22],[292,23,294,23],[292,24,294,24],[292,25,294,25],[296,1,298,1],[296,2,298,2],[296,3,298,3],[296,4,298,4],[296,5,298,5],[296,6,298,6],[296,7,298,7],[296,8,298,8],[296,9,298,9],[296,10,298,10],[296,11,298,11],[296,12,298,12],[296,13,298,13],[296,14,298,14],[296,15,298,15],[296,16,298,16],[296,17,298,17],[296,18,298,18],[296,19,298,19],[296,20,298,20],[296,21,298,21],[296,22,298,22],[296,23,298,23],[296,24,298,24],[296,25,298,25],[300,1,302,1],[300,2,302,2],[300,3,302,3],[300,4,302,4],[300,5,302,5],[300,6,302,6],[300,7,302,7],[300,8,302,8],[300,9,302,9],[300,10,302,10],[300,11,302,11],[300,12,302,12],[300,13,302,13],[300,14,302,14],[300,15,302,15],[300,16,302,16],[300,17,302,17],[300,18,302,18],[300,19,302,19],[300,20,302,20],[300,21,302,21],[300,22,302,22],[300,23,302,23],[300,24,302,24],[300,25,302,25],[304,1,306,1],[304,2,306,2],[304,3,306,3],[304,4,306,4],[304,5,306,5],[304,6,306,6],[304,7,306,7],[304,8,306,8],[304,9,306,9],[304,10,306,10],[304,11,306,11],[304,12,306,12],[304,13,306,13],[304,14,306,14],[304,15,306,15],[304,16,306,16],[304,17,306,17],[304,18,306,18],[304,19,306,19],[304,20,306,20],[304,21,306,21],[304,22,306,22],[304,23,306,23],[304,24,306,24],[304,25,306,25],[308,1,310,1],[308,2,310,2],[308,3,310,3],[308,4,310,4],[308,5,310,5],[308,6,310,6],[308,7,310,7],[308,8,310,8],[308,9,310,9],[308,10,310,10],[308,11,310,11],[308,12,310,12],[308,13,310,13],[308,14,310,14],[308,15,310,15],[308,16,310,16],[308,17,310,17],[308,18,310,18],[308,19,310,19],[308,20,310,20],[308,21,310,21],[308,22,310,22],[308,23,310,23],[308,24,310,24],[308,25,310,25]],"merged_total":1152,"flags":["merged_cut"]}
[null,"Sporting - položka 20 terčů"]
[null,20,19,18,17,16,15,14,13,12,11,10,9,8,7,6,5,4,3,2,1]
[]
[]
[]
[null,20,19,18,17,16,15,14,13,12,11,10,9,8,7,6,5,4,3,2,1]
[]
[]
[]
[null,20,19,18,17,16,15,14,13,12,11,10,9,8,7,6,5,4,3,2,1]
[]
[]
[]
[null,20,19,18,17,16,15,14,13,12,11,10,9,8,7,6,5,4,3,2,1]
[]
[]
[]
[null,20,19,18,17,16,15,14,13,12,11,10,9,8,7,6,5,4,3,2,1]
[]
[]
[]
[null,20,19,18,17,16,15,14,13,12,11,10,9,8,7,6,5,4,3,2,1]
[]
[]
[]
[]
[null,"Sporting - položka 25 terčů"]
[null,25,24,23,22,21,20,19,18,17,16,15,14,13,12,11,10,9,8,7,6,5,4,3,2,1]
[]
[]
[]
[null,25,24,23,22,21,20,19,18,17,16,15,14,13,12,11,10,9,8,7,6,5,4,3,2,1]
[]
[]
[]
[null,25,24,23,22,21,20,19,18,17,16,15,14,13,12,11,10,9,8,7,6,5,4,3,2,1]
[]
[]
[]
[null,25,24,23,22,21,20,19,18,17,16,15,14,13,12,11,10,9,8,7,6,5,4,3,2,1]
[]
[]
[]
[null,25,24,23,22,21,20,19,18,17,16,15,14,13,12,11,10,9,8,7,6,5,4,3,2,1]
[]
[]
[]
[null,25,24,23,22,21,20,19,18,17,16,15,14,13,12,11,10,9,8,7,6,5,4,3,2,1]
[]
[]
[]
[]
[null,"Sporting - položka 40 terčů"]
[null,40,39,38,37,36,35,34,33,32,31,30,29,28,27,26,25,24,23,22,21]
[]
[null,20,19,18,17,16,15,14,13,12,11,10,9,8,7,6,5,4,3,2,1]
[]
[null,40,39,38,37,36,35,34,33,32,31,30,29,28,27,26,25,24,23,22,21]
[]
[null,20,19,18,17,16,15,14,13,12,11,10,9,8,7,6,5,4,3,2,1]
[]
[null,40,39,38,37,36,35,34,33,32,31,30,29,28,27,26,25,24,23,22,21]
[]
[null,20,19,18,17,16,15,14,13,12,11,10,9,8,7,6,5,4,3,2,1]
[]
[null,40,39,38,37,36,35,34,33,32,31,30,29,28,27,26,25,24,23,22,21]
[]
[null,20,19,18,17,16,15,14,13,12,11,10,9,8,7,6,5,4,3,2,1]
[]
[null,40,39,38,37,36,35,34,33,32,31,30,29,28,27,26,25,24,23,22,21]
[]
[null,20,19,18,17,16,15,14,13,12,11,10,9,8,7,6,5,4,3,2,1]
[]
[null,40,39,38,37,36,35,34,33,32,31,30,29,28,27,26,25,24,23,22,21]
[]
[null,20,19,18,17,16,15,14,13,12,11,10,9,8,7,6,5,4,3,2,1]
[]
[]
[null,"Sporting - položka 50 terčů"]
[null,50,49,48,47,46,45,44,43,42,41,40,39,38,37,36,35,34,33,32,31,30,29,28,27,26]
[]
[null,25,24,23,22,21,20,19,18,17,16,15,14,13,12,11,10,9,8,7,6,5,4,3,2,1]
[]
[null,50,49,48,47,46,45,44,43,42,41,40,39,38,37,36,35,34,33,32,31,30,29,28,27,26]
[]
[null,25,24,23,22,21,20,19,18,17,16,15,14,13,12,11,10,9,8,7,6,5,4,3,2,1]
[]
[null,50,49,48,47,46,45,44,43,42,41,40,39,38,37,36,35,34,33,32,31,30,29,28,27,26]
[]
[null,25,24,23,22,21,20,19,18,17,16,15,14,13,12,11,10,9,8,7,6,5,4,3,2,1]
[]
[null,50,49,48,47,46,45,44,43,42,41,40,39,38,37,36,35,34,33,32,31,30,29,28,27,26]
[]
[null,25,24,23,22,21,20,19,18,17,16,15,14,13,12,11,10,9,8,7,6,5,4,3,2,1]
[]
[null,50,49,48,47,46,45,44,43,42,41,40,39,38,37,36,35,34,33,32,31,30,29,28,27,26]
[]
[null,25,24,23,22,21,20,19,18,17,16,15,14,13,12,11,10,9,8,7,6,5,4,3,2,1]
[]
[null,50,49,48,47,46,45,44,43,42,41,40,39,38,37,36,35,34,33,32,31,30,29,28,27,26]
[]
[null,25,24,23,22,21,20,19,18,17,16,15,14,13,12,11,10,9,8,7,6,5,4,3,2,1]
[]
[]
[null,"Sporting - položka 80 terčů"]
[null,80,79,78,77,76,75,74,73,72,71,70,69,68,67,66,65,64,63,62,61]
[null,60,59,58,57,56,55,54,53,52,51,50,49,48,47,46,45,44,43,42,41]
[null,40,39,38,37,36,35,34,33,32,31,30,29,28,27,26,25,24,23,22,21]
[null,20,19,18,17,16,15,14,13,12,11,10,9,8,7,6,5,4,3,2,1]
[null,80,79,78,77,76,75,74,73,72,71,70,69,68,67,66,65,64,63,62,61]
[null,60,59,58,57,56,55,54,53,52,51,50,49,48,47,46,45,44,43,42,41]
[null,40,39,38,37,36,35,34,33,32,31,30,29,28,27,26,25,24,23,22,21]
[null,20,19,18,17,16,15,14,13,12,11,10,9,8,7,6,5,4,3,2,1]
[null,80,79,78,77,76,75,74,73,72,71,70,69,68,67,66,65,64,63,62,61]
[null,60,59,58,57,56,55,54,53,52,51,50,49,48,47,46,45,44,43,42,41]
[null,40,39,38,37,36,35,34,33,32,31,30,29,28,27,26,25,24,23,22,21]
[null,20,19,18,17,16,15,14,13,12,11,10,9,8,7,6,5,4,3,2,1]
[null,80,79,78,77,76,75,74,73,72,71,70,69,68,67,66,65,64,63,62,61]
[null,60,59,58,57,56,55,54,53,52,51,50,49,48,47,46,45,44,43,42,41]
[null,40,39,38,37,36,35,34,33,32,31,30,29,28,27,26,25,24,23,22,21]
[null,20,19,18,17,16,15,14,13,12,11,10,9,8,7,6,5,4,3,2,1]
[null,80,79,78,77,76,75,74,73,72,71,70,69,68,67,66,65,64,63,62,61]
[null,60,59,58,57,56,55,54,53,52,51,50,49,48,47,46,45,44,43,42,41]
[null,40,39,38,37,36,35,34,33,32,31,30,29,28,27,26,25,24,23,22,21]
[null,20,19,18,17,16,15,14,13,12,11,10,9,8,7,6,5,4,3,2,1]
[null,80,79,78,77,76,75,74,73,72,71,70,69,68,67,66,65,64,63,62,61]
[null,60,59,58,57,56,55,54,53,52,51,50,49,48,47,46,45,44,43,42,41]
[null,40,39,38,37,36,35,34,33,32,31,30,29,28,27,26,25,24,23,22,21]
[null,20,19,18,17,16,15,14,13,12,11,10,9,8,7,6,5,4,3,2,1]
[]
[null,"Compak Sporting - položka 20 terčů"]
[null,"Stanoviště 1",{"$nulls":3},"Stanoviště 2",{"$nulls":3},"Stanoviště 3",{"$nulls":3},"Stanoviště 4",{"$nulls":3},"Stanoviště 5"]
[null,1,2,3,4,5,6,7,8,9,10,11,12,13,14,15,16,17,18,19,20]
[]
[]
[null,"Stanoviště 2",{"$nulls":3},"Stanoviště 3",{"$nulls":3},"Stanoviště 4",{"$nulls":3},"Stanoviště 5",{"$nulls":7},"Stanoviště 1"]
[null,1,2,3,4,5,6,7,8,9,10,11,12,13,14,15,16,{"$nulls":4},17,18,19,20]
[]
[]
[null,"Stanoviště 3",{"$nulls":3},"Stanoviště 4",{"$nulls":3},"Stanoviště 5",{"$nulls":7},"Stanoviště 1",{"$nulls":3},"Stanoviště 2"]
[null,1,2,3,4,5,6,7,8,9,10,11,12,{"$nulls":4},13,14,15,16,17,18,19,20]
[]
[]
[null,"Stanoviště 4",{"$nulls":3},"Stanoviště 5",{"$nulls":7},"Stanoviště 1",{"$nulls":3},"Stanoviště 2",{"$nulls":3},"Stanoviště 3"]
[null,1,2,3,4,5,6,7,8,{"$nulls":4},9,10,11,12,13,14,15,16,17,18,19,20]
[]
[]
[null,"Stanoviště 5",{"$nulls":7},"Stanoviště 1",{"$nulls":3},"Stanoviště 2",{"$nulls":3},"Stanoviště 3",{"$nulls":3},"Stanoviště 4"]
[null,1,2,3,4,{"$nulls":4},5,6,7,8,9,10,11,12,13,14,15,16,17,18,19,20]
[]
[]
[{"$nulls":5},"Stanoviště 1",{"$nulls":3},"Stanoviště 2",{"$nulls":3},"Stanoviště 3",{"$nulls":3},"Stanoviště 4",{"$nulls":3},"Stanoviště 5"]
[{"$nulls":5},1,2,3,4,5,6,7,8,9,10,11,12,13,14,15,16,17,18,19,20]
[]
[]
[]
[null,"Compak Sporting - položka 25 terčů"]
[null,"Stanoviště 1",{"$nulls":4},"Stanoviště 2",{"$nulls":4},"Stanoviště 3",{"$nulls":4},"Stanoviště 4",{"$nulls":4},"Stanoviště 5"]
[null,1,2,3,4,5,6,7,8,9,10,11,12,13,14,15,16,17,18,19,20,21,22,23,24,25]
[]
[]
[null,"Stanoviště 2",{"$nulls":4},"Stanoviště 3",{"$nulls":4},"Stanoviště 4",{"$nulls":4},"Stanoviště 5",{"$nulls":9},"Stanoviště 1"]
[null,1,2,3,4,5,6,7,8,9,10,11,12,13,14,15,16,17,18,19,20,{"$nulls":5},21,22,23,24,25]
[]
[]
[null,"Stanoviště 3",{"$nulls":4},"Stanoviště 4",{"$nulls":4},"Stanoviště 5",{"$nulls":9},"Stanoviště 1",{"$nulls":4},"Stanoviště 2"]
[null,1,2,3,4,5,6,7,8,9,10,11,12,13,14,15,{"$nulls":5},16,17,18,19,20,21,22,23,24,25]
[]
[]
[null,"Stanoviště 4",{"$nulls":4},"Stanoviště 5",{"$nulls":9},"Stanoviště 1",{"$nulls":4},"Stanoviště 2",{"$nulls":4},"Stanoviště 3"]
[null,1,2,3,4,5,6,7,8,9,10,{"$nulls":5},11,12,13,14,15,16,17,18,19,20,21,22,23,24,25]
[]
[]
[null,"Stanoviště 5",{"$nulls":9},"Stanoviště 1",{"$nulls":4},"Stanoviště 2",{"$nulls":4},"Stanoviště 3",{"$nulls":4},"Stanoviště 4"]
[null,1,2,3,4,5,{"$nulls":5},6,7,8,9,10,11,12,13,14,15,16,17,18,19,20,21,22,23,24,25]
[]
[]
[{"$nulls":6},"Stanoviště 1",{"$nulls":4},"Stanoviště 2",{"$nulls":4},"Stanoviště 3",{"$nulls":4},"Stanoviště 4",{"$nulls":4},"Stanoviště 5"]
[{"$nulls":6},1,2,3,4,5,6,7,8,9,10,11,12,13,14,15,16,17,18,19,20,21,22,23,24,25]
[]
[]
[]
[null,"Trap - položka 25 terčů"]
[null,1,2,3,4,5,6,7,8,9,10,11,12,13,14,15,16,17,18,19,20,21,22,23,24,25]
[]
[]
[]
[null,1,2,3,4,5,6,7,8,9,10,11,12,13,14,15,16,17,18,19,20,21,22,23,24,25]
[]
[]
[]
[null,1,2,3,4,5,6,7,8,9,10,11,12,13,14,15,16,17,18,19,20,21,22,23,24,25]
[]
[]
[]
[null,1,2,3,4,5,6,7,8,9,10,11,12,13,14,15,16,17,18,19,20,21,22,23,24,25]
[]
[]
[]
[null,1,2,3,4,5,6,7,8,9,10,11,12,13,14,15,16,17,18,19,20,21,22,23,24,25]
[]
[]
[]
[null,1,2,3,4,5,6,7,8,9,10,11,12,13,14,15,16,17,18,19,20,21,22,23,24,25]
[]
[]
[]
[]
[null,"Trap - položka 20 terčů"]
[null,1,2,3,4,5,6,7,8,9,10,11,12,13,14,15,16,17,18,19,20]
[]
[]
[]
[null,1,2,3,4,5,6,7,8,9,10,11,12,13,14,15,16,17,18,19,20]
[]
[]
[]
[null,1,2,3,4,5,6,7,8,9,10,11,12,13,14,15,16,17,18,19,20]
[]
[]
[]
[null,1,2,3,4,5,6,7,8,9,10,11,12,13,14,15,16,17,18,19,20]
[]
[]
[]
[null,1,2,3,4,5,6,7,8,9,10,11,12,13,14,15,16,17,18,19,20]
[]
[]
[]
[null,1,2,3,4,5,6,7,8,9,10,11,12,13,14,15,16,17,18,19,20]
[]
[]
[]
[]
[null,"Double Trap - položka 50 terčů"]
[null,1,3,5,7,9,11,13,15,17,19,21,23,25,27,29,31,33,35,37,39,41,43,45,47,49]
[]
[null,2,4,6,8,10,12,14,16,18,20,22,24,26,28,30,32,34,36,38,40,42,44,46,48,50]
[]
[null,1,3,5,7,9,11,13,15,17,19,21,23,25,27,29,31,33,35,37,39,41,43,45,47,49]
[]
[null,2,4,6,8,10,12,14,16,18,20,22,24,26,28,30,32,34,36,38,40,42,44,46,48,50]
[]
[null,1,3,5,7,9,11,13,15,17,19,21,23,25,27,29,31,33,35,37,39,41,43,45,47,49]
[]
[null,2,4,6,8,10,12,14,16,18,20,22,24,26,28,30,32,34,36,38,40,42,44,46,48,50]
[]
[null,1,3,5,7,9,11,13,15,17,19,21,23,25,27,29,31,33,35,37,39,41,43,45,47,49]
[]
[null,2,4,6,8,10,12,14,16,18,20,22,24,26,28,30,32,34,36,38,40,42,44,46,48,50]
[]
[null,1,3,5,7,9,11,13,15,17,19,21,23,25,27,29,31,33,35,37,39,41,43,45,47,49]
[]
[null,2,4,6,8,10,12,14,16,18,20,22,24,26,28,30,32,34,36,38,40,42,44,46,48,50]
[]
[null,1,3,5,7,9,11,13,15,17,19,21,23,25,27,29,31,33,35,37,39,41,43,45,47,49]
[]
[null,2,4,6,8,10,12,14,16,18,20,22,24,26,28,30,32,34,36,38,40,42,44,46,48,50]
[]
[]
[null,"Lovecké kolo - položka 20 terčů"]
[null,1,2,3,4,5,6,7,8,9,10,11,12,13,14,15,16,17,18,19,20]
[]
[]
[]
[null,1,2,3,4,5,6,7,8,9,10,11,12,13,14,15,16,17,18,19,20]
[]
[]
[]
[null,1,2,3,4,5,6,7,8,9,10,11,12,13,14,15,16,17,18,19,20]
[]
[]
[]
[null,1,2,3,4,5,6,7,8,9,10,11,12,13,14,15,16,17,18,19,20]
[]
[]
[]
[null,1,2,3,4,5,6,7,8,9,10,11,12,13,14,15,16,17,18,19,20]
[]
[]
[]
[null,1,2,3,4,5,6,7,8,9,10,11,12,13,14,15,16,17,18,19,20]
[]
[]
[]
[]
[null,"Skeet - položka 25 terčů"]
[null,1,2,3,4,5,6,7,8,9,10,11,12,13,14,15,16,17,18,19,20,21,22,23,24,25]
[]
[]
[]
[null,1,2,3,4,5,6,7,8,9,10,11,12,13,14,15,16,17,18,19,20,21,22,23,24,25]
[]
[]
[]
[null,1,2,3,4,5,6,7,8,9,10,11,12,13,14,15,16,17,18,19,20,21,22,23,24,25]
[]
[]
[]
[null,1,2,3,4,5,6,7,8,9,10,11,12,13,14,15,16,17,18,19,20,21,22,23,24,25]
[]
[]
[]
[null,1,2,3,4,5,6,7,8,9,10,11,12,13,14,15,16,17,18,19,20,21,22,23,24,25]
[]
[]
[]
[null,1,2,3,4,5,6,7,8,9,10,11,12,13,14,15,16,17,18,19,20,21,22,23,24,25]

{"sheet":"List1","index":30,"n_rows":0,"n_cols":0,"rows_kept":0,"hidden":true}